{"text_format":"1","workbook":"xlsx","n_sheets":22,"sheets":["Plan1","TD","PaM","GTvM","GDaM","GJaM","PvAAe","GDvA","GJvA","GTvA","GCA","GCA_TvA","GCA_DvA","GCA_JvA","PCAAe","PaMAe","GTvMAe","GDaMAe","GJaMAe","TA","Dados","DadosTD"],"not_rendered":{"charts":66,"images":23,"macros":1,"external_links":0,"defined_names":24,"comments":0,"pivot_tables":1},"unopened":[],"bounds":{"document_bytes":16777216,"sheet_cells":100000,"rows_first":2000,"rows_last":500,"rows_between":2000,"halvings":0,"cell_chars":16384,"cell_head_chars":4096},"cells_cut":0,"cells_raw":0,"read":"whole","date_system":"1900"}

{"sheet":"Plan1","index":0,"n_rows":8,"n_cols":2,"rows_kept":8,"cut":false,"hidden":false,"merged":[[5,1,5,9],[7,1,7,9]]}
[]
[]
[]
[]
[]
[null,"Se for apresentado um Aviso de Segurança dizendo que  \"As macros foram desabilitadas.\" :\n  Clique em Opções e a seguir clicar na opção Habilitar este conteúdo."]
[]
[null,"Para melhor visualização deste Painel Dashboards, em qualquer Tabela ou Gráfico, pode-se utilizar o recurso de:\nPressionar a tecla Ctrl + Roda de Rolagem do mouse (Botão Scroll), ajustando para cima ou para baixo."]
{"$rows_left_out":1}
{"sheet":"TD","index":1,"n_rows":49,"n_cols":12,"rows_kept":49,"cut":false,"hidden":true,"merged":[[48,1,48,11],[5,6,6,11],[7,6,7,11],[11,6,11,7],[11,11,11,12],[46,1,46,6],[26,6,26,12],[28,6,28,8],[28,9,28,11],[43,6,43,12],[44,6,44,12],[45,6,45,12],[9,6,10,12]]}
[null,"Ano",2019]
[null,"Seção Judiciária","SJRJ"]
[null,"Base","(Tudo)"]
[]
[null,null,"Valores"]
[null," Tipo de Juízo e Mês"," Distribuídos"," Julgados"," Remetidos TRF/TR"," Tramitação Real","Mapa Geral Judicial do 1º Grau"]
[null,"Varas",104257,106054,48766,7081472]
[null,"Janeiro",5667,5869,2455,588642,"Orientações para a utilização da \"Tabela Dinâmica\"."]
{"$rows_left_out":42}
{"sheet":"PaM","index":2,"n_rows":65,"n_cols":20,"rows_kept":65,"cut":false,"hidden":true,"merged":[[3,7,4,7],[62,1,62,10],[64,1,64,12],[13,1,15,1],[17,1,19,1],[3,8,4,8],[10,11,13,12],[14,11,21,12],[21,1,23,1],[3,9,4,9],[3,10,4,10],[5,1,7,1],[9,1,11,1],[3,3,4,3],[3,4,4,4],[3,5,4,5],[3,6,4,6],[25,1,27,1],[29,1,31,1],[53,1,55,1],[57,1,59,1],[33,1,35,1],[37,1,39,1],[41,1,43,1],[45,1,47,1],[49,1,51,1]]}
[]
[null,"Ano",null,"Seção Judiciária",null,null,{"$f":"TA!$I$37","v":"      Mapa Geral Judicial do 1º Grau (Eproc)"},null,null,null,null,null,null,null,null,null,null,null,null,"SpA"]
[]
[null,null,null,"Distribuídos","Acum.\nMensal","Julgados","Acum.\nMensal","Remetidos ao TRF/TR","Acum.\nMensal","Tramitação \"Real\"","% Variação Mensal da\nTramitação \"Real\""]
[null,"Mês","Tipo de Juízo"]
[null,"Dezembro","Varas",{"$f":"IF(TA!$C$17=3,SUMIF(Dados!$B$2:$L$1081,TA!$A$20&PaM!$C6&PaM!$B$6,Dados!$I$2:$I$1081),VLOOKUP(TA!$D$20&$C6&$B$6,Dados!$A$2:$L$1081,9,0))","v":620},null,{"$f":"IF(TA!$C$17=3,SUMIF(Dados!$B$2:$L$1081,TA!$A$20&PaM!$C6&PaM!$B$6,Dados!$J$2:$J$1081),VLOOKUP(TA!$D$20&$C6&$B$6,Dados!$A$2:$L$1081,10,0))","v":5333},null,{"$f":"IF(TA!$C$17=3,SUMIF(Dados!$B$2:$L$1081,TA!$A$20&PaM!$C6&PaM!$B$6,Dados!$K$2:$K$1081),VLOOKUP(TA!$D$20&$C6&$B$6,Dados!$A$2:$L$1081,11,0))","v":1127},null,{"$f":"IF(TA!$A$18=2020,TA!$C$45,TA!$F$18)","v":530063},"already implemented"]
[null,null,"Juizados",{"$f":"IF(TA!$C$17=3,SUMIF(Dados!$B$2:$L$1081,TA!$A$20&PaM!$C7&PaM!$B$6,Dados!$I$2:$I$1081),VLOOKUP(TA!$D$20&$C7&$B$6,Dados!$A$2:$L$1081,9,0))","v":2},null,{"$f":"IF(TA!$C$17=3,SUMIF(Dados!$B$2:$L$1081,TA!$A$20&PaM!$C7&PaM!$B$6,Dados!$J$2:$J$1081),VLOOKUP(TA!$D$20&$C7&$B$6,Dados!$A$2:$L$1081,10,0))","v":2556},null,{"$f":"IF(TA!$C$17=3,SUMIF(Dados!$B$2:$L$1081,TA!$A$20&PaM!$C7&PaM!$B$6,Dados!$K$2:$K$1081),VLOOKUP(TA!$D$20&$C7&$B$6,Dados!$A$2:$L$1081,11,0))","v":580},null,{"$f":"IF(TA!$A$18=2020,TA!$C$46,TA!$F$19)","v":36713},"when"]
[null,null,"Turmas Recursais",{"$f":"IF(TA!$C$17=3,SUMIF(Dados!$B$2:$L$1081,TA!$A$20&PaM!$C8&PaM!$B$6,Dados!$I$2:$I$1081),VLOOKUP(TA!$D$20&$C8&$B$6,Dados!$A$2:$L$1081,9,0))","v":70},null,{"$f":"IF(TA!$C$17=3,SUMIF(Dados!$B$2:$L$1081,TA!$A$20&PaM!$C8&PaM!$B$6,Dados!$J$2:$J$1081),VLOOKUP(TA!$D$20&$C8&$B$6,Dados!$A$2:$L$1081,10,0))","v":1991},null,{"$f":"IF(TA!$C$17=3,SUMIF(Dados!$B$2:$L$1081,TA!$A$20&PaM!$C8&PaM!$B$6,Dados!$K$2:$K$1081),VLOOKUP(TA!$D$20&$C8&$B$6,Dados!$A$2:$L$1081,11,0))","v":0},null,{"$f":"IF(TA!$A$18=2020,TA!$C$47,TA!$F$20)","v":50962},"2020"]
{"$rows_left_out":58}
{"sheet":"GTvM","index":3,"n_rows":1,"n_cols":24,"rows_kept":1,"cut":false,"hidden":true,"merged":[[0,0,0,6],[0,10,0,11],[0,14,0,15],[26,1,49,7],[26,9,49,15],[1,1,24,7],[1,9,24,15]]}
["TRAMITAÇÃO de Processos na Seção Judiciária:  ",null,null,null,null,null,null,null,null,null,"no Ano de:  ",null,null,null,null,null,null,null,null,null,null,null,null,"SpA"]

{"sheet":"GDaM","index":4,"n_rows":1,"n_cols":24,"rows_kept":1,"cut":false,"hidden":true,"merged":[[0,0,0,6],[0,10,0,11],[0,14,0,15],[26,1,49,7],[26,9,49,15],[1,1,24,7],[1,9,24,15]]}
["Total de Processos DISTRIBUÍDOS na Seção Judiciária:  ",null,null,null,null,null,null,null,null,null,"no Ano de:  ",null,null,null,null,null,null,null,null,null,null,null,null,"SpA"]

{"sheet":"GJaM","index":5,"n_rows":1,"n_cols":24,"rows_kept":1,"cut":false,"hidden":true,"merged":[[0,0,0,6],[0,10,0,11],[0,14,0,15],[26,1,49,7],[26,9,49,15],[1,1,24,7],[1,9,24,15]]}
["Total de Processos JULGADOS na Seção Judiciária:  ",null,null,null,null,null,null,null,null,null,"no Ano de:  ",null,null,null,null,null,null,null,null,null,null,null,null,"SpA"]

{"sheet":"PvAAe","index":6,"n_rows":73,"n_cols":34,"rows_kept":73,"cut":false,"hidden":true,"merged":[[72,1,72,20],[57,1,59,1],[61,1,63,1],[65,1,67,1],[5,1,7,1],[17,1,19,1],[53,1,55,1],[29,1,31,1],[41,1,43,1],[45,1,47,1],[49,1,51,1],[9,1,11,1],[13,1,15,1],[21,1,23,1],[25,1,27,1],[33,1,35,1],[3,22,3,27],[37,1,39,1],[1,3,1,4],[3,3,3,8],[3,10,3,15],[3,17,3,20]]}
[]
[null,null,null,"Seção Judiciária",null,null,null,null,"Mapa ACUMULADO do 1º Grau (2006 a 2017 Apolo)  (2018 e 2019 Apolo e \"Eproc\")"]
[]
[null,null,null,"Distribuídos",null,null,null,null,null,null,"Julgados",null,null,null,null,null,null,"Remetidos ao TRF/TR",null,null,null,null,"Tramitação \"Real\""]
[null,"Mês","Tipo de Juízo","Apolo","% Var","Eproc","% Var","TOTAL","% Var",null,"Apolo","% Var","Eproc","% Var","TOTAL","% Var",null,"Apolo","Eproc","TOTAL","% Var",null,"Apolo","% Variação","Eproc","% Variação","TOTAL","% Variação"]
[null,2005,"Varas",{"$f":"IF(TA!$C$17=3,SUMIF(Dados!$D$2:$L$1081,$B$6&$C6,Dados!I$2:I$1081),SUMIF(Dados!$C$2:$L$1081,$B$6&TA!$C$18&$C6,Dados!I$2:I$1081))","v":103539},null,null,null,null,null,null,{"$f":"IF(TA!$C$17=3,SUMIF(Dados!$D$2:$L$1081,$B$6&$C6,Dados!J$2:J$1081),SUMIF(Dados!$C$2:$L$1081,$B$6&TA!$C$18&$C6,Dados!J$2:J$1081))","v":61312},null,null,null,null,null,null,{"$f":"IF(TA!$C$17=3,SUMIF(Dados!$D$2:$L$1081,$B$6&$C6,Dados!K$2:K$1081),SUMIF(Dados!$C$2:$L$1081,$B$6&TA!$C$18&$C6,Dados!K$2:K$1081))","v":20345},null,null,null,null,{"$f":"IF(TA!$C$17=3,SUMIF(Dados!$B$2:$L$1081,$B$6&$C6&TA!$F$17,Dados!L$2:L$1081),VLOOKUP($B$6&TA!$C$18&$C6&TA!$F$17,Dados!$A$2:$L$1081,12,0))","v":611472}]
[null,null,"Juizados",{"$f":"IF(TA!$C$17=3,SUMIF(Dados!$D$2:$L$1081,$B$6&$C7,Dados!I$2:I$1081),SUMIF(Dados!$C$2:$L$1081,$B$6&TA!$C$18&$C7,Dados!I$2:I$1081))","v":179418},null,null,null,null,null,null,{"$f":"IF(TA!$C$17=3,SUMIF(Dados!$D$2:$L$1081,$B$6&$C7,Dados!J$2:J$1081),SUMIF(Dados!$C$2:$L$1081,$B$6&TA!$C$18&$C7,Dados!J$2:J$1081))","v":139210},null,null,null,null,null,null,{"$f":"IF(TA!$C$17=3,SUMIF(Dados!$D$2:$L$1081,$B$6&$C7,Dados!K$2:K$1081),SUMIF(Dados!$C$2:$L$1081,$B$6&TA!$C$18&$C7,Dados!K$2:K$1081))","v":26485},null,null,null,null,{"$f":"IF(TA!$C$17=3,SUMIF(Dados!$B$2:$L$1081,$B$6&$C7&TA!$F$17,Dados!L$2:L$1081),VLOOKUP($B$6&TA!$C$18&$C7&TA!$F$17,Dados!$A$2:$L$1081,12,0))","v":195008}]
[null,null,"Turmas Recursais",{"$f":"IF(TA!$C$17=3,SUMIF(Dados!$D$2:$L$1081,$B$6&$C8,Dados!I$2:I$1081),SUMIF(Dados!$C$2:$L$1081,$B$6&TA!$C$18&$C8,Dados!I$2:I$1081))","v":25874},null,null,null,null,null,null,{"$f":"IF(TA!$C$17=3,SUMIF(Dados!$D$2:$L$1081,$B$6&$C8,Dados!J$2:J$1081),SUMIF(Dados!$C$2:$L$1081,$B$6&TA!$C$18&$C8,Dados!J$2:J$1081))","v":3699},null,null,null,null,null,null,{"$f":"IF(TA!$C$17=3,SUMIF(Dados!$D$2:$L$1081,$B$6&$C8,Dados!K$2:K$1081),SUMIF(Dados!$C$2:$L$1081,$B$6&TA!$C$18&$C8,Dados!K$2:K$1081))","v":0},null,null,null,null,{"$f":"IF(TA!$C$17=3,SUMIF(Dados!$B$2:$L$1081,$B$6&$C8&TA!$F$17,Dados!L$2:L$1081),VLOOKUP($B$6&TA!$C$18&$C8&TA!$F$17,Dados!$A$2:$L$1081,12,0))","v":16499}]
{"$rows_left_out":66}
{"sheet":"GDvA","index":7,"n_rows":1,"n_cols":1,"rows_kept":1,"cut":false,"hidden":true,"merged":[[0,0,0,11],[26,9,49,15],[26,1,49,7],[1,1,24,7],[1,9,24,15]]}
["Total de Processos DISTRIBUÍDOS nos Anos 2006 a 2019 da Seção Judiciária:  "]

{"sheet":"GJvA","index":8,"n_rows":1,"n_cols":1,"rows_kept":1,"cut":false,"hidden":true,"merged":[[0,0,0,11],[26,1,49,7],[26,9,49,15],[1,1,24,7],[1,9,24,15]]}
["Total de Processos JULGADOS nos Anos 2006 a 2019 da Seção Judiciária:  "]

{"sheet":"GTvA","index":9,"n_rows":1,"n_cols":1,"rows_kept":1,"cut":false,"hidden":true,"merged":[[0,0,0,11],[26,1,49,7],[26,9,49,15],[1,1,24,7],[1,9,24,15]]}
["TRAMITAÇÃO de Processos em DEZEMBRO nos Anos 2006 a 2019 da Seção Judiciária:  "]

{"sheet":"GCA","index":10,"n_rows":1,"n_cols":1,"rows_kept":1,"cut":false,"hidden":true,"merged":[[0,0,0,11],[26,1,49,7],[26,9,49,15],[1,1,24,15]]}
["COMPARATIVO de Processos dos Anos 2006 a 2019 da Seção Judiciária:  "]

{"sheet":"GCA_TvA","index":11,"n_rows":1,"n_cols":1,"rows_kept":1,"cut":false,"hidden":true,"merged":[[0,0,0,11],[1,1,49,15]]}
["COMPARATIVO de Processos dos Anos 2006 a 2019 da Seção Judiciária:  "]

{"sheet":"GCA_DvA","index":12,"n_rows":1,"n_cols":1,"rows_kept":1,"cut":false,"hidden":true,"merged":[[0,0,0,11],[1,1,49,15]]}
["COMPARATIVO de Processos dos Anos 2006 a 2019 da Seção Judiciária:  "]

{"sheet":"GCA_JvA","index":13,"n_rows":1,"n_cols":1,"rows_kept":1,"cut":false,"hidden":true,"merged":[[0,0,0,11],[1,1,49,15]]}
["COMPARATIVO de Processos dos Anos 2006 a 2019 da Seção Judiciária:  "]

{"sheet":"PCAAe","index":14,"n_rows":63,"n_cols":42,"rows_kept":63,"cut":false,"hidden":true,"merged":[[62,1,62,20],[60,1,60,20],[21,1,22,1],[21,2,21,5],[21,7,21,10],[21,12,21,15],[21,17,21,20],[41,1,42,1],[41,2,41,5],[41,7,41,10],[41,12,41,15],[41,17,41,20],[1,1,2,1],[1,2,1,5],[1,7,1,10],[1,12,1,15],[0,1,0,18],[1,17,1,20]]}
[null,"Mapa Geral CONSOLIDADO do 1º Grau (2006 a 2017 Apolo)  (2018 e 2019 Apolo e \"Eproc\")",null,null,null,null,null,null,null,null,null,null,null,null,null,null,null,null,null,null,null,null,null,3,4,5,6,null,8,9,10,11,null,13,14,15,16,null,18,19,20,21]
[null,"SJRJ","VARAS",null,null,null,null,"JUIZADOS",null,null,null,null,"TURMAS RECURSAIS",null,null,null,null,"CONSOLIDADO SJRJ",null,null,null,null,null,"V",null,null,null,null,"J",null,null,null,null,"T",null,null,null,null,"C"]
[null,null,"Distrib","Julg","Remeti","TRAM",null,"Distrib","Julg","Remeti","TRAM",null,"Distrib","Julg","Remeti","TRAM",null,"Distrib","Julg","Remeti","TRAM",null,null,"D","J","R","T",null,"D","J","R","T",null,"D","J","R","T",null,"D","J","R","T"]
[null,2006,127713,70566,22501,642234,null,187586,201622,32844,143456,null,32582,27176,null,20495,null,{"$f":"C4+H4+M4","v":347881},{"$f":"D4+I4+N4","v":299364},{"$f":"E4+J4","v":55345},{"$f":"F4+K4+P4","v":806185},null,null,"S","S","S","S",null,"S","S","S","S",null,"S","S","S","S",null,"S","S","S","S"]
[null,2007,134929,72817,24587,672198,null,199569,150066,27989,171510,null,29581,39847,null,15098,null,{"$f":"C5+H5+M5","v":364079},262730,{"$f":"E5+J5","v":52576},{"$f":"F5+K5+P5","v":858806},null,null,"S","S","S","S",null,"S","S","S","S",null,"S","S","S","S",null,"S","S","S","S"]
[null,2008,107561,72582,24210,677417,null,137696,133912,50857,143213,null,52023,54089,null,45288,null,297280,260583,75067,865918,null,null,"S","S","S","S",null,"S","S","S","S",null,"S","S","S","S",null,"S","S","S","S"]
[null,2009,123306,91016,30673,685069,null,139409,117736,46039,154408,null,47148,47914,null,58182,null,309863,256666,76712,897659,null,null,"S","S","S","S",null,"S","S","S","S",null,"S","S","S","S",null,"S","S","S","S"]
[null,2010,104040,101885,35165,666379,null,116275,105828,39439,163916,null,38635,44105,null,43631,null,258950,251818,74604,873926,null,null,"S","S","S","S",null,"S","S","S","S",null,"S","S","S","S",null,"S","S","S","S"]
{"$rows_left_out":56}
{"sheet":"PaMAe","index":15,"n_rows":61,"n_cols":28,"rows_kept":61,"cut":false,"hidden":true,"merged":[[60,1,60,20],[49,1,51,1],[53,1,55,1],[3,3,3,8],[29,1,31,1],[33,1,35,1],[37,1,39,1],[41,1,43,1],[45,1,47,1],[1,3,1,4],[3,10,3,15],[3,22,3,27],[3,17,3,20],[25,1,27,1],[5,1,7,1],[9,1,11,1],[13,1,15,1],[17,1,19,1],[21,1,23,1]]}
[]
[null,"Ano",null,"Seção Judiciária",null,null,null,null,null,null,"     Mapa Geral Judicial do 1º Grau (Apolo e \"Eproc\")"]
[]
[null,null,null,"1ª Distribuição",null,null,null,null,null,null,"Julgados",null,null,null,null,null,null,"Remetidos ao TRF/TR",null,null,null,null,"Tramitação \"Real\""]
[null,"Mês","Tipo de Juízo","Apolo","Acum","Eproc","Acum","TOTAL","Acum",null,"Apolo","Acum","Eproc","Acum","TOTAL","Acum",null,"Apolo","Eproc","TOTAL","Acum",null,"Apolo","% Variação","Eproc","% Variação","TOTAL","% Variação"]
[null,"Dezembro","Varas",{"$f":"IF(TA!$C$17=3,SUMIF(Dados!$B$2:$L$217,TA!$A$42&PaMAe!$C6&PaMAe!$B$6,Dados!$I$2:$I$217),VLOOKUP(TA!$D$42&$C6&$B$6,Dados!$A$2:$L$217,9,0))","v":620},null,{"$f":"IF(TA!$C$17=3,SUMIF(Dados!$B$2:$P$217,TA!$A$42&PaMAe!$C6&PaMAe!$B$6,Dados!$M$2:$M$217),VLOOKUP(TA!$D$42&$C6&$B$6,Dados!$A$2:$P$217,13,0))","v":9097},null,{"$f":"IF(D6=0,\"\",D6+F6)","v":9717},null,null,{"$f":"IF(TA!$C$17=3,SUMIF(Dados!$B$2:$L$217,TA!$A$42&PaMAe!$C6&PaMAe!$B$6,Dados!$J$2:$J$217),VLOOKUP(TA!$D$42&$C6&$B$6,Dados!$A$2:$L$217,10,0))","v":5333},null,{"$f":"IF(TA!$C$17=3,SUMIF(Dados!$B$2:$P$217, TA!$A$42&PaMAe!$C6&PaMAe!$B$6,Dados!$N$2:$N$217), VLOOKUP(TA!$D$42&$C6&$B$6,Dados!$A$2:$P$217,14,0))","v":840},null,{"$f":"IF(K6=0,\"\",K6+M6)","v":6173},null,null,{"$f":"IF(TA!$C$17=3,SUMIF(Dados!$B$2:$L$217,TA!$A$42&PaMAe!$C6&PaMAe!$B$6,Dados!$K$2:$K$217),VLOOKUP(TA!$D$42&$C6&$B$6,Dados!$A$2:$L$217,11,0))","v":1127},{"$f":"IF(TA!$C$17=3,SUMIF(Dados!$B$2:$P$217, TA!$A$42&PaMAe!$C6&PaMAe!$B$6,Dados!$O$2:$O$217), VLOOKUP(TA!$D$42&$C6&$B$6,Dados!$A$2:$P$217,15,0))","v":157},{"$f":"IF(AND(R6=0,S6=0),\"\",R6+S6)","v":1284},null,null,{"$f":"IF(TA!$C$17=3,SUMIF(Dados!$B$2:$L$217,TA!$A$42&PaMAe!$C6&PaMAe!$B$6,Dados!$L$2:$L$217),VLOOKUP(TA!$D$42&$C6&$B$6,Dados!$A$2:$L$217,12,0))","v":530063},{"$f":"IF(W6=0,\"\",(W6/TA!$G$40)-1)","v":-5.1314221078366473E-2},{"$f":"IF(TA!$C$17=3,SUMIF(Dados!$B$2:$P$217, TA!$A$42&PaMAe!$C6&PaMAe!$B$6,Dados!$P$2:$P$217), VLOOKUP(TA!$D$42&$C6&$B$6,Dados!$A$2:$P$217,16,0))","v":61696},{"$f":"IF(Y6=0,\"\",(Y6/TA!$G$46)-1)","v":1.0944427470550293},{"$f":"IF(AND(W6=0,Y6=0),\"\",W6+Y6)","v":591759}]
[null,null,"Juizados",{"$f":"IF(TA!$C$17=3,SUMIF(Dados!$B$2:$L$217,TA!$A$42&PaMAe!$C7&PaMAe!$B$6,Dados!$I$2:$I$217),VLOOKUP(TA!$D$42&$C7&$B$6,Dados!$A$2:$L$217,9,0))","v":2},null,{"$f":"IF(TA!$C$17=3,SUMIF(Dados!$B$2:$P$217,TA!$A$42&PaMAe!$C7&PaMAe!$B$6,Dados!$M$2:$M$217),VLOOKUP(TA!$D$42&$C7&$B$6,Dados!$A$2:$P$217,13,0))","v":8372},null,8374,null,null,{"$f":"IF(TA!$C$17=3,SUMIF(Dados!$B$2:$L$217,TA!$A$42&PaMAe!$C7&PaMAe!$B$6,Dados!$J$2:$J$217),VLOOKUP(TA!$D$42&$C7&$B$6,Dados!$A$2:$L$217,10,0))","v":2556},null,{"$f":"IF(TA!$C$17=3,SUMIF(Dados!$B$2:$P$217, TA!$A$42&PaMAe!$C7&PaMAe!$B$6,Dados!$N$2:$N$217), VLOOKUP(TA!$D$42&$C7&$B$6,Dados!$A$2:$P$217,14,0))","v":5169},null,{"$f":"IF(K7=0,\"\",K7+M7)","v":7725},null,null,{"$f":"IF(TA!$C$17=3,SUMIF(Dados!$B$2:$L$217,TA!$A$42&PaMAe!$C7&PaMAe!$B$6,Dados!$K$2:$K$217),VLOOKUP(TA!$D$42&$C7&$B$6,Dados!$A$2:$L$217,11,0))","v":580},{"$f":"IF(TA!$C$17=3,SUMIF(Dados!$B$2:$P$217, TA!$A$42&PaMAe!$C7&PaMAe!$B$6,Dados!$O$2:$O$217), VLOOKUP(TA!$D$42&$C7&$B$6,Dados!$A$2:$P$217,15,0))","v":1389},{"$f":"IF(AND(R7=0,S7=0),\"\",R7+S7)","v":1969},null,null,{"$f":"IF(TA!$C$17=3,SUMIF(Dados!$B$2:$L$217,TA!$A$42&PaMAe!$C7&PaMAe!$B$6,Dados!$L$2:$L$217),VLOOKUP(TA!$D$42&$C7&$B$6,Dados!$A$2:$L$217,12,0))","v":36713},{"$f":"IF(W7=0,\"\",(W7/TA!$G$41)-1)","v":-0.11811193850588519},{"$f":"IF(TA!$C$17=3,SUMIF(Dados!$B$2:$P$217, TA!$A$42&PaMAe!$C7&PaMAe!$B$6,Dados!$P$2:$P$217), VLOOKUP(TA!$D$42&$C7&$B$6,Dados!$A$2:$P$217,16,0))","v":80327},{"$f":"IF(Y7=0,\"\",(Y7/TA!$G$47)-1)","v":9.237903554818172E-2},{"$f":"IF(AND(W7=0,Y7=0),\"\",W7+Y7)","v":117040}]
[null,null,"Turmas Recursais",{"$f":"IF(TA!$C$17=3,SUMIF(Dados!$B$2:$L$217,TA!$A$42&PaMAe!$C8&PaMAe!$B$6,Dados!$I$2:$I$217),VLOOKUP(TA!$D$42&$C8&$B$6,Dados!$A$2:$L$217,9,0))","v":70},null,{"$f":"IF(TA!$C$17=3,SUMIF(Dados!$B$2:$P$217,TA!$A$42&PaMAe!$C8&PaMAe!$B$6,Dados!$M$2:$M$217),VLOOKUP(TA!$D$42&$C8&$B$6,Dados!$A$2:$P$217,13,0))","v":1424},null,1494,null,null,{"$f":"IF(TA!$C$17=3,SUMIF(Dados!$B$2:$L$217,TA!$A$42&PaMAe!$C8&PaMAe!$B$6,Dados!$J$2:$J$217),VLOOKUP(TA!$D$42&$C8&$B$6,Dados!$A$2:$L$217,10,0))","v":1991},null,{"$f":"IF(TA!$C$17=3,SUMIF(Dados!$B$2:$P$217, TA!$A$42&PaMAe!$C8&PaMAe!$B$6,Dados!$N$2:$N$217), VLOOKUP(TA!$D$42&$C8&$B$6,Dados!$A$2:$P$217,14,0))","v":456},null,2447,null,null,{"$f":"IF(TA!$C$17=3,SUMIF(Dados!$B$2:$L$217,TA!$A$42&PaMAe!$C8&PaMAe!$B$6,Dados!$K$2:$K$217),VLOOKUP(TA!$D$42&$C8&$B$6,Dados!$A$2:$L$217,11,0))","v":0},{"$f":"IF(TA!$C$17=3,SUMIF(Dados!$B$2:$P$217, TA!$A$42&PaMAe!$C8&PaMAe!$B$6,Dados!$O$2:$O$217), VLOOKUP(TA!$D$42&$C8&$B$6,Dados!$A$2:$P$217,15,0))","v":0},{"$f":"IF(AND(R8=0,S8=0),\"\",R8+S8)","v":""},null,null,{"$f":"IF(TA!$C$17=3,SUMIF(Dados!$B$2:$L$217,TA!$A$42&PaMAe!$C8&PaMAe!$B$6,Dados!$L$2:$L$217),VLOOKUP(TA!$D$42&$C8&$B$6,Dados!$A$2:$L$217,12,0))","v":50962},{"$f":"IF(W8=0,\"\",(W8/TA!$G$42)-1)","v":-4.3110894137969868E-2},{"$f":"IF(TA!$C$17=3,SUMIF(Dados!$B$2:$P$217, TA!$A$42&PaMAe!$C8&PaMAe!$B$6,Dados!$P$2:$P$217), VLOOKUP(TA!$D$42&$C8&$B$6,Dados!$A$2:$P$217,16,0))","v":5497},{"$f":"IF(Y8=0,\"\",(Y8/TA!$G$48)-1)","v":0.29371616851023763},{"$f":"IF(AND(W8=0,Y8=0),\"\",W8+Y8)","v":56459}]
{"$rows_left_out":54}
{"sheet":"GTvMAe","index":16,"n_rows":1,"n_cols":11,"rows_kept":1,"cut":false,"hidden":true,"merged":[[0,0,0,6],[0,10,0,11],[0,14,0,15],[2,1,12,5],[2,7,12,11],[2,13,12,17],[38,1,48,5],[38,7,48,11],[38,13,48,17],[14,1,24,5],[14,7,24,11],[14,13,24,17],[26,1,36,5],[26,7,36,11],[26,13,36,17]]}
["TRAMITAÇÃO de Processos na Seção Judiciária:  ",null,null,null,null,null,null,null,null,null,"no Ano de:  "]

{"sheet":"GDaMAe","index":17,"n_rows":1,"n_cols":11,"rows_kept":1,"cut":false,"hidden":true,"merged":[[0,0,0,6],[0,10,0,11],[0,14,0,15],[2,1,12,5],[2,7,12,11],[2,13,12,17],[38,1,48,5],[38,7,48,11],[38,13,48,17],[14,1,24,5],[14,7,24,11],[14,13,24,17],[26,1,36,5],[26,7,36,11],[26,13,36,17]]}
["Total de Processos DISTRIBUÍDOS na Seção Judiciária:  ",null,null,null,null,null,null,null,null,null,"no Ano de:  "]

{"sheet":"GJaMAe","index":18,"n_rows":1,"n_cols":11,"rows_kept":1,"cut":false,"hidden":true,"merged":[[38,13,48,17],[0,0,0,6],[0,10,0,11],[0,14,0,15],[2,1,12,5],[2,7,12,11],[2,13,12,17],[14,1,24,5],[14,7,24,11],[14,13,24,17],[26,1,36,5],[26,7,36,11],[26,13,36,17],[38,1,48,5],[38,7,48,11]]}
["Total de Processos JULGADOS na Seção Judiciária:  ",null,null,null,null,null,null,null,null,null,"no Ano de:  "]

{"sheet":"TA","index":19,"n_rows":94,"n_cols":13,"rows_kept":94,"cut":false,"hidden":true,"merged":[[15,9,15,10],[0,6,0,7],[15,5,15,6],[15,7,15,8],[42,1,42,2]]}
["Anos","AnosAe","Meses","Sites","Localidades","Meses Abrev","IPC Anos",null,null,null,null,null,1]
[2006,2018,"Janeiro","SJRJ","Varas","Jan","Mês Public","Ano Public",null,null,null,null,{"$f":"M1+1","v":2}]
[2007,2019,"Fevereiro","SJES","Juizados","Fev",12,2019,null,null,null,null,{"$f":"M2+1","v":3}]
[2008,null,"Março","SJRJ e SJES","Turmas Recursais","Mar","nu","TD",null,null,null,null,4]
[2009,null,"Abril",null,null,"Abr",null,null,null,null,null,null,5]
[2010,null,"Maio",null,null,"Mai",null,null,null,null,null,null,6]
[2011,null,"Junho",null,null,"Jun","A",null,null,"e",null,null,7]
[2012,null,"Julho",null,null,"Jul","TA!$A$17","TA!$C$17",null,"TA!$A$39",null,null,8]
{"$rows_left_out":87}
{"sheet":"Dados","index":20,"n_rows":1094,"n_cols":72,"rows_kept":1094,"cut":false,"hidden":true,"merged":[[0,52,0,55],[0,56,0,59],[0,21,0,24],[0,17,0,19],[0,25,0,28],[0,48,0,50]]}
["ColAux1","ColAux2","ColAux3","ColAux4","Ano","Seção Judiciária","Tipo de Juízo","Mês","Dist","Julg","Remetidos TRF/TR","Tram R","Dist_E","Julg_E","Remetidos TRF/TR_E","Tram R_E",null,"J A ",null,null,null,"S A",null,null,null,"Conf A",null,null,null,null,"1#D","1#J","1#R","1#T","2#J","3#D","3#J","3#R","3#T","4#J","5#J","6#J","7#J","8#J","9#J","10#J","11#J",null,"J e",null,null,null,"S e",null,null,null,"Conf e",null,null,null,null,"1#J","2#J","3#J","4#J","5#J","6#J","7#J","8#J","9#J","10#J","11#J"]
[{"$f":"E2&F2&G2&H2","v":"2019SJESVarasJaneiro"},{"$f":"E2&G2&H2","v":"2019VarasJaneiro"},{"$f":"E2&F2&G2","v":"2019SJESVaras"},{"$f":"E2&G2","v":"2019Varas"},2019,"SJES","Varas","Janeiro",188,631,144,93508,1347,285,354,33235]
["2019SJESJuizadosJaneiro","2019JuizadosJaneiro","2019SJESJuizados","2019Juizados",2019,"SJES","Juizados","Janeiro",0,630,104,10002,1623,1252,88,21795]
["2019SJESTurmas RecursaisJaneiro","2019Turmas RecursaisJaneiro","2019SJESTurmas Recursais","2019Turmas Recursais",2019,"SJES","Turmas Recursais","Janeiro",103,822,0,13487,286,190,0,1458]
["2019SJESVarasFevereiro","2019VarasFevereiro","2019SJESVaras","2019Varas",2019,"SJES","Varas","Fevereiro",189,840,231,90396,1506,634,529,36336]
["2019SJESJuizadosFevereiro","2019JuizadosFevereiro","2019SJESJuizados","2019Juizados",2019,"SJES","Juizados","Fevereiro",1,459,210,9128,2115,1773,231,22358]
["2019SJESTurmas RecursaisFevereiro","2019Turmas RecursaisFevereiro","2019SJESTurmas Recursais","2019Turmas Recursais",2019,"SJES","Turmas Recursais","Fevereiro",206,1593,0,12990,536,155,0,1931]
["2019SJESVarasMarço","2019VarasMarço","2019SJESVaras","2019Varas",2019,"SJES","Varas","Março",435,749,169,88137,1383,627,451,38713]
{"$rows_left_out":1087}
{"sheet":"DadosTD","index":21,"n_rows":1153,"n_cols":9,"rows_kept":1153,"cut":false,"hidden":true,"merged":[]}
["Ano","Seção Judiciária","Base","Tipo de Juízo","Mês","Dist","Julg","Remetidos TRF/TR","Tram R"]
[2019,"SJES","Apolo","Varas","Janeiro",188,631,144,93508]
[2019,"SJES","Apolo","Juizados","Janeiro",0,630,104,10002]
[2019,"SJES","Apolo","Turmas Recursais","Janeiro",103,822,0,13487]
[2019,"SJES","Apolo","Varas","Fevereiro",189,840,231,90396]
[2019,"SJES","Apolo","Juizados","Fevereiro",1,459,210,9128]
[2019,"SJES","Apolo","Turmas Recursais","Fevereiro",206,1593,0,12990]
[2019,"SJES","Apolo","Varas","Março",435,749,169,88137]
{"$rows_left_out":1145}