{"text_format":"1","workbook":"xlsx","n_sheets":22,"sheets":["Plan1","TD","PaM","GTvM","GDaM","GJaM","PvAAe","GDvA","GJvA","GTvA","GCA","GCA_TvA","GCA_DvA","GCA_JvA","PCAAe","PaMAe","GTvMAe","GDaMAe","GJaMAe","TA","Dados","DadosTD"],"not_rendered":{"charts":66,"images":23,"macros":1,"external_links":0,"defined_names":24,"comments":0,"pivot_tables":1},"unopened":[],"bounds":{"document_bytes":16777216,"sheet_cells":100000,"rows_first":2000,"rows_last":500,"rows_between":2000,"halvings":0,"cell_chars":16384,"cell_head_chars":4096},"cells_cut":0,"cells_raw":0,"read":"whole","date_system":"1900"}

{"sheet":"Plan1","index":0,"n_rows":8,"n_cols":2,"rows_kept":8,"cut":false,"hidden":false,"merged":[[5,1,5,9],[7,1,7,9]]}
[]
[]
[]
[]
[]
[null,"Se for apresentado um Aviso de Segurança dizendo que  \"As macros foram desabilitadas.\" :\n  Clique em Opções e a seguir clicar na opção Habilitar este conteúdo."]
[]
[null,"Para melhor visualização deste Painel Dashboards, em qualquer Tabela ou Gráfico, pode-se utilizar o recurso de:\nPressionar a tecla Ctrl + Roda de Rolagem do mouse (Botão Scroll), ajustando para cima ou para baixo."]

{"sheet":"TD","index":1,"n_rows":49,"n_cols":12,"rows_kept":49,"cut":false,"hidden":true,"merged":[[48,1,48,11],[5,6,6,11],[7,6,7,11],[11,6,11,7],[11,11,11,12],[46,1,46,6],[26,6,26,12],[28,6,28,8],[28,9,28,11],[43,6,43,12],[44,6,44,12],[45,6,45,12],[9,6,10,12]]}
[null,"Ano",2019]
[null,"Seção Judiciária","SJRJ"]
[null,"Base","(Tudo)"]
[]
[null,null,"Valores"]
[null," Tipo de Juízo e Mês"," Distribuídos"," Julgados"," Remetidos TRF/TR"," Tramitação Real","Mapa Geral Judicial do 1º Grau"]
[null,"Varas",104257,106054,48766,7081472]
[null,"Janeiro",5667,5869,2455,588642,"Orientações para a utilização da \"Tabela Dinâmica\"."]
[null,"Fevereiro",7171,8816,4057,587658]
[null,"Março",12062,6837,3342,593340,"Nos campos de filtro \"Ano\", \"Seção Judiciária\" e \"Base\" da tabela ao lado, dentre as opções:"]
[null,"Abril",7384,7509,3517,593128]
[null,"Maio",8306,10339,4585,641499,"Selecione um \"Ano\" :",null,"          Selecione uma \"Seção Judiciária\" :",null,null,"Selecione uma \"Base\" :"]
[null,"Junho",6521,7922,3958,588746]
[null,"Julho",9017,10649,5186,585890]
[null,"Agosto",8605,12638,5101,583146]
[null,"Setembro",7800,10776,4958,579786]
[null,"Outubro",8743,10000,4939,576370]
[null,"Novembro",11788,7975,3737,579231]
[null,"Dezembro",11193,6724,2931,584036]
[null,"Juizados",136140,129262,12351,1474760]
[null,"Janeiro",6956,8480,961,117497]
[null,"Fevereiro",9720,11015,1397,113766]
[null,"Março",8356,9087,899,113115]
[null,"Abril",9611,8883,840,113864]
[null,"Maio",11212,11869,1007,114865]
[null,"Junho",9281,10388,916,118415]
[null,"Julho",11864,12828,1216,123155,"Nos campos de coluna \"Tipo de Juízo e Mês\"  da tabela ao lado, dentre as opções:"]
[null,"Agosto",11086,13552,1195,123049]
[null,"Setembro",10461,11699,1176,125369,"Selecione um \"Tipo de Juízo\" :",null,null,"Selecione um \"Mês\" :        "]
[null,"Outubro",13305,12544,1163,126324]
[null,"Novembro",24930,10571,861,142154]
[null,"Dezembro",9358,8346,720,143187]
[null,"Turmas Recursais",36628,55379,0,623089]
[null,"Janeiro",2570,1980,0,57549]
[null,"Fevereiro",3383,3215,0,58095]
[null,"Março",2911,4198,0,58268]
[null,"Abril",2877,3319,0,58438]
[null,"Maio",3092,15316,0,59471]
[null,"Junho",2847,4232,0,54661]
[null,"Julho",3713,3690,0,49690]
[null,"Agosto",3584,3903,0,47829]
[null,"Setembro",3536,4541,0,46333]
[null,"Outubro",3392,4321,0,44547]
[null,"Novembro",2603,3315,0,44191,"     Obs. 1: Os Processos Julgados nas Varas e Juizados incluem os Embargos."]
[null,"Dezembro",2120,3349,0,44017,"     Obs. 2: Tramitação Real = Tramitação de Processos no Final do Período (Ano e Mês)."]
[null,"Total geral",277025,290695,61117,9179321,"     Obs. 3: Tramitação Real inclui Processos suspensos e os que aguardam julg de recursos."]
[null,"OBS.: Os valores poderão ser alterados, em função de modificações na base de dados, por parte do usuário."]
[]
["                   Ainda não estão incluídos os Processos do \"Eproc\". (Desde o dia 23 de fevereiro de 2018, o sistema processual Eproc está em funcionamento na Justiça Federal da 2ª Região.\n                   Inicialmente, sua implantação ocorreu nos Juizados Especiais Federais de Vitória/ES e Turmas Recursais do Espírito Santo.)","_ Desde o dia 23 de Fevereiro de 2018, o NOVO sistema processual \"Eproc\" está em funcionamento na Justiça Federal da 2ª Região."]

{"sheet":"PaM","index":2,"n_rows":65,"n_cols":20,"rows_kept":65,"cut":false,"hidden":true,"merged":[[3,7,4,7],[62,1,62,10],[64,1,64,12],[13,1,15,1],[17,1,19,1],[3,8,4,8],[10,11,13,12],[14,11,21,12],[21,1,23,1],[3,9,4,9],[3,10,4,10],[5,1,7,1],[9,1,11,1],[3,3,4,3],[3,4,4,4],[3,5,4,5],[3,6,4,6],[25,1,27,1],[29,1,31,1],[53,1,55,1],[57,1,59,1],[33,1,35,1],[37,1,39,1],[41,1,43,1],[45,1,47,1],[49,1,51,1]]}
[]
[null,"Ano",null,"Seção Judiciária",null,null,{"$f":"TA!$I$37","v":"      Mapa Geral Judicial do 1º Grau (Eproc)"},null,null,null,null,null,null,null,null,null,null,null,null,"SpA"]
[]
[null,null,null,"Distribuídos","Acum.\nMensal","Julgados","Acum.\nMensal","Remetidos ao TRF/TR","Acum.\nMensal","Tramitação \"Real\"","% Variação Mensal da\nTramitação \"Real\""]
[null,"Mês","Tipo de Juízo"]
[null,"Dezembro","Varas",{"$f":"IF(TA!$C$17=3,SUMIF(Dados!$B$2:$L$1081,TA!$A$20&PaM!$C6&PaM!$B$6,Dados!$I$2:$I$1081),VLOOKUP(TA!$D$20&$C6&$B$6,Dados!$A$2:$L$1081,9,0))","v":620},null,{"$f":"IF(TA!$C$17=3,SUMIF(Dados!$B$2:$L$1081,TA!$A$20&PaM!$C6&PaM!$B$6,Dados!$J$2:$J$1081),VLOOKUP(TA!$D$20&$C6&$B$6,Dados!$A$2:$L$1081,10,0))","v":5333},null,{"$f":"IF(TA!$C$17=3,SUMIF(Dados!$B$2:$L$1081,TA!$A$20&PaM!$C6&PaM!$B$6,Dados!$K$2:$K$1081),VLOOKUP(TA!$D$20&$C6&$B$6,Dados!$A$2:$L$1081,11,0))","v":1127},null,{"$f":"IF(TA!$A$18=2020,TA!$C$45,TA!$F$18)","v":530063},"already implemented"]
[null,null,"Juizados",{"$f":"IF(TA!$C$17=3,SUMIF(Dados!$B$2:$L$1081,TA!$A$20&PaM!$C7&PaM!$B$6,Dados!$I$2:$I$1081),VLOOKUP(TA!$D$20&$C7&$B$6,Dados!$A$2:$L$1081,9,0))","v":2},null,{"$f":"IF(TA!$C$17=3,SUMIF(Dados!$B$2:$L$1081,TA!$A$20&PaM!$C7&PaM!$B$6,Dados!$J$2:$J$1081),VLOOKUP(TA!$D$20&$C7&$B$6,Dados!$A$2:$L$1081,10,0))","v":2556},null,{"$f":"IF(TA!$C$17=3,SUMIF(Dados!$B$2:$L$1081,TA!$A$20&PaM!$C7&PaM!$B$6,Dados!$K$2:$K$1081),VLOOKUP(TA!$D$20&$C7&$B$6,Dados!$A$2:$L$1081,11,0))","v":580},null,{"$f":"IF(TA!$A$18=2020,TA!$C$46,TA!$F$19)","v":36713},"when"]
[null,null,"Turmas Recursais",{"$f":"IF(TA!$C$17=3,SUMIF(Dados!$B$2:$L$1081,TA!$A$20&PaM!$C8&PaM!$B$6,Dados!$I$2:$I$1081),VLOOKUP(TA!$D$20&$C8&$B$6,Dados!$A$2:$L$1081,9,0))","v":70},null,{"$f":"IF(TA!$C$17=3,SUMIF(Dados!$B$2:$L$1081,TA!$A$20&PaM!$C8&PaM!$B$6,Dados!$J$2:$J$1081),VLOOKUP(TA!$D$20&$C8&$B$6,Dados!$A$2:$L$1081,10,0))","v":1991},null,{"$f":"IF(TA!$C$17=3,SUMIF(Dados!$B$2:$L$1081,TA!$A$20&PaM!$C8&PaM!$B$6,Dados!$K$2:$K$1081),VLOOKUP(TA!$D$20&$C8&$B$6,Dados!$A$2:$L$1081,11,0))","v":0},null,{"$f":"IF(TA!$A$18=2020,TA!$C$47,TA!$F$20)","v":50962},"2020"]
[null,"Total",null,{"$f":"SUM(D6:D8)","v":692},null,{"$f":"SUM(F6:F8)","v":9880},null,{"$f":"SUM(H6:H8)","v":1707},null,{"$f":"SUM(J6:J8)","v":617738}]
[null,"Janeiro","Varas",{"$f":"IF(TA!$C$17=3,SUMIF(Dados!$B$2:$L$1081,TA!$A$18&PaM!$C10&PaM!$B$10,Dados!$I$2:$I$1081),VLOOKUP(TA!$D$18&$C10&$B$10,Dados!$A$2:$L$1081,9,0))","v":827},{"$f":"IF(D10=0,\"\",D10)","v":827},{"$f":"IF(TA!$C$17=3,SUMIF(Dados!$B$2:$L$1081,TA!$A$18&PaM!$C10&PaM!$B$10,Dados!$J$2:$J$1081),VLOOKUP(TA!$D$18&$C10&$B$10,Dados!$A$2:$L$1081,10,0))","v":4735},{"$f":"IF(F10=0,\"\",F10)","v":4735},{"$f":"IF(TA!$C$17=3,SUMIF(Dados!$B$2:$L$1081,TA!$A$18&PaM!$C10&PaM!$B$10,Dados!$K$2:$K$1081),VLOOKUP(TA!$D$18&$C10&$B$10,Dados!$A$2:$L$1081,11,0))","v":1009},{"$f":"IF(H10=0,\"\",H10)","v":1009},{"$f":"IF(TA!$C$17=3,SUMIF(Dados!$B$2:$L$1081,TA!$A$18&PaM!$C10&PaM!$B$10,Dados!$L$2:$L$1081),VLOOKUP(TA!$D$18&$C10&$B$10,Dados!$A$2:$L$1081,12,0))","v":513561},{"$f":"IF(J10=0,\"\",(J10/J6)-1)","v":-3.1132148442732266E-2}]
[null,null,"Juizados",{"$f":"IF(TA!$C$17=3,SUMIF(Dados!$B$2:$L$1081,TA!$A$18&PaM!$C11&PaM!$B$10,Dados!$I$2:$I$1081),VLOOKUP(TA!$D$18&$C11&$B$10,Dados!$A$2:$L$1081,9,0))","v":6},{"$f":"IF(D11=0,\"\",D11)","v":6},{"$f":"IF(TA!$C$17=3,SUMIF(Dados!$B$2:$L$1081,TA!$A$18&PaM!$C11&PaM!$B$10,Dados!$J$2:$J$1081),VLOOKUP(TA!$D$18&$C11&$B$10,Dados!$A$2:$L$1081,10,0))","v":2186},{"$f":"IF(F11=0,\"\",F11)","v":2186},{"$f":"IF(TA!$C$17=3,SUMIF(Dados!$B$2:$L$1081,TA!$A$18&PaM!$C11&PaM!$B$10,Dados!$K$2:$K$1081),VLOOKUP(TA!$D$18&$C11&$B$10,Dados!$A$2:$L$1081,11,0))","v":592},{"$f":"IF(H11=0,\"\",H11)","v":592},{"$f":"IF(TA!$C$17=3,SUMIF(Dados!$B$2:$L$1081,TA!$A$18&PaM!$C11&PaM!$B$10,Dados!$L$2:$L$1081),VLOOKUP(TA!$D$18&$C11&$B$10,Dados!$A$2:$L$1081,12,0))","v":33022},{"$f":"IF(J11=0,\"\",(J11/J7)-1)","v":-0.10053659466673925},"    Obs. 1: Os Processos Julgados\n                     nas Varas e Juizados\n                     incluem os Embargos."]
[null,null,"Turmas Recursais",{"$f":"IF(TA!$C$17=3,SUMIF(Dados!$B$2:$L$1081,TA!$A$18&PaM!$C12&PaM!$B$10,Dados!$I$2:$I$1081),VLOOKUP(TA!$D$18&$C12&$B$10,Dados!$A$2:$L$1081,9,0))","v":1034},{"$f":"IF(D12=0,\"\",D12)","v":1034},{"$f":"IF(TA!$C$17=3,SUMIF(Dados!$B$2:$L$1081,TA!$A$18&PaM!$C12&PaM!$B$10,Dados!$J$2:$J$1081),VLOOKUP(TA!$D$18&$C12&$B$10,Dados!$A$2:$L$1081,10,0))","v":1316},{"$f":"IF(F12=0,\"\",F12)","v":1316},{"$f":"IF(TA!$C$17=3,SUMIF(Dados!$B$2:$L$1081,TA!$A$18&PaM!$C12&PaM!$B$10,Dados!$K$2:$K$1081),VLOOKUP(TA!$D$18&$C12&$B$10,Dados!$A$2:$L$1081,11,0))","v":0},{"$f":"IF(H12=0,\"\",H12)","v":""},{"$f":"IF(TA!$C$17=3,SUMIF(Dados!$B$2:$L$1081,TA!$A$18&PaM!$C12&PaM!$B$10,Dados!$L$2:$L$1081),VLOOKUP(TA!$D$18&$C12&$B$10,Dados!$A$2:$L$1081,12,0))","v":50625},{"$f":"IF(J12=0,\"\",(J12/J8)-1)","v":-6.6127702994388526E-3}]
[null,"Total",null,{"$f":"SUM(D10:D12)","v":1867},{"$f":"IF(D13=0,\"\",SUM(E10:E12))","v":1867},{"$f":"SUM(F10:F12)","v":8237},{"$f":"IF(F13=0,\"\",SUM(G10:G12))","v":8237},{"$f":"SUM(H10:H12)","v":1601},{"$f":"IF(H13=0,\"\",SUM(I10:I12))","v":1601},{"$f":"SUM(J10:J12)","v":597208},{"$f":"IF(J13=0,\"\",(J13/J9)-1)","v":-3.3234154285473827E-2}]
[null,"Fevereiro","Varas",{"$f":"IF(TA!$C$17=3,SUMIF(Dados!$B$2:$L$1081,TA!$A$18&PaM!$C14&PaM!$B$14,Dados!$I$2:$I$1081),VLOOKUP(TA!$D$18&$C14&$B$14,Dados!$A$2:$L$1081,9,0))","v":816},{"$f":"IF(D14=0,\"\",E10+D14)","v":1643},{"$f":"IF(TA!$C$17=3,SUMIF(Dados!$B$2:$L$1081,TA!$A$18&PaM!$C14&PaM!$B$14,Dados!$J$2:$J$1081),VLOOKUP(TA!$D$18&$C14&$B$14,Dados!$A$2:$L$1081,10,0))","v":5988},{"$f":"IF(F14=0,\"\",G10+F14)","v":10723},{"$f":"IF(TA!$C$17=3,SUMIF(Dados!$B$2:$L$1081,TA!$A$18&PaM!$C14&PaM!$B$14,Dados!$K$2:$K$1081),VLOOKUP(TA!$D$18&$C14&$B$14,Dados!$A$2:$L$1081,11,0))","v":1030},{"$f":"IF(H14=0,\"\",I10+H14)","v":2039},{"$f":"IF(TA!$C$17=3,SUMIF(Dados!$B$2:$L$1081,TA!$A$18&PaM!$C14&PaM!$B$14,Dados!$L$2:$L$1081),VLOOKUP(TA!$D$18&$C14&$B$14,Dados!$A$2:$L$1081,12,0))","v":481199},{"$f":"IF(J14=0,\"\",(J14/J10)-1)","v":-6.3014909621252446E-2}]
[null,null,"Juizados",{"$f":"IF(TA!$C$17=3,SUMIF(Dados!$B$2:$L$1081,TA!$A$18&PaM!$C15&PaM!$B$14,Dados!$I$2:$I$1081),VLOOKUP(TA!$D$18&$C15&$B$14,Dados!$A$2:$L$1081,9,0))","v":3},{"$f":"IF(D15=0,\"\",E11+D15)","v":9},{"$f":"IF(TA!$C$17=3,SUMIF(Dados!$B$2:$L$1081,TA!$A$18&PaM!$C15&PaM!$B$14,Dados!$J$2:$J$1081),VLOOKUP(TA!$D$18&$C15&$B$14,Dados!$A$2:$L$1081,10,0))","v":1415},{"$f":"IF(F15=0,\"\",G11+F15)","v":3601},{"$f":"IF(TA!$C$17=3,SUMIF(Dados!$B$2:$L$1081,TA!$A$18&PaM!$C15&PaM!$B$14,Dados!$K$2:$K$1081),VLOOKUP(TA!$D$18&$C15&$B$14,Dados!$A$2:$L$1081,11,0))","v":632},{"$f":"IF(H15=0,\"\",I11+H15)","v":1224},{"$f":"IF(TA!$C$17=3,SUMIF(Dados!$B$2:$L$1081,TA!$A$18&PaM!$C15&PaM!$B$14,Dados!$L$2:$L$1081),VLOOKUP(TA!$D$18&$C15&$B$14,Dados!$A$2:$L$1081,12,0))","v":24520},-0.25746472048937075,"    Obs. 2: Na Tramitação \"Real\",\n                     estão incluídos os\n                     Processos suspensos\n                     e os que aguardam\n                     julgamento de recurso."]
[null,null,"Turmas Recursais",{"$f":"IF(TA!$C$17=3,SUMIF(Dados!$B$2:$L$1081,TA!$A$18&PaM!$C16&PaM!$B$14,Dados!$I$2:$I$1081),VLOOKUP(TA!$D$18&$C16&$B$14,Dados!$A$2:$L$1081,9,0))","v":265},{"$f":"IF(D16=0,\"\",E12+D16)","v":1299},{"$f":"IF(TA!$C$17=3,SUMIF(Dados!$B$2:$L$1081,TA!$A$18&PaM!$C16&PaM!$B$14,Dados!$J$2:$J$1081),VLOOKUP(TA!$D$18&$C16&$B$14,Dados!$A$2:$L$1081,10,0))","v":2355},{"$f":"IF(F16=0,\"\",G12+F16)","v":3671},{"$f":"IF(TA!$C$17=3,SUMIF(Dados!$B$2:$L$1081,TA!$A$18&PaM!$C16&PaM!$B$14,Dados!$K$2:$K$1081),VLOOKUP(TA!$D$18&$C16&$B$14,Dados!$A$2:$L$1081,11,0))","v":0},{"$f":"IF(H16=0,\"\",I12+H16)","v":""},{"$f":"IF(TA!$C$17=3,SUMIF(Dados!$B$2:$L$1081,TA!$A$18&PaM!$C16&PaM!$B$14,Dados!$L$2:$L$1081),VLOOKUP(TA!$D$18&$C16&$B$14,Dados!$A$2:$L$1081,12,0))","v":48799},-3.6069135802469177E-2]
[null,"Total",null,{"$f":"SUM(D14:D16)","v":1084},{"$f":"IF(D17=0,\"\",SUM(E14:E16))","v":2951},{"$f":"SUM(F14:F16)","v":9758},{"$f":"IF(F17=0,\"\",SUM(G14:G16))","v":17995},{"$f":"SUM(H14:H16)","v":1662},{"$f":"IF(H17=0,\"\",SUM(I14:I16))","v":3263},{"$f":"SUM(J14:J16)","v":554518},-7.1482632516644107E-2]
[null,"Março","Varas",{"$f":"IF(TA!$C$17=3,SUMIF(Dados!$B$2:$L$1081,TA!$A$18&PaM!$C18&PaM!$B$18,Dados!$I$2:$I$1081),VLOOKUP(TA!$D$18&$C18&$B$18,Dados!$A$2:$L$1081,9,0))","v":616},{"$f":"IF(D18=0,\"\",E14+D18)","v":2259},{"$f":"IF(TA!$C$17=3,SUMIF(Dados!$B$2:$L$1081,TA!$A$18&PaM!$C18&PaM!$B$18,Dados!$J$2:$J$1081),VLOOKUP(TA!$D$18&$C18&$B$18,Dados!$A$2:$L$1081,10,0))","v":4023},{"$f":"IF(F18=0,\"\",G14+F18)","v":14746},{"$f":"IF(TA!$C$17=3,SUMIF(Dados!$B$2:$L$1081,TA!$A$18&PaM!$C18&PaM!$B$18,Dados!$K$2:$K$1081),VLOOKUP(TA!$D$18&$C18&$B$18,Dados!$A$2:$L$1081,11,0))","v":797},{"$f":"IF(H18=0,\"\",I14+H18)","v":2836},{"$f":"IF(TA!$C$17=3,SUMIF(Dados!$B$2:$L$1081,TA!$A$18&PaM!$C18&PaM!$B$18,Dados!$L$2:$L$1081),VLOOKUP(TA!$D$18&$C18&$B$18,Dados!$A$2:$L$1081,12,0))","v":460944},{"$f":"IF(J18=0,\"\",(J18/J14)-1)","v":-4.209277242887044E-2}]
[null,null,"Juizados",{"$f":"IF(TA!$C$17=3,SUMIF(Dados!$B$2:$L$1081,TA!$A$18&PaM!$C19&PaM!$B$18,Dados!$I$2:$I$1081),VLOOKUP(TA!$D$18&$C19&$B$18,Dados!$A$2:$L$1081,9,0))","v":1},{"$f":"IF(D19=0,\"\",E15+D19)","v":10},{"$f":"IF(TA!$C$17=3,SUMIF(Dados!$B$2:$L$1081,TA!$A$18&PaM!$C19&PaM!$B$18,Dados!$J$2:$J$1081),VLOOKUP(TA!$D$18&$C19&$B$18,Dados!$A$2:$L$1081,10,0))","v":867},{"$f":"IF(F19=0,\"\",G15+F19)","v":4468},{"$f":"IF(TA!$C$17=3,SUMIF(Dados!$B$2:$L$1081,TA!$A$18&PaM!$C19&PaM!$B$18,Dados!$K$2:$K$1081),VLOOKUP(TA!$D$18&$C19&$B$18,Dados!$A$2:$L$1081,11,0))","v":331},{"$f":"IF(H19=0,\"\",I15+H19)","v":1555},{"$f":"IF(TA!$C$17=3,SUMIF(Dados!$B$2:$L$1081,TA!$A$18&PaM!$C19&PaM!$B$18,Dados!$L$2:$L$1081),VLOOKUP(TA!$D$18&$C19&$B$18,Dados!$A$2:$L$1081,12,0))","v":21189},-0.13584828711256114]
[null,null,"Turmas Recursais",{"$f":"IF(TA!$C$17=3,SUMIF(Dados!$B$2:$L$1081,TA!$A$18&PaM!$C20&PaM!$B$18,Dados!$I$2:$I$1081),VLOOKUP(TA!$D$18&$C20&$B$18,Dados!$A$2:$L$1081,9,0))","v":492},{"$f":"IF(D20=0,\"\",E16+D20)","v":1791},{"$f":"IF(TA!$C$17=3,SUMIF(Dados!$B$2:$L$1081,TA!$A$18&PaM!$C20&PaM!$B$18,Dados!$J$2:$J$1081),VLOOKUP(TA!$D$18&$C20&$B$18,Dados!$A$2:$L$1081,10,0))","v":2338},{"$f":"IF(F20=0,\"\",G16+F20)","v":6009},{"$f":"IF(TA!$C$17=3,SUMIF(Dados!$B$2:$L$1081,TA!$A$18&PaM!$C20&PaM!$B$18,Dados!$K$2:$K$1081),VLOOKUP(TA!$D$18&$C20&$B$18,Dados!$A$2:$L$1081,11,0))","v":0},{"$f":"IF(H20=0,\"\",I16+H20)","v":""},{"$f":"IF(TA!$C$17=3,SUMIF(Dados!$B$2:$L$1081,TA!$A$18&PaM!$C20&PaM!$B$18,Dados!$L$2:$L$1081),VLOOKUP(TA!$D$18&$C20&$B$18,Dados!$A$2:$L$1081,12,0))","v":47420},-2.8258775794585911E-2]
[null,"Total",null,{"$f":"SUM(D18:D20)","v":1109},{"$f":"IF(D21=0,\"\",SUM(E18:E20))","v":4060},{"$f":"SUM(F18:F20)","v":7228},{"$f":"IF(F21=0,\"\",SUM(G18:G20))","v":25223},{"$f":"SUM(H18:H20)","v":1128},{"$f":"IF(H21=0,\"\",SUM(I18:I20))","v":4391},{"$f":"SUM(J18:J20)","v":529553},-4.5021081371569571E-2]
[null,"Abril","Varas",{"$f":"IF(TA!$C$17=3,SUMIF(Dados!$B$2:$L$1081,TA!$A$18&PaM!$C22&PaM!$B$22,Dados!$I$2:$I$1081),VLOOKUP(TA!$D$18&$C22&$B$22,Dados!$A$2:$L$1081,9,0))","v":641},{"$f":"IF(D22=0,\"\",E18+D22)","v":2900},{"$f":"IF(TA!$C$17=3,SUMIF(Dados!$B$2:$L$1081,TA!$A$18&PaM!$C22&PaM!$B$22,Dados!$J$2:$J$1081),VLOOKUP(TA!$D$18&$C22&$B$22,Dados!$A$2:$L$1081,10,0))","v":4226},{"$f":"IF(F22=0,\"\",G18+F22)","v":18972},{"$f":"IF(TA!$C$17=3,SUMIF(Dados!$B$2:$L$1081,TA!$A$18&PaM!$C22&PaM!$B$22,Dados!$K$2:$K$1081),VLOOKUP(TA!$D$18&$C22&$B$22,Dados!$A$2:$L$1081,11,0))","v":771},{"$f":"IF(H22=0,\"\",I18+H22)","v":3607},{"$f":"IF(TA!$C$17=3,SUMIF(Dados!$B$2:$L$1081,TA!$A$18&PaM!$C22&PaM!$B$22,Dados!$L$2:$L$1081),VLOOKUP(TA!$D$18&$C22&$B$22,Dados!$A$2:$L$1081,12,0))","v":436204},{"$f":"IF(J22=0,\"\",(J22/J18)-1)","v":-5.3672463466277853E-2}]
[null,null,"Juizados",{"$f":"IF(TA!$C$17=3,SUMIF(Dados!$B$2:$L$1081,TA!$A$18&PaM!$C23&PaM!$B$22,Dados!$I$2:$I$1081),VLOOKUP(TA!$D$18&$C23&$B$22,Dados!$A$2:$L$1081,9,0))","v":2},{"$f":"IF(D23=0,\"\",E19+D23)","v":12},{"$f":"IF(TA!$C$17=3,SUMIF(Dados!$B$2:$L$1081,TA!$A$18&PaM!$C23&PaM!$B$22,Dados!$J$2:$J$1081),VLOOKUP(TA!$D$18&$C23&$B$22,Dados!$A$2:$L$1081,10,0))","v":597},{"$f":"IF(F23=0,\"\",G19+F23)","v":5065},{"$f":"IF(TA!$C$17=3,SUMIF(Dados!$B$2:$L$1081,TA!$A$18&PaM!$C23&PaM!$B$22,Dados!$K$2:$K$1081),VLOOKUP(TA!$D$18&$C23&$B$22,Dados!$A$2:$L$1081,11,0))","v":267},{"$f":"IF(H23=0,\"\",I19+H23)","v":1822},{"$f":"IF(TA!$C$17=3,SUMIF(Dados!$B$2:$L$1081,TA!$A$18&PaM!$C23&PaM!$B$22,Dados!$L$2:$L$1081),VLOOKUP(TA!$D$18&$C23&$B$22,Dados!$A$2:$L$1081,12,0))","v":18944},{"$f":"IF(J23=0,\"\",(J23/J19)-1)","v":-0.10595120109490774},"    Fonte: Sistema Apolo."]
[null,null,"Turmas Recursais",{"$f":"IF(TA!$C$17=3,SUMIF(Dados!$B$2:$L$1081,TA!$A$18&PaM!$C24&PaM!$B$22,Dados!$I$2:$I$1081),VLOOKUP(TA!$D$18&$C24&$B$22,Dados!$A$2:$L$1081,9,0))","v":473},{"$f":"IF(D24=0,\"\",E20+D24)","v":2264},{"$f":"IF(TA!$C$17=3,SUMIF(Dados!$B$2:$L$1081,TA!$A$18&PaM!$C24&PaM!$B$22,Dados!$J$2:$J$1081),VLOOKUP(TA!$D$18&$C24&$B$22,Dados!$A$2:$L$1081,10,0))","v":2011},{"$f":"IF(F24=0,\"\",G20+F24)","v":8020},{"$f":"IF(TA!$C$17=3,SUMIF(Dados!$B$2:$L$1081,TA!$A$18&PaM!$C24&PaM!$B$22,Dados!$K$2:$K$1081),VLOOKUP(TA!$D$18&$C24&$B$22,Dados!$A$2:$L$1081,11,0))","v":0},{"$f":"IF(H24=0,\"\",I20+H24)","v":""},{"$f":"IF(TA!$C$17=3,SUMIF(Dados!$B$2:$L$1081,TA!$A$18&PaM!$C24&PaM!$B$22,Dados!$L$2:$L$1081),VLOOKUP(TA!$D$18&$C24&$B$22,Dados!$A$2:$L$1081,12,0))","v":46210},-2.5516659637283889E-2]
[null,"Total",null,{"$f":"SUM(D22:D24)","v":1116},{"$f":"IF(D25=0,\"\",SUM(E22:E24))","v":5176},{"$f":"SUM(F22:F24)","v":6834},{"$f":"IF(F25=0,\"\",SUM(G22:G24))","v":32057},{"$f":"SUM(H22:H24)","v":1038},{"$f":"IF(H25=0,\"\",SUM(I22:I24))","v":5429},{"$f":"SUM(J22:J24)","v":501358},-5.3243018168153133E-2]
[null,"Maio","Varas",{"$f":"IF(TA!$C$17=3,SUMIF(Dados!$B$2:$L$1081,TA!$A$18&PaM!$C26&PaM!$B$26,Dados!$I$2:$I$1081),VLOOKUP(TA!$D$18&$C26&$B$26,Dados!$A$2:$L$1081,9,0))","v":821},{"$f":"IF(D26=0,\"\",E22+D26)","v":3721},{"$f":"IF(TA!$C$17=3,SUMIF(Dados!$B$2:$L$1081,TA!$A$18&PaM!$C26&PaM!$B$26,Dados!$J$2:$J$1081),VLOOKUP(TA!$D$18&$C26&$B$26,Dados!$A$2:$L$1081,10,0))","v":5621},{"$f":"IF(F26=0,\"\",G22+F26)","v":24593},{"$f":"IF(TA!$C$17=3,SUMIF(Dados!$B$2:$L$1081,TA!$A$18&PaM!$C26&PaM!$B$26,Dados!$K$2:$K$1081),VLOOKUP(TA!$D$18&$C26&$B$26,Dados!$A$2:$L$1081,11,0))","v":1045},{"$f":"IF(H26=0,\"\",I22+H26)","v":4652},{"$f":"IF(TA!$C$17=3,SUMIF(Dados!$B$2:$L$1081,TA!$A$18&PaM!$C26&PaM!$B$26,Dados!$L$2:$L$1081),VLOOKUP(TA!$D$18&$C26&$B$26,Dados!$A$2:$L$1081,12,0))","v":401153},{"$f":"IF(J26=0,\"\",(J26/J22)-1)","v":-8.0354604726229018E-2}]
[null,null,"Juizados",{"$f":"IF(TA!$C$17=3,SUMIF(Dados!$B$2:$L$1081,TA!$A$18&PaM!$C27&PaM!$B$26,Dados!$I$2:$I$1081),VLOOKUP(TA!$D$18&$C27&$B$26,Dados!$A$2:$L$1081,9,0))","v":3},{"$f":"IF(D27=0,\"\",E23+D27)","v":15},{"$f":"IF(TA!$C$17=3,SUMIF(Dados!$B$2:$L$1081,TA!$A$18&PaM!$C27&PaM!$B$26,Dados!$J$2:$J$1081),VLOOKUP(TA!$D$18&$C27&$B$26,Dados!$A$2:$L$1081,10,0))","v":776},{"$f":"IF(F27=0,\"\",G23+F27)","v":5841},{"$f":"IF(TA!$C$17=3,SUMIF(Dados!$B$2:$L$1081,TA!$A$18&PaM!$C27&PaM!$B$26,Dados!$K$2:$K$1081),VLOOKUP(TA!$D$18&$C27&$B$26,Dados!$A$2:$L$1081,11,0))","v":273},{"$f":"IF(H27=0,\"\",I23+H27)","v":2095},{"$f":"IF(TA!$C$17=3,SUMIF(Dados!$B$2:$L$1081,TA!$A$18&PaM!$C27&PaM!$B$26,Dados!$L$2:$L$1081),VLOOKUP(TA!$D$18&$C27&$B$26,Dados!$A$2:$L$1081,12,0))","v":16638},{"$f":"IF(J27=0,\"\",(J27/J23)-1)","v":-0.12172719594594594}]
[null,null,"Turmas Recursais",{"$f":"IF(TA!$C$17=3,SUMIF(Dados!$B$2:$L$1081,TA!$A$18&PaM!$C28&PaM!$B$26,Dados!$I$2:$I$1081),VLOOKUP(TA!$D$18&$C28&$B$26,Dados!$A$2:$L$1081,9,0))","v":277},{"$f":"IF(D28=0,\"\",E24+D28)","v":2541},{"$f":"IF(TA!$C$17=3,SUMIF(Dados!$B$2:$L$1081,TA!$A$18&PaM!$C28&PaM!$B$26,Dados!$J$2:$J$1081),VLOOKUP(TA!$D$18&$C28&$B$26,Dados!$A$2:$L$1081,10,0))","v":13070},{"$f":"IF(F28=0,\"\",G24+F28)","v":21090},{"$f":"IF(TA!$C$17=3,SUMIF(Dados!$B$2:$L$1081,TA!$A$18&PaM!$C28&PaM!$B$26,Dados!$K$2:$K$1081),VLOOKUP(TA!$D$18&$C28&$B$26,Dados!$A$2:$L$1081,11,0))","v":0},{"$f":"IF(H28=0,\"\",I24+H28)","v":""},{"$f":"IF(TA!$C$17=3,SUMIF(Dados!$B$2:$L$1081,TA!$A$18&PaM!$C28&PaM!$B$26,Dados!$L$2:$L$1081),VLOOKUP(TA!$D$18&$C28&$B$26,Dados!$A$2:$L$1081,12,0))","v":45393},-1.7680155810430698E-2]
[null,"Total",null,{"$f":"SUM(D26:D28)","v":1101},{"$f":"IF(D29=0,\"\",SUM(E26:E28))","v":6277},{"$f":"SUM(F26:F28)","v":19467},{"$f":"IF(F29=0,\"\",SUM(G26:G28))","v":51524},{"$f":"SUM(H26:H28)","v":1318},{"$f":"IF(H29=0,\"\",SUM(I26:I28))","v":6747},{"$f":"SUM(J26:J28)","v":463184},-7.6141200499443507E-2]
[null,"Junho","Varas",{"$f":"IF(TA!$C$17=3,SUMIF(Dados!$B$2:$L$1081,TA!$A$18&PaM!$C30&PaM!$B$30,Dados!$I$2:$I$1081),VLOOKUP(TA!$D$18&$C30&$B$30,Dados!$A$2:$L$1081,9,0))","v":551},{"$f":"IF(D30=0,\"\",E26+D30)","v":4272},{"$f":"IF(TA!$C$17=3,SUMIF(Dados!$B$2:$L$1081,TA!$A$18&PaM!$C30&PaM!$B$30,Dados!$J$2:$J$1081),VLOOKUP(TA!$D$18&$C30&$B$30,Dados!$A$2:$L$1081,10,0))","v":3266},{"$f":"IF(F30=0,\"\",G26+F30)","v":27859},{"$f":"IF(TA!$C$17=3,SUMIF(Dados!$B$2:$L$1081,TA!$A$18&PaM!$C30&PaM!$B$30,Dados!$K$2:$K$1081),VLOOKUP(TA!$D$18&$C30&$B$30,Dados!$A$2:$L$1081,11,0))","v":680},{"$f":"IF(H30=0,\"\",I26+H30)","v":5332},{"$f":"IF(TA!$C$17=3,SUMIF(Dados!$B$2:$L$1081,TA!$A$18&PaM!$C30&PaM!$B$30,Dados!$L$2:$L$1081),VLOOKUP(TA!$D$18&$C30&$B$30,Dados!$A$2:$L$1081,12,0))","v":268732},{"$f":"IF(J30=0,\"\",(J30/J26)-1)","v":-0.33010098391386833}]
[null,null,"Juizados",{"$f":"IF(TA!$C$17=3,SUMIF(Dados!$B$2:$L$1081,TA!$A$18&PaM!$C31&PaM!$B$30,Dados!$I$2:$I$1081),VLOOKUP(TA!$D$18&$C31&$B$30,Dados!$A$2:$L$1081,9,0))","v":5},{"$f":"IF(D31=0,\"\",E27+D31)","v":20},{"$f":"IF(TA!$C$17=3,SUMIF(Dados!$B$2:$L$1081,TA!$A$18&PaM!$C31&PaM!$B$30,Dados!$J$2:$J$1081),VLOOKUP(TA!$D$18&$C31&$B$30,Dados!$A$2:$L$1081,10,0))","v":538},{"$f":"IF(F31=0,\"\",G27+F31)","v":6379},{"$f":"IF(TA!$C$17=3,SUMIF(Dados!$B$2:$L$1081,TA!$A$18&PaM!$C31&PaM!$B$30,Dados!$K$2:$K$1081),VLOOKUP(TA!$D$18&$C31&$B$30,Dados!$A$2:$L$1081,11,0))","v":162},{"$f":"IF(H31=0,\"\",I27+H31)","v":2257},{"$f":"IF(TA!$C$17=3,SUMIF(Dados!$B$2:$L$1081,TA!$A$18&PaM!$C31&PaM!$B$30,Dados!$L$2:$L$1081),VLOOKUP(TA!$D$18&$C31&$B$30,Dados!$A$2:$L$1081,12,0))","v":18370},{"$f":"IF(J31=0,\"\",(J31/J27)-1)","v":0.10409905036663059}]
[null,null,"Turmas Recursais",{"$f":"IF(TA!$C$17=3,SUMIF(Dados!$B$2:$L$1081,TA!$A$18&PaM!$C32&PaM!$B$30,Dados!$I$2:$I$1081),VLOOKUP(TA!$D$18&$C32&$B$30,Dados!$A$2:$L$1081,9,0))","v":164},{"$f":"IF(D32=0,\"\",E28+D32)","v":2705},{"$f":"IF(TA!$C$17=3,SUMIF(Dados!$B$2:$L$1081,TA!$A$18&PaM!$C32&PaM!$B$30,Dados!$J$2:$J$1081),VLOOKUP(TA!$D$18&$C32&$B$30,Dados!$A$2:$L$1081,10,0))","v":2398},{"$f":"IF(F32=0,\"\",G28+F32)","v":23488},{"$f":"IF(TA!$C$17=3,SUMIF(Dados!$B$2:$L$1081,TA!$A$18&PaM!$C32&PaM!$B$30,Dados!$K$2:$K$1081),VLOOKUP(TA!$D$18&$C32&$B$30,Dados!$A$2:$L$1081,11,0))","v":0},{"$f":"IF(H32=0,\"\",I28+H32)","v":""},{"$f":"IF(TA!$C$17=3,SUMIF(Dados!$B$2:$L$1081,TA!$A$18&PaM!$C32&PaM!$B$30,Dados!$L$2:$L$1081),VLOOKUP(TA!$D$18&$C32&$B$30,Dados!$A$2:$L$1081,12,0))","v":39786},-0.12352124776947992]
[null,"Total",null,{"$f":"SUM(D30:D32)","v":720},{"$f":"IF(D33=0,\"\",SUM(E30:E32))","v":6997},{"$f":"SUM(F30:F32)","v":6202},{"$f":"IF(F33=0,\"\",SUM(G30:G32))","v":57726},{"$f":"SUM(H30:H32)","v":842},{"$f":"IF(H33=0,\"\",SUM(I30:I32))","v":7589},{"$f":"SUM(J30:J32)","v":326888},-0.29425886904556287]
[null,"Julho","Varas",{"$f":"IF(TA!$C$17=3,SUMIF(Dados!$B$2:$L$1081,TA!$A$18&PaM!$C34&PaM!$B$34,Dados!$I$2:$I$1081),VLOOKUP(TA!$D$18&$C34&$B$34,Dados!$A$2:$L$1081,9,0))","v":760},{"$f":"IF(D34=0,\"\",E30+D34)","v":5032},{"$f":"IF(TA!$C$17=3,SUMIF(Dados!$B$2:$L$1081,TA!$A$18&PaM!$C34&PaM!$B$34,Dados!$J$2:$J$1081),VLOOKUP(TA!$D$18&$C34&$B$34,Dados!$A$2:$L$1081,10,0))","v":3973},{"$f":"IF(F34=0,\"\",G30+F34)","v":31832},{"$f":"IF(TA!$C$17=3,SUMIF(Dados!$B$2:$L$1081,TA!$A$18&PaM!$C34&PaM!$B$34,Dados!$K$2:$K$1081),VLOOKUP(TA!$D$18&$C34&$B$34,Dados!$A$2:$L$1081,11,0))","v":659},{"$f":"IF(H34=0,\"\",I30+H34)","v":5991},{"$f":"IF(TA!$C$17=3,SUMIF(Dados!$B$2:$L$1081,TA!$A$18&PaM!$C34&PaM!$B$34,Dados!$L$2:$L$1081),VLOOKUP(TA!$D$18&$C34&$B$34,Dados!$A$2:$L$1081,12,0))","v":258410},{"$f":"IF(J34=0,\"\",(J34/J30)-1)","v":-3.8410014438176376E-2}]
[null,null,"Juizados",{"$f":"IF(TA!$C$17=3,SUMIF(Dados!$B$2:$L$1081,TA!$A$18&PaM!$C35&PaM!$B$34,Dados!$I$2:$I$1081),VLOOKUP(TA!$D$18&$C35&$B$34,Dados!$A$2:$L$1081,9,0))","v":2},{"$f":"IF(D35=0,\"\",E31+D35)","v":22},{"$f":"IF(TA!$C$17=3,SUMIF(Dados!$B$2:$L$1081,TA!$A$18&PaM!$C35&PaM!$B$34,Dados!$J$2:$J$1081),VLOOKUP(TA!$D$18&$C35&$B$34,Dados!$A$2:$L$1081,10,0))","v":983},{"$f":"IF(F35=0,\"\",G31+F35)","v":7362},{"$f":"IF(TA!$C$17=3,SUMIF(Dados!$B$2:$L$1081,TA!$A$18&PaM!$C35&PaM!$B$34,Dados!$K$2:$K$1081),VLOOKUP(TA!$D$18&$C35&$B$34,Dados!$A$2:$L$1081,11,0))","v":174},{"$f":"IF(H35=0,\"\",I31+H35)","v":2431},{"$f":"IF(TA!$C$17=3,SUMIF(Dados!$B$2:$L$1081,TA!$A$18&PaM!$C35&PaM!$B$34,Dados!$L$2:$L$1081),VLOOKUP(TA!$D$18&$C35&$B$34,Dados!$A$2:$L$1081,12,0))","v":20586},{"$f":"IF(J35=0,\"\",(J35/J31)-1)","v":0.12063146434403915}]
[null,null,"Turmas Recursais",{"$f":"IF(TA!$C$17=3,SUMIF(Dados!$B$2:$L$1081,TA!$A$18&PaM!$C36&PaM!$B$34,Dados!$I$2:$I$1081),VLOOKUP(TA!$D$18&$C36&$B$34,Dados!$A$2:$L$1081,9,0))","v":142},{"$f":"IF(D36=0,\"\",E32+D36)","v":2847},{"$f":"IF(TA!$C$17=3,SUMIF(Dados!$B$2:$L$1081,TA!$A$18&PaM!$C36&PaM!$B$34,Dados!$J$2:$J$1081),VLOOKUP(TA!$D$18&$C36&$B$34,Dados!$A$2:$L$1081,10,0))","v":1747},{"$f":"IF(F36=0,\"\",G32+F36)","v":25235},{"$f":"IF(TA!$C$17=3,SUMIF(Dados!$B$2:$L$1081,TA!$A$18&PaM!$C36&PaM!$B$34,Dados!$K$2:$K$1081),VLOOKUP(TA!$D$18&$C36&$B$34,Dados!$A$2:$L$1081,11,0))","v":0},{"$f":"IF(H36=0,\"\",I32+H36)","v":""},{"$f":"IF(TA!$C$17=3,SUMIF(Dados!$B$2:$L$1081,TA!$A$18&PaM!$C36&PaM!$B$34,Dados!$L$2:$L$1081),VLOOKUP(TA!$D$18&$C36&$B$34,Dados!$A$2:$L$1081,12,0))","v":33433},-0.15967928417031119]
[null,"Total",null,{"$f":"SUM(D34:D36)","v":904},{"$f":"IF(D37=0,\"\",SUM(E34:E36))","v":7901},{"$f":"SUM(F34:F36)","v":6703},{"$f":"IF(F37=0,\"\",SUM(G34:G36))","v":64429},{"$f":"SUM(H34:H36)","v":833},{"$f":"IF(H37=0,\"\",SUM(I34:I36))","v":8422},{"$f":"SUM(J34:J36)","v":312429},-4.4232275274711852E-2]
[null,"Agosto","Varas",{"$f":"IF(TA!$C$17=3,SUMIF(Dados!$B$2:$L$1081,TA!$A$18&PaM!$C38&PaM!$B$38,Dados!$I$2:$I$1081),VLOOKUP(TA!$D$18&$C38&$B$38,Dados!$A$2:$L$1081,9,0))","v":640},{"$f":"IF(D38=0,\"\",E34+D38)","v":5672},{"$f":"IF(TA!$C$17=3,SUMIF(Dados!$B$2:$L$1081,TA!$A$18&PaM!$C38&PaM!$B$38,Dados!$J$2:$J$1081),VLOOKUP(TA!$D$18&$C38&$B$38,Dados!$A$2:$L$1081,10,0))","v":4279},{"$f":"IF(F38=0,\"\",G34+F38)","v":36111},{"$f":"IF(TA!$C$17=3,SUMIF(Dados!$B$2:$L$1081,TA!$A$18&PaM!$C38&PaM!$B$38,Dados!$K$2:$K$1081),VLOOKUP(TA!$D$18&$C38&$B$38,Dados!$A$2:$L$1081,11,0))","v":542},{"$f":"IF(H38=0,\"\",I34+H38)","v":6533},{"$f":"IF(TA!$C$17=3,SUMIF(Dados!$B$2:$L$1081,TA!$A$18&PaM!$C38&PaM!$B$38,Dados!$L$2:$L$1081),VLOOKUP(TA!$D$18&$C38&$B$38,Dados!$A$2:$L$1081,12,0))","v":154374},{"$f":"IF(J38=0,\"\",(J38/J34)-1)","v":-0.40260051855578349}]
[null,null,"Juizados",{"$f":"IF(TA!$C$17=3,SUMIF(Dados!$B$2:$L$1081,TA!$A$18&PaM!$C39&PaM!$B$38,Dados!$I$2:$I$1081),VLOOKUP(TA!$D$18&$C39&$B$38,Dados!$A$2:$L$1081,9,0))","v":9},{"$f":"IF(D39=0,\"\",E35+D39)","v":31},{"$f":"IF(TA!$C$17=3,SUMIF(Dados!$B$2:$L$1081,TA!$A$18&PaM!$C39&PaM!$B$38,Dados!$J$2:$J$1081),VLOOKUP(TA!$D$18&$C39&$B$38,Dados!$A$2:$L$1081,10,0))","v":913},{"$f":"IF(F39=0,\"\",G35+F39)","v":8275},{"$f":"IF(TA!$C$17=3,SUMIF(Dados!$B$2:$L$1081,TA!$A$18&PaM!$C39&PaM!$B$38,Dados!$K$2:$K$1081),VLOOKUP(TA!$D$18&$C39&$B$38,Dados!$A$2:$L$1081,11,0))","v":151},{"$f":"IF(H39=0,\"\",I35+H39)","v":2582},{"$f":"IF(TA!$C$17=3,SUMIF(Dados!$B$2:$L$1081,TA!$A$18&PaM!$C39&PaM!$B$38,Dados!$L$2:$L$1081),VLOOKUP(TA!$D$18&$C39&$B$38,Dados!$A$2:$L$1081,12,0))","v":19869},{"$f":"IF(J39=0,\"\",(J39/J35)-1)","v":-3.482949577382688E-2}]
[null,null,"Turmas Recursais",{"$f":"IF(TA!$C$17=3,SUMIF(Dados!$B$2:$L$1081,TA!$A$18&PaM!$C40&PaM!$B$38,Dados!$I$2:$I$1081),VLOOKUP(TA!$D$18&$C40&$B$38,Dados!$A$2:$L$1081,9,0))","v":124},{"$f":"IF(D40=0,\"\",E36+D40)","v":2971},{"$f":"IF(TA!$C$17=3,SUMIF(Dados!$B$2:$L$1081,TA!$A$18&PaM!$C40&PaM!$B$38,Dados!$J$2:$J$1081),VLOOKUP(TA!$D$18&$C40&$B$38,Dados!$A$2:$L$1081,10,0))","v":1300},{"$f":"IF(F40=0,\"\",G36+F40)","v":26535},{"$f":"IF(TA!$C$17=3,SUMIF(Dados!$B$2:$L$1081,TA!$A$18&PaM!$C40&PaM!$B$38,Dados!$K$2:$K$1081),VLOOKUP(TA!$D$18&$C40&$B$38,Dados!$A$2:$L$1081,11,0))","v":0},{"$f":"IF(H40=0,\"\",I36+H40)","v":""},{"$f":"IF(TA!$C$17=3,SUMIF(Dados!$B$2:$L$1081,TA!$A$18&PaM!$C40&PaM!$B$38,Dados!$L$2:$L$1081),VLOOKUP(TA!$D$18&$C40&$B$38,Dados!$A$2:$L$1081,12,0))","v":29722},-0.11099811563425355]
[null,"Total",null,{"$f":"SUM(D38:D40)","v":773},{"$f":"IF(D41=0,\"\",SUM(E38:E40))","v":8674},{"$f":"SUM(F38:F40)","v":6492},{"$f":"IF(F41=0,\"\",SUM(G38:G40))","v":70921},{"$f":"SUM(H38:H40)","v":693},{"$f":"IF(H41=0,\"\",SUM(I38:I40))","v":9115},{"$f":"SUM(J38:J40)","v":203965},-0.34716367558709338]
[null,"Setembro","Varas",{"$f":"IF(TA!$C$17=3,SUMIF(Dados!$B$2:$L$1081,TA!$A$18&PaM!$C42&PaM!$B$42,Dados!$I$2:$I$1081),VLOOKUP(TA!$D$18&$C42&$B$42,Dados!$A$2:$L$1081,9,0))","v":673},{"$f":"IF(D42=0,\"\",E38+D42)","v":6345},{"$f":"IF(TA!$C$17=3,SUMIF(Dados!$B$2:$L$1081,TA!$A$18&PaM!$C42&PaM!$B$42,Dados!$J$2:$J$1081),VLOOKUP(TA!$D$18&$C42&$B$42,Dados!$A$2:$L$1081,10,0))","v":2512},{"$f":"IF(F42=0,\"\",G38+F42)","v":38623},{"$f":"IF(TA!$C$17=3,SUMIF(Dados!$B$2:$L$1081,TA!$A$18&PaM!$C42&PaM!$B$42,Dados!$K$2:$K$1081),VLOOKUP(TA!$D$18&$C42&$B$42,Dados!$A$2:$L$1081,11,0))","v":397},{"$f":"IF(H42=0,\"\",I38+H42)","v":6930},{"$f":"IF(TA!$C$17=3,SUMIF(Dados!$B$2:$L$1081,TA!$A$18&PaM!$C42&PaM!$B$42,Dados!$L$2:$L$1081),VLOOKUP(TA!$D$18&$C42&$B$42,Dados!$A$2:$L$1081,12,0))","v":132698},{"$f":"IF(J42=0,\"\",(J42/J38)-1)","v":-0.14041224558539656}]
[null,null,"Juizados",{"$f":"IF(TA!$C$17=3,SUMIF(Dados!$B$2:$L$1081,TA!$A$18&PaM!$C43&PaM!$B$42,Dados!$I$2:$I$1081),VLOOKUP(TA!$D$18&$C43&$B$42,Dados!$A$2:$L$1081,9,0))","v":4},{"$f":"IF(D43=0,\"\",E39+D43)","v":35},{"$f":"IF(TA!$C$17=3,SUMIF(Dados!$B$2:$L$1081,TA!$A$18&PaM!$C43&PaM!$B$42,Dados!$J$2:$J$1081),VLOOKUP(TA!$D$18&$C43&$B$42,Dados!$A$2:$L$1081,10,0))","v":1043},{"$f":"IF(F43=0,\"\",G39+F43)","v":9318},{"$f":"IF(TA!$C$17=3,SUMIF(Dados!$B$2:$L$1081,TA!$A$18&PaM!$C43&PaM!$B$42,Dados!$K$2:$K$1081),VLOOKUP(TA!$D$18&$C43&$B$42,Dados!$A$2:$L$1081,11,0))","v":142},{"$f":"IF(H43=0,\"\",I39+H43)","v":2724},{"$f":"IF(TA!$C$17=3,SUMIF(Dados!$B$2:$L$1081,TA!$A$18&PaM!$C43&PaM!$B$42,Dados!$L$2:$L$1081),VLOOKUP(TA!$D$18&$C43&$B$42,Dados!$A$2:$L$1081,12,0))","v":21248},{"$f":"IF(J43=0,\"\",(J43/J39)-1)","v":6.940460013085703E-2}]
[null,null,"Turmas Recursais",{"$f":"IF(TA!$C$17=3,SUMIF(Dados!$B$2:$L$1081,TA!$A$18&PaM!$C44&PaM!$B$42,Dados!$I$2:$I$1081),VLOOKUP(TA!$D$18&$C44&$B$42,Dados!$A$2:$L$1081,9,0))","v":91},{"$f":"IF(D44=0,\"\",E40+D44)","v":3062},{"$f":"IF(TA!$C$17=3,SUMIF(Dados!$B$2:$L$1081,TA!$A$18&PaM!$C44&PaM!$B$42,Dados!$J$2:$J$1081),VLOOKUP(TA!$D$18&$C44&$B$42,Dados!$A$2:$L$1081,10,0))","v":916},{"$f":"IF(F44=0,\"\",G40+F44)","v":27451},{"$f":"IF(TA!$C$17=3,SUMIF(Dados!$B$2:$L$1081,TA!$A$18&PaM!$C44&PaM!$B$42,Dados!$K$2:$K$1081),VLOOKUP(TA!$D$18&$C44&$B$42,Dados!$A$2:$L$1081,11,0))","v":0},{"$f":"IF(H44=0,\"\",I40+H44)","v":""},{"$f":"IF(TA!$C$17=3,SUMIF(Dados!$B$2:$L$1081,TA!$A$18&PaM!$C44&PaM!$B$42,Dados!$L$2:$L$1081),VLOOKUP(TA!$D$18&$C44&$B$42,Dados!$A$2:$L$1081,12,0))","v":26449},-0.11012044949868782]
[null,"Total",null,{"$f":"SUM(D42:D44)","v":768},{"$f":"IF(D45=0,\"\",SUM(E42:E44))","v":9442},{"$f":"SUM(F42:F44)","v":4471},{"$f":"IF(F45=0,\"\",SUM(G42:G44))","v":75392},{"$f":"SUM(H42:H44)","v":539},{"$f":"IF(H45=0,\"\",SUM(I42:I44))","v":9654},{"$f":"SUM(J42:J44)","v":180395},-0.11555904199249867]
[null,"Outubro","Varas",{"$f":"IF(TA!$C$17=3,SUMIF(Dados!$B$2:$L$1081,TA!$A$18&PaM!$C46&PaM!$B$46,Dados!$I$2:$I$1081),VLOOKUP(TA!$D$18&$C46&$B$46,Dados!$A$2:$L$1081,9,0))","v":567},{"$f":"IF(D46=0,\"\",E42+D46)","v":6912},{"$f":"IF(TA!$C$17=3,SUMIF(Dados!$B$2:$L$1081,TA!$A$18&PaM!$C46&PaM!$B$46,Dados!$J$2:$J$1081),VLOOKUP(TA!$D$18&$C46&$B$46,Dados!$A$2:$L$1081,10,0))","v":2358},{"$f":"IF(F46=0,\"\",G42+F46)","v":40981},{"$f":"IF(TA!$C$17=3,SUMIF(Dados!$B$2:$L$1081,TA!$A$18&PaM!$C46&PaM!$B$46,Dados!$K$2:$K$1081),VLOOKUP(TA!$D$18&$C46&$B$46,Dados!$A$2:$L$1081,11,0))","v":442},{"$f":"IF(H46=0,\"\",I42+H46)","v":7372},{"$f":"IF(TA!$C$17=3,SUMIF(Dados!$B$2:$L$1081,TA!$A$18&PaM!$C46&PaM!$B$46,Dados!$L$2:$L$1081),VLOOKUP(TA!$D$18&$C46&$B$46,Dados!$A$2:$L$1081,12,0))","v":118947},-0.10362627922048562]
[null,null,"Juizados",{"$f":"IF(TA!$C$17=3,SUMIF(Dados!$B$2:$L$1081,TA!$A$18&PaM!$C47&PaM!$B$46,Dados!$I$2:$I$1081),VLOOKUP(TA!$D$18&$C47&$B$46,Dados!$A$2:$L$1081,9,0))","v":5},{"$f":"IF(D47=0,\"\",E43+D47)","v":40},{"$f":"IF(TA!$C$17=3,SUMIF(Dados!$B$2:$L$1081,TA!$A$18&PaM!$C47&PaM!$B$46,Dados!$J$2:$J$1081),VLOOKUP(TA!$D$18&$C47&$B$46,Dados!$A$2:$L$1081,10,0))","v":1369},{"$f":"IF(F47=0,\"\",G43+F47)","v":10687},{"$f":"IF(TA!$C$17=3,SUMIF(Dados!$B$2:$L$1081,TA!$A$18&PaM!$C47&PaM!$B$46,Dados!$K$2:$K$1081),VLOOKUP(TA!$D$18&$C47&$B$46,Dados!$A$2:$L$1081,11,0))","v":144},{"$f":"IF(H47=0,\"\",I43+H47)","v":2868},{"$f":"IF(TA!$C$17=3,SUMIF(Dados!$B$2:$L$1081,TA!$A$18&PaM!$C47&PaM!$B$46,Dados!$L$2:$L$1081),VLOOKUP(TA!$D$18&$C47&$B$46,Dados!$A$2:$L$1081,12,0))","v":18345},-0.13662462349397586]
[null,null,"Turmas Recursais",{"$f":"IF(TA!$C$17=3,SUMIF(Dados!$B$2:$L$1081,TA!$A$18&PaM!$C48&PaM!$B$46,Dados!$I$2:$I$1081),VLOOKUP(TA!$D$18&$C48&$B$46,Dados!$A$2:$L$1081,9,0))","v":132},{"$f":"IF(D48=0,\"\",E44+D48)","v":3194},{"$f":"IF(TA!$C$17=3,SUMIF(Dados!$B$2:$L$1081,TA!$A$18&PaM!$C48&PaM!$B$46,Dados!$J$2:$J$1081),VLOOKUP(TA!$D$18&$C48&$B$46,Dados!$A$2:$L$1081,10,0))","v":806},{"$f":"IF(F48=0,\"\",G44+F48)","v":28257},{"$f":"IF(TA!$C$17=3,SUMIF(Dados!$B$2:$L$1081,TA!$A$18&PaM!$C48&PaM!$B$46,Dados!$K$2:$K$1081),VLOOKUP(TA!$D$18&$C48&$B$46,Dados!$A$2:$L$1081,11,0))","v":0},{"$f":"IF(H48=0,\"\",I44+H48)","v":""},{"$f":"IF(TA!$C$17=3,SUMIF(Dados!$B$2:$L$1081,TA!$A$18&PaM!$C48&PaM!$B$46,Dados!$L$2:$L$1081),VLOOKUP(TA!$D$18&$C48&$B$46,Dados!$A$2:$L$1081,12,0))","v":25098},-5.1079435895497016E-2]
[null,"Total",null,{"$f":"SUM(D46:D48)","v":704},{"$f":"IF(D49=0,\"\",SUM(E46:E48))","v":10146},{"$f":"SUM(F46:F48)","v":4533},{"$f":"IF(F49=0,\"\",SUM(G46:G48))","v":79925},{"$f":"SUM(H46:H48)","v":586},{"$f":"IF(H49=0,\"\",SUM(I46:I48))","v":10240},{"$f":"SUM(J46:J48)","v":162390},-9.9808753014218765E-2]
[null,"Novembro","Varas",{"$f":"IF(TA!$C$17=3,SUMIF(Dados!$B$2:$L$1081,TA!$A$18&PaM!$C50&PaM!$B$50,Dados!$I$2:$I$1081),VLOOKUP(TA!$D$18&$C50&$B$50,Dados!$A$2:$L$1081,9,0))","v":562},{"$f":"IF(D50=0,\"\",E46+D50)","v":7474},{"$f":"IF(TA!$C$17=3,SUMIF(Dados!$B$2:$L$1081,TA!$A$18&PaM!$C50&PaM!$B$50,Dados!$J$2:$J$1081),VLOOKUP(TA!$D$18&$C50&$B$50,Dados!$A$2:$L$1081,10,0))","v":1323},{"$f":"IF(F50=0,\"\",G46+F50)","v":42304},{"$f":"IF(TA!$C$17=3,SUMIF(Dados!$B$2:$L$1081,TA!$A$18&PaM!$C50&PaM!$B$50,Dados!$K$2:$K$1081),VLOOKUP(TA!$D$18&$C50&$B$50,Dados!$A$2:$L$1081,11,0))","v":243},{"$f":"IF(H50=0,\"\",I46+H50)","v":7615},{"$f":"IF(TA!$C$17=3,SUMIF(Dados!$B$2:$L$1081,TA!$A$18&PaM!$C50&PaM!$B$50,Dados!$L$2:$L$1081),VLOOKUP(TA!$D$18&$C50&$B$50,Dados!$A$2:$L$1081,12,0))","v":109315},-8.0977241964908742E-2]
[null,null,"Juizados",{"$f":"IF(TA!$C$17=3,SUMIF(Dados!$B$2:$L$1081,TA!$A$18&PaM!$C51&PaM!$B$50,Dados!$I$2:$I$1081),VLOOKUP(TA!$D$18&$C51&$B$50,Dados!$A$2:$L$1081,9,0))","v":2},{"$f":"IF(D51=0,\"\",E47+D51)","v":42},{"$f":"IF(TA!$C$17=3,SUMIF(Dados!$B$2:$L$1081,TA!$A$18&PaM!$C51&PaM!$B$50,Dados!$J$2:$J$1081),VLOOKUP(TA!$D$18&$C51&$B$50,Dados!$A$2:$L$1081,10,0))","v":480},{"$f":"IF(F51=0,\"\",G47+F51)","v":11167},{"$f":"IF(TA!$C$17=3,SUMIF(Dados!$B$2:$L$1081,TA!$A$18&PaM!$C51&PaM!$B$50,Dados!$K$2:$K$1081),VLOOKUP(TA!$D$18&$C51&$B$50,Dados!$A$2:$L$1081,11,0))","v":85},{"$f":"IF(H51=0,\"\",I47+H51)","v":2953},{"$f":"IF(TA!$C$17=3,SUMIF(Dados!$B$2:$L$1081,TA!$A$18&PaM!$C51&PaM!$B$50,Dados!$L$2:$L$1081),VLOOKUP(TA!$D$18&$C51&$B$50,Dados!$A$2:$L$1081,12,0))","v":16675},-9.1032979013355164E-2]
[null,null,"Turmas Recursais",{"$f":"IF(TA!$C$17=3,SUMIF(Dados!$B$2:$L$1081,TA!$A$18&PaM!$C52&PaM!$B$50,Dados!$I$2:$I$1081),VLOOKUP(TA!$D$18&$C52&$B$50,Dados!$A$2:$L$1081,9,0))","v":100},{"$f":"IF(D52=0,\"\",E48+D52)","v":3294},{"$f":"IF(TA!$C$17=3,SUMIF(Dados!$B$2:$L$1081,TA!$A$18&PaM!$C52&PaM!$B$50,Dados!$J$2:$J$1081),VLOOKUP(TA!$D$18&$C52&$B$50,Dados!$A$2:$L$1081,10,0))","v":721},{"$f":"IF(F52=0,\"\",G48+F52)","v":28978},{"$f":"IF(TA!$C$17=3,SUMIF(Dados!$B$2:$L$1081,TA!$A$18&PaM!$C52&PaM!$B$50,Dados!$K$2:$K$1081),VLOOKUP(TA!$D$18&$C52&$B$50,Dados!$A$2:$L$1081,11,0))","v":0},{"$f":"IF(H52=0,\"\",I48+H52)","v":""},{"$f":"IF(TA!$C$17=3,SUMIF(Dados!$B$2:$L$1081,TA!$A$18&PaM!$C52&PaM!$B$50,Dados!$L$2:$L$1081),VLOOKUP(TA!$D$18&$C52&$B$50,Dados!$A$2:$L$1081,12,0))","v":24537},-2.23523786755917E-2]
[null,"Total",null,{"$f":"SUM(D50:D52)","v":664},{"$f":"IF(D53=0,\"\",SUM(E50:E52))","v":10810},{"$f":"SUM(F50:F52)","v":2524},{"$f":"IF(F53=0,\"\",SUM(G50:G52))","v":82449},{"$f":"SUM(H50:H52)","v":328},{"$f":"IF(H53=0,\"\",SUM(I50:I52))","v":10568},{"$f":"SUM(J50:J52)","v":150527},-7.305252786501637E-2]
[null,"Dezembro","Varas",{"$f":"IF(TA!$C$17=3,SUMIF(Dados!$B$2:$L$1081,TA!$A$18&PaM!$C54&PaM!$B$54,Dados!$I$2:$I$1081),VLOOKUP(TA!$D$18&$C54&$B$54,Dados!$A$2:$L$1081,9,0))","v":485},{"$f":"IF(D54=0,\"\",E50+D54)","v":7959},{"$f":"IF(TA!$C$17=3,SUMIF(Dados!$B$2:$L$1081,TA!$A$18&PaM!$C54&PaM!$B$54,Dados!$J$2:$J$1081),VLOOKUP(TA!$D$18&$C54&$B$54,Dados!$A$2:$L$1081,10,0))","v":1067},{"$f":"IF(F54=0,\"\",G50+F54)","v":43371},{"$f":"IF(TA!$C$17=3,SUMIF(Dados!$B$2:$L$1081,TA!$A$18&PaM!$C54&PaM!$B$54,Dados!$K$2:$K$1081),VLOOKUP(TA!$D$18&$C54&$B$54,Dados!$A$2:$L$1081,11,0))","v":191},{"$f":"IF(H54=0,\"\",I50+H54)","v":7806},{"$f":"IF(TA!$C$17=3,SUMIF(Dados!$B$2:$L$1081,TA!$A$18&PaM!$C54&PaM!$B$54,Dados!$L$2:$L$1081),VLOOKUP(TA!$D$18&$C54&$B$54,Dados!$A$2:$L$1081,12,0))","v":100231},{"$f":"IF(J54=0,\"\",(J54/J50)-1)","v":-8.3099300187531422E-2}]
[null,null,"Juizados",{"$f":"IF(TA!$C$17=3,SUMIF(Dados!$B$2:$L$1081,TA!$A$18&PaM!$C55&PaM!$B$54,Dados!$I$2:$I$1081),VLOOKUP(TA!$D$18&$C55&$B$54,Dados!$A$2:$L$1081,9,0))","v":3},{"$f":"IF(D55=0,\"\",E51+D55)","v":45},{"$f":"IF(TA!$C$17=3,SUMIF(Dados!$B$2:$L$1081,TA!$A$18&PaM!$C55&PaM!$B$54,Dados!$J$2:$J$1081),VLOOKUP(TA!$D$18&$C55&$B$54,Dados!$A$2:$L$1081,10,0))","v":319},{"$f":"IF(F55=0,\"\",G51+F55)","v":11486},{"$f":"IF(TA!$C$17=3,SUMIF(Dados!$B$2:$L$1081,TA!$A$18&PaM!$C55&PaM!$B$54,Dados!$K$2:$K$1081),VLOOKUP(TA!$D$18&$C55&$B$54,Dados!$A$2:$L$1081,11,0))","v":153},{"$f":"IF(H55=0,\"\",I51+H55)","v":3106},{"$f":"IF(TA!$C$17=3,SUMIF(Dados!$B$2:$L$1081,TA!$A$18&PaM!$C55&PaM!$B$54,Dados!$L$2:$L$1081),VLOOKUP(TA!$D$18&$C55&$B$54,Dados!$A$2:$L$1081,12,0))","v":15130},{"$f":"IF(J55=0,\"\",(J55/J51)-1)","v":-9.2653673163418326E-2}]
[null,null,"Turmas Recursais",{"$f":"IF(TA!$C$17=3,SUMIF(Dados!$B$2:$L$1081,TA!$A$18&PaM!$C56&PaM!$B$54,Dados!$I$2:$I$1081),VLOOKUP(TA!$D$18&$C56&$B$54,Dados!$A$2:$L$1081,9,0))","v":63},{"$f":"IF(D56=0,\"\",E52+D56)","v":3357},{"$f":"IF(TA!$C$17=3,SUMIF(Dados!$B$2:$L$1081,TA!$A$18&PaM!$C56&PaM!$B$54,Dados!$J$2:$J$1081),VLOOKUP(TA!$D$18&$C56&$B$54,Dados!$A$2:$L$1081,10,0))","v":533},{"$f":"IF(F56=0,\"\",G52+F56)","v":29511},{"$f":"IF(TA!$C$17=3,SUMIF(Dados!$B$2:$L$1081,TA!$A$18&PaM!$C56&PaM!$B$54,Dados!$K$2:$K$1081),VLOOKUP(TA!$D$18&$C56&$B$54,Dados!$A$2:$L$1081,11,0))","v":0},{"$f":"IF(H56=0,\"\",I52+H56)","v":""},{"$f":"IF(TA!$C$17=3,SUMIF(Dados!$B$2:$L$1081,TA!$A$18&PaM!$C56&PaM!$B$54,Dados!$L$2:$L$1081),VLOOKUP(TA!$D$18&$C56&$B$54,Dados!$A$2:$L$1081,12,0))","v":24048},{"$f":"IF(J56=0,\"\",(J56/J52)-1)","v":-1.9929086685413822E-2}]
[null,"Total",null,{"$f":"SUM(D54:D56)","v":551},{"$f":"IF(D57=0,\"\",SUM(E54:E56))","v":11361},{"$f":"SUM(F54:F56)","v":1919},{"$f":"IF(F57=0,\"\",SUM(G54:G56))","v":84368},{"$f":"SUM(H54:H56)","v":344},{"$f":"IF(H57=0,\"\",SUM(I54:I56))","v":10912},{"$f":"SUM(J54:J56)","v":139409},{"$f":"IF(J57=0,\"\",(J57/J53)-1)","v":-7.3860503431278146E-2}]
[null,"Consolidado","Varas",{"$f":"D10+D14+D18+D22+D26+D30+D34+D38+D42+D46+D50+D54","v":7959},null,{"$f":"F10+F14+F18+F22+F26+F30+F34+F38+F42+F46+F50+F54","v":43371},null,7806]
[null,null,"Juizados",{"$f":"D11+D15+D19+D23+D27+D31+D35+D39+D43+D47+D51+D55","v":45},null,11486,null,3106]
[null,null,"Turmas Recursais",{"$f":"D12+D16+D20+D24+D28+D32+D36+D40+D44+D48+D52+D56","v":3357},null,29511,null,0]
[null,"Total",null,{"$f":"SUM(D58:D60)","v":11361},null,{"$f":"SUM(F58:F60)","v":84368},null,{"$f":"SUM(H58:H60)","v":10912}]
[]
[null,"OBS.: Os valores poderão ser alterados, em função de modificações na base de dados, por parte do usuário."]
[]
[null,"_ Desde o dia 23 de Fevereiro de 2018, o NOVO sistema processual \"Eproc\" está em funcionamento na Justiça Federal da 2ª Região.\n(Inicialmente, a implantação do Eproc, ocorreu nos Juizados Especiais Federais de Vitória e Turmas Recursais do Espírito Santo.)"]

{"sheet":"GTvM","index":3,"n_rows":1,"n_cols":24,"rows_kept":1,"cut":false,"hidden":true,"merged":[[0,0,0,6],[0,10,0,11],[0,14,0,15],[26,1,49,7],[26,9,49,15],[1,1,24,7],[1,9,24,15]]}
["TRAMITAÇÃO de Processos na Seção Judiciária:  ",null,null,null,null,null,null,null,null,null,"no Ano de:  ",null,null,null,null,null,null,null,null,null,null,null,null,"SpA"]

{"sheet":"GDaM","index":4,"n_rows":1,"n_cols":24,"rows_kept":1,"cut":false,"hidden":true,"merged":[[0,0,0,6],[0,10,0,11],[0,14,0,15],[26,1,49,7],[26,9,49,15],[1,1,24,7],[1,9,24,15]]}
["Total de Processos DISTRIBUÍDOS na Seção Judiciária:  ",null,null,null,null,null,null,null,null,null,"no Ano de:  ",null,null,null,null,null,null,null,null,null,null,null,null,"SpA"]

{"sheet":"GJaM","index":5,"n_rows":1,"n_cols":24,"rows_kept":1,"cut":false,"hidden":true,"merged":[[0,0,0,6],[0,10,0,11],[0,14,0,15],[26,1,49,7],[26,9,49,15],[1,1,24,7],[1,9,24,15]]}
["Total de Processos JULGADOS na Seção Judiciária:  ",null,null,null,null,null,null,null,null,null,"no Ano de:  ",null,null,null,null,null,null,null,null,null,null,null,null,"SpA"]

{"sheet":"PvAAe","index":6,"n_rows":73,"n_cols":34,"rows_kept":73,"cut":false,"hidden":true,"merged":[[72,1,72,20],[57,1,59,1],[61,1,63,1],[65,1,67,1],[5,1,7,1],[17,1,19,1],[53,1,55,1],[29,1,31,1],[41,1,43,1],[45,1,47,1],[49,1,51,1],[9,1,11,1],[13,1,15,1],[21,1,23,1],[25,1,27,1],[33,1,35,1],[3,22,3,27],[37,1,39,1],[1,3,1,4],[3,3,3,8],[3,10,3,15],[3,17,3,20]]}
[]
[null,null,null,"Seção Judiciária",null,null,null,null,"Mapa ACUMULADO do 1º Grau (2006 a 2017 Apolo)  (2018 e 2019 Apolo e \"Eproc\")"]
[]
[null,null,null,"Distribuídos",null,null,null,null,null,null,"Julgados",null,null,null,null,null,null,"Remetidos ao TRF/TR",null,null,null,null,"Tramitação \"Real\""]
[null,"Mês","Tipo de Juízo","Apolo","% Var","Eproc","% Var","TOTAL","% Var",null,"Apolo","% Var","Eproc","% Var","TOTAL","% Var",null,"Apolo","Eproc","TOTAL","% Var",null,"Apolo","% Variação","Eproc","% Variação","TOTAL","% Variação"]
[null,2005,"Varas",{"$f":"IF(TA!$C$17=3,SUMIF(Dados!$D$2:$L$1081,$B$6&$C6,Dados!I$2:I$1081),SUMIF(Dados!$C$2:$L$1081,$B$6&TA!$C$18&$C6,Dados!I$2:I$1081))","v":103539},null,null,null,null,null,null,{"$f":"IF(TA!$C$17=3,SUMIF(Dados!$D$2:$L$1081,$B$6&$C6,Dados!J$2:J$1081),SUMIF(Dados!$C$2:$L$1081,$B$6&TA!$C$18&$C6,Dados!J$2:J$1081))","v":61312},null,null,null,null,null,null,{"$f":"IF(TA!$C$17=3,SUMIF(Dados!$D$2:$L$1081,$B$6&$C6,Dados!K$2:K$1081),SUMIF(Dados!$C$2:$L$1081,$B$6&TA!$C$18&$C6,Dados!K$2:K$1081))","v":20345},null,null,null,null,{"$f":"IF(TA!$C$17=3,SUMIF(Dados!$B$2:$L$1081,$B$6&$C6&TA!$F$17,Dados!L$2:L$1081),VLOOKUP($B$6&TA!$C$18&$C6&TA!$F$17,Dados!$A$2:$L$1081,12,0))","v":611472}]
[null,null,"Juizados",{"$f":"IF(TA!$C$17=3,SUMIF(Dados!$D$2:$L$1081,$B$6&$C7,Dados!I$2:I$1081),SUMIF(Dados!$C$2:$L$1081,$B$6&TA!$C$18&$C7,Dados!I$2:I$1081))","v":179418},null,null,null,null,null,null,{"$f":"IF(TA!$C$17=3,SUMIF(Dados!$D$2:$L$1081,$B$6&$C7,Dados!J$2:J$1081),SUMIF(Dados!$C$2:$L$1081,$B$6&TA!$C$18&$C7,Dados!J$2:J$1081))","v":139210},null,null,null,null,null,null,{"$f":"IF(TA!$C$17=3,SUMIF(Dados!$D$2:$L$1081,$B$6&$C7,Dados!K$2:K$1081),SUMIF(Dados!$C$2:$L$1081,$B$6&TA!$C$18&$C7,Dados!K$2:K$1081))","v":26485},null,null,null,null,{"$f":"IF(TA!$C$17=3,SUMIF(Dados!$B$2:$L$1081,$B$6&$C7&TA!$F$17,Dados!L$2:L$1081),VLOOKUP($B$6&TA!$C$18&$C7&TA!$F$17,Dados!$A$2:$L$1081,12,0))","v":195008}]
[null,null,"Turmas Recursais",{"$f":"IF(TA!$C$17=3,SUMIF(Dados!$D$2:$L$1081,$B$6&$C8,Dados!I$2:I$1081),SUMIF(Dados!$C$2:$L$1081,$B$6&TA!$C$18&$C8,Dados!I$2:I$1081))","v":25874},null,null,null,null,null,null,{"$f":"IF(TA!$C$17=3,SUMIF(Dados!$D$2:$L$1081,$B$6&$C8,Dados!J$2:J$1081),SUMIF(Dados!$C$2:$L$1081,$B$6&TA!$C$18&$C8,Dados!J$2:J$1081))","v":3699},null,null,null,null,null,null,{"$f":"IF(TA!$C$17=3,SUMIF(Dados!$D$2:$L$1081,$B$6&$C8,Dados!K$2:K$1081),SUMIF(Dados!$C$2:$L$1081,$B$6&TA!$C$18&$C8,Dados!K$2:K$1081))","v":0},null,null,null,null,{"$f":"IF(TA!$C$17=3,SUMIF(Dados!$B$2:$L$1081,$B$6&$C8&TA!$F$17,Dados!L$2:L$1081),VLOOKUP($B$6&TA!$C$18&$C8&TA!$F$17,Dados!$A$2:$L$1081,12,0))","v":16499}]
[null,"Total",null,{"$f":"SUM(D6:D8)","v":308831},null,null,null,null,null,null,{"$f":"SUM(K6:K8)","v":204221},null,null,null,null,null,null,{"$f":"SUM(R6:R8)","v":46830},null,null,null,null,{"$f":"SUM(W6:W8)","v":822979}]
[null,2006,"Varas",{"$f":"IF(TA!$C$17=3,SUMIF(Dados!$D$2:$L$1081,$B$10&$C10,Dados!I$2:I$1081),SUMIF(Dados!$C$2:$L$1081,$B$10&TA!$C$18&$C10,Dados!I$2:I$1081))","v":127713},{"$f":"IF(D10=0,\"\",(D10/D6)-1)","v":0.23347724046011642},null,null,null,null,null,{"$f":"IF(TA!$C$17=3,SUMIF(Dados!$D$2:$L$1081,$B$10&$C10,Dados!J$2:J$1081),SUMIF(Dados!$C$2:$L$1081,$B$10&TA!$C$18&$C10,Dados!J$2:J$1081))","v":70566},{"$f":"IF(K10=0,\"\",(K10/K6)-1)","v":0.15093293319415446},null,null,null,null,null,{"$f":"IF(TA!$C$17=3,SUMIF(Dados!$D$2:$L$1081,$B$10&$C10,Dados!K$2:K$1081),SUMIF(Dados!$C$2:$L$1081,$B$10&TA!$C$18&$C10,Dados!K$2:K$1081))","v":22501},null,null,null,null,{"$f":"IF(TA!$C$17=3,SUMIF(Dados!$B$2:$L$1081,$B$10&$C10&TA!$F$17,Dados!L$2:L$1081),VLOOKUP($B$10&TA!$C$18&$C10&TA!$F$17,Dados!$A$2:$L$1081,12,0))","v":642234},{"$f":"IF(W10=0,\"\",(W10/W6)-1)","v":5.0308108956746977E-2}]
[null,null,"Juizados",{"$f":"IF(TA!$C$17=3,SUMIF(Dados!$D$2:$L$1081,$B$10&$C11,Dados!I$2:I$1081),SUMIF(Dados!$C$2:$L$1081,$B$10&TA!$C$18&$C11,Dados!I$2:I$1081))","v":187586},4.5524975197583251E-2,null,null,null,null,null,{"$f":"IF(TA!$C$17=3,SUMIF(Dados!$D$2:$L$1081,$B$10&$C11,Dados!J$2:J$1081),SUMIF(Dados!$C$2:$L$1081,$B$10&TA!$C$18&$C11,Dados!J$2:J$1081))","v":201622},0.44832986136053443,null,null,null,null,null,{"$f":"IF(TA!$C$17=3,SUMIF(Dados!$D$2:$L$1081,$B$10&$C11,Dados!K$2:K$1081),SUMIF(Dados!$C$2:$L$1081,$B$10&TA!$C$18&$C11,Dados!K$2:K$1081))","v":32844},null,null,null,null,{"$f":"IF(TA!$C$17=3,SUMIF(Dados!$B$2:$L$1081,$B$10&$C11&TA!$F$17,Dados!L$2:L$1081),VLOOKUP($B$10&TA!$C$18&$C11&TA!$F$17,Dados!$A$2:$L$1081,12,0))","v":143456},-0.2643583852970135]
[null,null,"Turmas Recursais",{"$f":"IF(TA!$C$17=3,SUMIF(Dados!$D$2:$L$1081,$B$10&$C12,Dados!I$2:I$1081),SUMIF(Dados!$C$2:$L$1081,$B$10&TA!$C$18&$C12,Dados!I$2:I$1081))","v":32582},0.25925639638246878,null,null,null,null,null,{"$f":"IF(TA!$C$17=3,SUMIF(Dados!$D$2:$L$1081,$B$10&$C12,Dados!J$2:J$1081),SUMIF(Dados!$C$2:$L$1081,$B$10&TA!$C$18&$C12,Dados!J$2:J$1081))","v":27176},6.3468505001351714,null,null,null,null,null,{"$f":"IF(TA!$C$17=3,SUMIF(Dados!$D$2:$L$1081,$B$10&$C12,Dados!K$2:K$1081),SUMIF(Dados!$C$2:$L$1081,$B$10&TA!$C$18&$C12,Dados!K$2:K$1081))","v":0},null,null,null,null,{"$f":"IF(TA!$C$17=3,SUMIF(Dados!$B$2:$L$1081,$B$10&$C12&TA!$F$17,Dados!L$2:L$1081),VLOOKUP($B$10&TA!$C$18&$C12&TA!$F$17,Dados!$A$2:$L$1081,12,0))","v":20495},0.24219649675737931]
[null,"Total",null,{"$f":"SUM(D10:D12)","v":347881},0.12644456029349382,null,null,null,null,null,{"$f":"SUM(K10:K12)","v":299364},0.46588254880741942,null,null,null,null,null,{"$f":"SUM(R10:R12)","v":55345},null,null,null,null,{"$f":"SUM(W10:W12)","v":806185},-2.0406353017513257E-2]
[null,2007,"Varas",{"$f":"IF(TA!$C$17=3,SUMIF(Dados!$D$2:$L$1081,$B$14&$C14,Dados!I$2:I$1081),SUMIF(Dados!$C$2:$L$1081,$B$14&TA!$C$18&$C14,Dados!I$2:I$1081))","v":134929},5.6501687377165988E-2,null,null,null,null,null,{"$f":"IF(TA!$C$17=3,SUMIF(Dados!$D$2:$L$1081,$B$14&$C14,Dados!J$2:J$1081),SUMIF(Dados!$C$2:$L$1081,$B$14&TA!$C$18&$C14,Dados!J$2:J$1081))","v":72817},3.1899214919366203E-2,null,null,null,null,null,{"$f":"IF(TA!$C$17=3,SUMIF(Dados!$D$2:$L$1081,$B$14&$C14,Dados!K$2:K$1081),SUMIF(Dados!$C$2:$L$1081,$B$14&TA!$C$18&$C14,Dados!K$2:K$1081))","v":24587},null,null,null,null,{"$f":"IF(TA!$C$17=3,SUMIF(Dados!$B$2:$L$1081,$B$14&$C14&TA!$F$17,Dados!L$2:L$1081),VLOOKUP($B$14&TA!$C$18&$C14&TA!$F$17,Dados!$A$2:$L$1081,12,0))","v":672198},4.6655891777763303E-2]
[null,null,"Juizados",{"$f":"IF(TA!$C$17=3,SUMIF(Dados!$D$2:$L$1081,$B$14&$C15,Dados!I$2:I$1081),SUMIF(Dados!$C$2:$L$1081,$B$14&TA!$C$18&$C15,Dados!I$2:I$1081))","v":199569},6.3880033691213534E-2,null,null,null,null,null,{"$f":"IF(TA!$C$17=3,SUMIF(Dados!$D$2:$L$1081,$B$14&$C15,Dados!J$2:J$1081),SUMIF(Dados!$C$2:$L$1081,$B$14&TA!$C$18&$C15,Dados!J$2:J$1081))","v":150066},-0.25570622253523922,null,null,null,null,null,{"$f":"IF(TA!$C$17=3,SUMIF(Dados!$D$2:$L$1081,$B$14&$C15,Dados!K$2:K$1081),SUMIF(Dados!$C$2:$L$1081,$B$14&TA!$C$18&$C15,Dados!K$2:K$1081))","v":27989},null,null,null,null,{"$f":"IF(TA!$C$17=3,SUMIF(Dados!$B$2:$L$1081,$B$14&$C15&TA!$F$17,Dados!L$2:L$1081),VLOOKUP($B$14&TA!$C$18&$C15&TA!$F$17,Dados!$A$2:$L$1081,12,0))","v":171510},0.19555821994200318]
[null,null,"Turmas Recursais",{"$f":"IF(TA!$C$17=3,SUMIF(Dados!$D$2:$L$1081,$B$14&$C16,Dados!I$2:I$1081),SUMIF(Dados!$C$2:$L$1081,$B$14&TA!$C$18&$C16,Dados!I$2:I$1081))","v":29581},-9.2106070836658227E-2,null,null,null,null,null,{"$f":"IF(TA!$C$17=3,SUMIF(Dados!$D$2:$L$1081,$B$14&$C16,Dados!J$2:J$1081),SUMIF(Dados!$C$2:$L$1081,$B$14&TA!$C$18&$C16,Dados!J$2:J$1081))","v":39847},0.46625699146305566,null,null,null,null,null,{"$f":"IF(TA!$C$17=3,SUMIF(Dados!$D$2:$L$1081,$B$14&$C16,Dados!K$2:K$1081),SUMIF(Dados!$C$2:$L$1081,$B$14&TA!$C$18&$C16,Dados!K$2:K$1081))","v":0},null,null,null,null,{"$f":"IF(TA!$C$17=3,SUMIF(Dados!$B$2:$L$1081,$B$14&$C16&TA!$F$17,Dados!L$2:L$1081),VLOOKUP($B$14&TA!$C$18&$C16&TA!$F$17,Dados!$A$2:$L$1081,12,0))","v":15098},-0.26333252012686026]
[null,"Total",null,{"$f":"SUM(D14:D16)","v":364079},4.6561899040189036E-2,null,null,null,null,null,{"$f":"SUM(K14:K16)","v":262730},-0.12237276359214866,null,null,null,null,null,{"$f":"SUM(R14:R16)","v":52576},null,null,null,null,{"$f":"SUM(W14:W16)","v":858806},6.5271618797174247E-2]
[null,2008,"Varas",{"$f":"IF(TA!$C$17=3,SUMIF(Dados!$D$2:$L$1081,$B$18&$C18,Dados!I$2:I$1081),SUMIF(Dados!$C$2:$L$1081,$B$18&TA!$C$18&$C18,Dados!I$2:I$1081))","v":107561},-0.20283260084933563,null,null,null,null,null,{"$f":"IF(TA!$C$17=3,SUMIF(Dados!$D$2:$L$1081,$B$18&$C18,Dados!J$2:J$1081),SUMIF(Dados!$C$2:$L$1081,$B$18&TA!$C$18&$C18,Dados!J$2:J$1081))","v":72582},-3.2272683576637373E-3,null,null,null,null,null,{"$f":"IF(TA!$C$17=3,SUMIF(Dados!$D$2:$L$1081,$B$18&$C18,Dados!K$2:K$1081),SUMIF(Dados!$C$2:$L$1081,$B$18&TA!$C$18&$C18,Dados!K$2:K$1081))","v":24210},null,null,null,null,{"$f":"IF(TA!$C$17=3,SUMIF(Dados!$B$2:$L$1081,$B$18&$C18&TA!$F$17,Dados!L$2:L$1081),VLOOKUP($B$18&TA!$C$18&$C18&TA!$F$17,Dados!$A$2:$L$1081,12,0))","v":677417},7.7640814164874339E-3]
[null,null,"Juizados",{"$f":"IF(TA!$C$17=3,SUMIF(Dados!$D$2:$L$1081,$B$18&$C19,Dados!I$2:I$1081),SUMIF(Dados!$C$2:$L$1081,$B$18&TA!$C$18&$C19,Dados!I$2:I$1081))","v":137696},-0.31003312137656647,null,null,null,null,null,{"$f":"IF(TA!$C$17=3,SUMIF(Dados!$D$2:$L$1081,$B$18&$C19,Dados!J$2:J$1081),SUMIF(Dados!$C$2:$L$1081,$B$18&TA!$C$18&$C19,Dados!J$2:J$1081))","v":133912},-0.10764596910692625,null,null,null,null,null,{"$f":"IF(TA!$C$17=3,SUMIF(Dados!$D$2:$L$1081,$B$18&$C19,Dados!K$2:K$1081),SUMIF(Dados!$C$2:$L$1081,$B$18&TA!$C$18&$C19,Dados!K$2:K$1081))","v":50857},null,null,null,null,{"$f":"IF(TA!$C$17=3,SUMIF(Dados!$B$2:$L$1081,$B$18&$C19&TA!$F$17,Dados!L$2:L$1081),VLOOKUP($B$18&TA!$C$18&$C19&TA!$F$17,Dados!$A$2:$L$1081,12,0))","v":143213},-0.16498746428779665]
[null,null,"Turmas Recursais",{"$f":"IF(TA!$C$17=3,SUMIF(Dados!$D$2:$L$1081,$B$18&$C20,Dados!I$2:I$1081),SUMIF(Dados!$C$2:$L$1081,$B$18&TA!$C$18&$C20,Dados!I$2:I$1081))","v":52023},0.75866265508265451,null,null,null,null,null,{"$f":"IF(TA!$C$17=3,SUMIF(Dados!$D$2:$L$1081,$B$18&$C20,Dados!J$2:J$1081),SUMIF(Dados!$C$2:$L$1081,$B$18&TA!$C$18&$C20,Dados!J$2:J$1081))","v":54089},0.3574171204858585,null,null,null,null,null,{"$f":"IF(TA!$C$17=3,SUMIF(Dados!$D$2:$L$1081,$B$18&$C20,Dados!K$2:K$1081),SUMIF(Dados!$C$2:$L$1081,$B$18&TA!$C$18&$C20,Dados!K$2:K$1081))","v":0},null,null,null,null,{"$f":"IF(TA!$C$17=3,SUMIF(Dados!$B$2:$L$1081,$B$18&$C20&TA!$F$17,Dados!L$2:L$1081),VLOOKUP($B$18&TA!$C$18&$C20&TA!$F$17,Dados!$A$2:$L$1081,12,0))","v":45288},1.9996025963703801]
[null,"Total",null,{"$f":"SUM(D18:D20)","v":297280},-0.1834739163752922,null,null,null,null,null,{"$f":"SUM(K18:K20)","v":260583},-8.1718874890571724E-3,null,null,null,null,null,{"$f":"SUM(R18:R20)","v":75067},null,null,null,null,{"$f":"SUM(W18:W20)","v":865918},8.2812649189689669E-3]
[null,2009,"Varas",{"$f":"IF(TA!$C$17=3,SUMIF(Dados!$D$2:$L$1081,$B$22&$C22,Dados!I$2:I$1081),SUMIF(Dados!$C$2:$L$1081,$B$22&TA!$C$18&$C22,Dados!I$2:I$1081))","v":123306},0.14638205297459117,null,null,null,null,null,{"$f":"IF(TA!$C$17=3,SUMIF(Dados!$D$2:$L$1081,$B$22&$C22,Dados!J$2:J$1081),SUMIF(Dados!$C$2:$L$1081,$B$22&TA!$C$18&$C22,Dados!J$2:J$1081))","v":91016},0.25397481469234795,null,null,null,null,null,{"$f":"IF(TA!$C$17=3,SUMIF(Dados!$D$2:$L$1081,$B$22&$C22,Dados!K$2:K$1081),SUMIF(Dados!$C$2:$L$1081,$B$22&TA!$C$18&$C22,Dados!K$2:K$1081))","v":30673},null,null,null,null,{"$f":"IF(TA!$C$17=3,SUMIF(Dados!$B$2:$L$1081,$B$22&$C22&TA!$F$17,Dados!L$2:L$1081),VLOOKUP($B$22&TA!$C$18&$C22&TA!$F$17,Dados!$A$2:$L$1081,12,0))","v":685069},1.1295848790331409E-2]
[null,null,"Juizados",{"$f":"IF(TA!$C$17=3,SUMIF(Dados!$D$2:$L$1081,$B$22&$C23,Dados!I$2:I$1081),SUMIF(Dados!$C$2:$L$1081,$B$22&TA!$C$18&$C23,Dados!I$2:I$1081))","v":139409},1.2440448524285275E-2,null,null,null,null,null,{"$f":"IF(TA!$C$17=3,SUMIF(Dados!$D$2:$L$1081,$B$22&$C23,Dados!J$2:J$1081),SUMIF(Dados!$C$2:$L$1081,$B$22&TA!$C$18&$C23,Dados!J$2:J$1081))","v":117736},-0.12079574646036206,null,null,null,null,null,{"$f":"IF(TA!$C$17=3,SUMIF(Dados!$D$2:$L$1081,$B$22&$C23,Dados!K$2:K$1081),SUMIF(Dados!$C$2:$L$1081,$B$22&TA!$C$18&$C23,Dados!K$2:K$1081))","v":46039},null,null,null,null,{"$f":"IF(TA!$C$17=3,SUMIF(Dados!$B$2:$L$1081,$B$22&$C23&TA!$F$17,Dados!L$2:L$1081),VLOOKUP($B$22&TA!$C$18&$C23&TA!$F$17,Dados!$A$2:$L$1081,12,0))","v":154408},7.8170277837905866E-2]
[null,null,"Turmas Recursais",{"$f":"IF(TA!$C$17=3,SUMIF(Dados!$D$2:$L$1081,$B$22&$C24,Dados!I$2:I$1081),SUMIF(Dados!$C$2:$L$1081,$B$22&TA!$C$18&$C24,Dados!I$2:I$1081))","v":47148},-9.3708551986621313E-2,null,null,null,null,null,{"$f":"IF(TA!$C$17=3,SUMIF(Dados!$D$2:$L$1081,$B$22&$C24,Dados!J$2:J$1081),SUMIF(Dados!$C$2:$L$1081,$B$22&TA!$C$18&$C24,Dados!J$2:J$1081))","v":47914},-0.11416369317236408,null,null,null,null,null,{"$f":"IF(TA!$C$17=3,SUMIF(Dados!$D$2:$L$1081,$B$22&$C24,Dados!K$2:K$1081),SUMIF(Dados!$C$2:$L$1081,$B$22&TA!$C$18&$C24,Dados!K$2:K$1081))","v":0},null,null,null,null,{"$f":"IF(TA!$C$17=3,SUMIF(Dados!$B$2:$L$1081,$B$22&$C24&TA!$F$17,Dados!L$2:L$1081),VLOOKUP($B$22&TA!$C$18&$C24&TA!$F$17,Dados!$A$2:$L$1081,12,0))","v":58182},0.28471118177000521]
[null,"Total",null,{"$f":"SUM(D22:D24)","v":309863},4.2327099031216342E-2,null,null,null,null,null,{"$f":"SUM(K22:K24)","v":256666},-1.5031678966010875E-2,null,null,null,null,null,{"$f":"SUM(R22:R24)","v":76712},null,null,null,null,{"$f":"SUM(W22:W24)","v":897659},3.665589582385409E-2]
[null,2010,"Varas",{"$f":"IF(TA!$C$17=3,SUMIF(Dados!$D$2:$L$1081,$B$26&$C26,Dados!I$2:I$1081),SUMIF(Dados!$C$2:$L$1081,$B$26&TA!$C$18&$C26,Dados!I$2:I$1081))","v":104040},-0.15624543817819081,null,null,null,null,null,{"$f":"IF(TA!$C$17=3,SUMIF(Dados!$D$2:$L$1081,$B$26&$C26,Dados!J$2:J$1081),SUMIF(Dados!$C$2:$L$1081,$B$26&TA!$C$18&$C26,Dados!J$2:J$1081))","v":101885},0.11941856376900772,null,null,null,null,null,{"$f":"IF(TA!$C$17=3,SUMIF(Dados!$D$2:$L$1081,$B$26&$C26,Dados!K$2:K$1081),SUMIF(Dados!$C$2:$L$1081,$B$26&TA!$C$18&$C26,Dados!K$2:K$1081))","v":35165},null,null,null,null,{"$f":"IF(TA!$C$17=3,SUMIF(Dados!$B$2:$L$1081,$B$26&$C26&TA!$F$17,Dados!L$2:L$1081),VLOOKUP($B$26&TA!$C$18&$C26&TA!$F$17,Dados!$A$2:$L$1081,12,0))","v":666379},-2.7281923426691335E-2]
[null,null,"Juizados",{"$f":"IF(TA!$C$17=3,SUMIF(Dados!$D$2:$L$1081,$B$26&$C27,Dados!I$2:I$1081),SUMIF(Dados!$C$2:$L$1081,$B$26&TA!$C$18&$C27,Dados!I$2:I$1081))","v":116275},-0.16594337524836988,null,null,null,null,null,{"$f":"IF(TA!$C$17=3,SUMIF(Dados!$D$2:$L$1081,$B$26&$C27,Dados!J$2:J$1081),SUMIF(Dados!$C$2:$L$1081,$B$26&TA!$C$18&$C27,Dados!J$2:J$1081))","v":105828},-0.10114153699802952,null,null,null,null,null,{"$f":"IF(TA!$C$17=3,SUMIF(Dados!$D$2:$L$1081,$B$26&$C27,Dados!K$2:K$1081),SUMIF(Dados!$C$2:$L$1081,$B$26&TA!$C$18&$C27,Dados!K$2:K$1081))","v":39439},null,null,null,null,{"$f":"IF(TA!$C$17=3,SUMIF(Dados!$B$2:$L$1081,$B$26&$C27&TA!$F$17,Dados!L$2:L$1081),VLOOKUP($B$26&TA!$C$18&$C27&TA!$F$17,Dados!$A$2:$L$1081,12,0))","v":163916},6.1577120356458126E-2]
[null,null,"Turmas Recursais",{"$f":"IF(TA!$C$17=3,SUMIF(Dados!$D$2:$L$1081,$B$26&$C28,Dados!I$2:I$1081),SUMIF(Dados!$C$2:$L$1081,$B$26&TA!$C$18&$C28,Dados!I$2:I$1081))","v":38635},-0.18055909052345809,null,null,null,null,null,{"$f":"IF(TA!$C$17=3,SUMIF(Dados!$D$2:$L$1081,$B$26&$C28,Dados!J$2:J$1081),SUMIF(Dados!$C$2:$L$1081,$B$26&TA!$C$18&$C28,Dados!J$2:J$1081))","v":44105},-7.9496598071544855E-2,null,null,null,null,null,{"$f":"IF(TA!$C$17=3,SUMIF(Dados!$D$2:$L$1081,$B$26&$C28,Dados!K$2:K$1081),SUMIF(Dados!$C$2:$L$1081,$B$26&TA!$C$18&$C28,Dados!K$2:K$1081))","v":0},null,null,null,null,{"$f":"IF(TA!$C$17=3,SUMIF(Dados!$B$2:$L$1081,$B$26&$C28&TA!$F$17,Dados!L$2:L$1081),VLOOKUP($B$26&TA!$C$18&$C28&TA!$F$17,Dados!$A$2:$L$1081,12,0))","v":43631},-0.25009453095459078]
[null,"Total",null,{"$f":"SUM(D26:D28)","v":258950},-0.16430809744951802,null,null,null,null,null,{"$f":"SUM(K26:K28)","v":251818},-1.8888360748988919E-2,null,null,null,null,null,{"$f":"SUM(R26:R28)","v":74604},null,null,null,null,{"$f":"SUM(W26:W28)","v":873926},-2.6438770178876414E-2]
[null,2011,"Varas",{"$f":"IF(TA!$C$17=3,SUMIF(Dados!$D$2:$L$1081,$B$30&$C30,Dados!I$2:I$1081),SUMIF(Dados!$C$2:$L$1081,$B$30&TA!$C$18&$C30,Dados!I$2:I$1081))","v":112490},8.1218762014609869E-2,null,null,null,null,null,{"$f":"IF(TA!$C$17=3,SUMIF(Dados!$D$2:$L$1081,$B$30&$C30,Dados!J$2:J$1081),SUMIF(Dados!$C$2:$L$1081,$B$30&TA!$C$18&$C30,Dados!J$2:J$1081))","v":104342},2.4115424252834083E-2,null,null,null,null,null,{"$f":"IF(TA!$C$17=3,SUMIF(Dados!$D$2:$L$1081,$B$30&$C30,Dados!K$2:K$1081),SUMIF(Dados!$C$2:$L$1081,$B$30&TA!$C$18&$C30,Dados!K$2:K$1081))","v":35631},null,null,null,null,{"$f":"IF(TA!$C$17=3,SUMIF(Dados!$B$2:$L$1081,$B$30&$C30&TA!$F$17,Dados!L$2:L$1081),VLOOKUP($B$30&TA!$C$18&$C30&TA!$F$17,Dados!$A$2:$L$1081,12,0))","v":642936},-3.5179680031933724E-2]
[null,null,"Juizados",{"$f":"IF(TA!$C$17=3,SUMIF(Dados!$D$2:$L$1081,$B$30&$C31,Dados!I$2:I$1081),SUMIF(Dados!$C$2:$L$1081,$B$30&TA!$C$18&$C31,Dados!I$2:I$1081))","v":93418},-0.19657708019780695,null,null,null,null,null,{"$f":"IF(TA!$C$17=3,SUMIF(Dados!$D$2:$L$1081,$B$30&$C31,Dados!J$2:J$1081),SUMIF(Dados!$C$2:$L$1081,$B$30&TA!$C$18&$C31,Dados!J$2:J$1081))","v":115712},9.3396832596288393E-2,null,null,null,null,null,{"$f":"IF(TA!$C$17=3,SUMIF(Dados!$D$2:$L$1081,$B$30&$C31,Dados!K$2:K$1081),SUMIF(Dados!$C$2:$L$1081,$B$30&TA!$C$18&$C31,Dados!K$2:K$1081))","v":42503},null,null,null,null,{"$f":"IF(TA!$C$17=3,SUMIF(Dados!$B$2:$L$1081,$B$30&$C31&TA!$F$17,Dados!L$2:L$1081),VLOOKUP($B$30&TA!$C$18&$C31&TA!$F$17,Dados!$A$2:$L$1081,12,0))","v":141923},-0.13417238097562167]
[null,null,"Turmas Recursais",{"$f":"IF(TA!$C$17=3,SUMIF(Dados!$D$2:$L$1081,$B$30&$C32,Dados!I$2:I$1081),SUMIF(Dados!$C$2:$L$1081,$B$30&TA!$C$18&$C32,Dados!I$2:I$1081))","v":43474},0.12524912643975661,null,null,null,null,null,{"$f":"IF(TA!$C$17=3,SUMIF(Dados!$D$2:$L$1081,$B$30&$C32,Dados!J$2:J$1081),SUMIF(Dados!$C$2:$L$1081,$B$30&TA!$C$18&$C32,Dados!J$2:J$1081))","v":60032},0.36111551978233769,null,null,null,null,null,{"$f":"IF(TA!$C$17=3,SUMIF(Dados!$D$2:$L$1081,$B$30&$C32,Dados!K$2:K$1081),SUMIF(Dados!$C$2:$L$1081,$B$30&TA!$C$18&$C32,Dados!K$2:K$1081))","v":0},null,null,null,null,{"$f":"IF(TA!$C$17=3,SUMIF(Dados!$B$2:$L$1081,$B$30&$C32&TA!$F$17,Dados!L$2:L$1081),VLOOKUP($B$30&TA!$C$18&$C32&TA!$F$17,Dados!$A$2:$L$1081,12,0))","v":50069},0.14755563704705366]
[null,"Total",null,{"$f":"SUM(D30:D32)","v":249382},-3.6949217995752126E-2,null,null,null,null,null,{"$f":"SUM(K30:K32)","v":280086},0.11225567671890024,null,null,null,null,null,{"$f":"SUM(R30:R32)","v":78134},null,null,null,null,{"$f":"SUM(W30:W32)","v":834928},-4.4623915526028513E-2]
[null,2012,"Varas",{"$f":"IF(TA!$C$17=3,SUMIF(Dados!$D$2:$L$1081,$B$34&$C34,Dados!I$2:I$1081),SUMIF(Dados!$C$2:$L$1081,$B$34&TA!$C$18&$C34,Dados!I$2:I$1081))","v":96622},-0.14106142768246066,null,null,null,null,null,{"$f":"IF(TA!$C$17=3,SUMIF(Dados!$D$2:$L$1081,$B$34&$C34,Dados!J$2:J$1081),SUMIF(Dados!$C$2:$L$1081,$B$34&TA!$C$18&$C34,Dados!J$2:J$1081))","v":100642},-3.5460313200820326E-2,null,null,null,null,null,{"$f":"IF(TA!$C$17=3,SUMIF(Dados!$D$2:$L$1081,$B$34&$C34,Dados!K$2:K$1081),SUMIF(Dados!$C$2:$L$1081,$B$34&TA!$C$18&$C34,Dados!K$2:K$1081))","v":32333},null,null,null,null,{"$f":"IF(TA!$C$17=3,SUMIF(Dados!$B$2:$L$1081,$B$34&$C34&TA!$F$17,Dados!L$2:L$1081),VLOOKUP($B$34&TA!$C$18&$C34&TA!$F$17,Dados!$A$2:$L$1081,12,0))","v":630103},-1.9959996018266257E-2]
[null,null,"Juizados",{"$f":"IF(TA!$C$17=3,SUMIF(Dados!$D$2:$L$1081,$B$34&$C35,Dados!I$2:I$1081),SUMIF(Dados!$C$2:$L$1081,$B$34&TA!$C$18&$C35,Dados!I$2:I$1081))","v":83039},-0.11110278533045026,null,null,null,null,null,{"$f":"IF(TA!$C$17=3,SUMIF(Dados!$D$2:$L$1081,$B$34&$C35,Dados!J$2:J$1081),SUMIF(Dados!$C$2:$L$1081,$B$34&TA!$C$18&$C35,Dados!J$2:J$1081))","v":99447},-0.14056450497787609,null,null,null,null,null,{"$f":"IF(TA!$C$17=3,SUMIF(Dados!$D$2:$L$1081,$B$34&$C35,Dados!K$2:K$1081),SUMIF(Dados!$C$2:$L$1081,$B$34&TA!$C$18&$C35,Dados!K$2:K$1081))","v":39814},null,null,null,null,{"$f":"IF(TA!$C$17=3,SUMIF(Dados!$B$2:$L$1081,$B$34&$C35&TA!$F$17,Dados!L$2:L$1081),VLOOKUP($B$34&TA!$C$18&$C35&TA!$F$17,Dados!$A$2:$L$1081,12,0))","v":111759},-0.21253778457332495]
[null,null,"Turmas Recursais",{"$f":"IF(TA!$C$17=3,SUMIF(Dados!$D$2:$L$1081,$B$34&$C36,Dados!I$2:I$1081),SUMIF(Dados!$C$2:$L$1081,$B$34&TA!$C$18&$C36,Dados!I$2:I$1081))","v":49427},0.13693241937709888,null,null,null,null,null,{"$f":"IF(TA!$C$17=3,SUMIF(Dados!$D$2:$L$1081,$B$34&$C36,Dados!J$2:J$1081),SUMIF(Dados!$C$2:$L$1081,$B$34&TA!$C$18&$C36,Dados!J$2:J$1081))","v":49794},-0.17054237739872069,null,null,null,null,null,{"$f":"IF(TA!$C$17=3,SUMIF(Dados!$D$2:$L$1081,$B$34&$C36,Dados!K$2:K$1081),SUMIF(Dados!$C$2:$L$1081,$B$34&TA!$C$18&$C36,Dados!K$2:K$1081))","v":0},null,null,null,null,{"$f":"IF(TA!$C$17=3,SUMIF(Dados!$B$2:$L$1081,$B$34&$C36&TA!$F$17,Dados!L$2:L$1081),VLOOKUP($B$34&TA!$C$18&$C36&TA!$F$17,Dados!$A$2:$L$1081,12,0))","v":65235},0.3029019952465597]
[null,"Total",null,{"$f":"SUM(D34:D36)","v":229088},-8.1377164350273867E-2,null,null,null,null,null,{"$f":"SUM(K34:K36)","v":249883},-0.10783473647379738,null,null,null,null,null,{"$f":"SUM(R34:R36)","v":72147},null,null,null,null,{"$f":"SUM(W34:W36)","v":807097},-3.333341318053773E-2]
[null,2013,"Varas",{"$f":"IF(TA!$C$17=3,SUMIF(Dados!$D$2:$L$1081,$B$38&$C38,Dados!I$2:I$1081),SUMIF(Dados!$C$2:$L$1081,$B$38&TA!$C$18&$C38,Dados!I$2:I$1081))","v":87961},-8.9637970648506538E-2,null,null,null,null,null,{"$f":"IF(TA!$C$17=3,SUMIF(Dados!$D$2:$L$1081,$B$38&$C38,Dados!J$2:J$1081),SUMIF(Dados!$C$2:$L$1081,$B$38&TA!$C$18&$C38,Dados!J$2:J$1081))","v":122318},0.21537727787603589,null,null,null,null,null,{"$f":"IF(TA!$C$17=3,SUMIF(Dados!$D$2:$L$1081,$B$38&$C38,Dados!K$2:K$1081),SUMIF(Dados!$C$2:$L$1081,$B$38&TA!$C$18&$C38,Dados!K$2:K$1081))","v":39274},null,null,null,null,{"$f":"IF(TA!$C$17=3,SUMIF(Dados!$B$2:$L$1081,$B$38&$C38&TA!$F$17,Dados!L$2:L$1081),VLOOKUP($B$38&TA!$C$18&$C38&TA!$F$17,Dados!$A$2:$L$1081,12,0))","v":584820},-7.186602825252375E-2]
[null,null,"Juizados",{"$f":"IF(TA!$C$17=3,SUMIF(Dados!$D$2:$L$1081,$B$38&$C39,Dados!I$2:I$1081),SUMIF(Dados!$C$2:$L$1081,$B$38&TA!$C$18&$C39,Dados!I$2:I$1081))","v":104492},0.25834848685557388,null,null,null,null,null,{"$f":"IF(TA!$C$17=3,SUMIF(Dados!$D$2:$L$1081,$B$38&$C39,Dados!J$2:J$1081),SUMIF(Dados!$C$2:$L$1081,$B$38&TA!$C$18&$C39,Dados!J$2:J$1081))","v":119912},0.20578800768248406,null,null,null,null,null,{"$f":"IF(TA!$C$17=3,SUMIF(Dados!$D$2:$L$1081,$B$38&$C39,Dados!K$2:K$1081),SUMIF(Dados!$C$2:$L$1081,$B$38&TA!$C$18&$C39,Dados!K$2:K$1081))","v":46410},null,null,null,null,{"$f":"IF(TA!$C$17=3,SUMIF(Dados!$B$2:$L$1081,$B$38&$C39&TA!$F$17,Dados!L$2:L$1081),VLOOKUP($B$38&TA!$C$18&$C39&TA!$F$17,Dados!$A$2:$L$1081,12,0))","v":106558},-4.6537639026834499E-2]
[null,null,"Turmas Recursais",{"$f":"IF(TA!$C$17=3,SUMIF(Dados!$D$2:$L$1081,$B$38&$C40,Dados!I$2:I$1081),SUMIF(Dados!$C$2:$L$1081,$B$38&TA!$C$18&$C40,Dados!I$2:I$1081))","v":63673},0.28822303599247379,null,null,null,null,null,{"$f":"IF(TA!$C$17=3,SUMIF(Dados!$D$2:$L$1081,$B$38&$C40,Dados!J$2:J$1081),SUMIF(Dados!$C$2:$L$1081,$B$38&TA!$C$18&$C40,Dados!J$2:J$1081))","v":59086},0.18660882837289638,null,null,null,null,null,{"$f":"IF(TA!$C$17=3,SUMIF(Dados!$D$2:$L$1081,$B$38&$C40,Dados!K$2:K$1081),SUMIF(Dados!$C$2:$L$1081,$B$38&TA!$C$18&$C40,Dados!K$2:K$1081))","v":0},null,null,null,null,{"$f":"IF(TA!$C$17=3,SUMIF(Dados!$B$2:$L$1081,$B$38&$C40&TA!$F$17,Dados!L$2:L$1081),VLOOKUP($B$38&TA!$C$18&$C40&TA!$F$17,Dados!$A$2:$L$1081,12,0))","v":77659},0.19044991185713189]
[null,"Total",null,{"$f":"SUM(D38:D40)","v":256126},0.11802451459701069,null,null,null,null,null,{"$f":"SUM(K38:K40)","v":301316},0.2058283276573436,null,null,null,null,null,{"$f":"SUM(R38:R40)","v":85684},null,null,null,null,{"$f":"SUM(W38:W40)","v":769037},-4.7156661466961181E-2]
[null,2014,"Varas",{"$f":"IF(TA!$C$17=3,SUMIF(Dados!$D$2:$L$1081,$B$42&$C42,Dados!I$2:I$1081),SUMIF(Dados!$C$2:$L$1081,$B$42&TA!$C$18&$C42,Dados!I$2:I$1081))","v":121666},{"$f":"IF(D42=0,\"\",(D42/D38)-1)","v":0.38318118256954792},null,null,null,null,null,{"$f":"IF(TA!$C$17=3,SUMIF(Dados!$D$2:$L$1081,$B$42&$C42,Dados!J$2:J$1081),SUMIF(Dados!$C$2:$L$1081,$B$42&TA!$C$18&$C42,Dados!J$2:J$1081))","v":122683},{"$f":"IF(K42=0,\"\",(K42/K38)-1)","v":2.9840252456712069E-3},null,null,null,null,null,{"$f":"IF(TA!$C$17=3,SUMIF(Dados!$D$2:$L$1081,$B$42&$C42,Dados!K$2:K$1081),SUMIF(Dados!$C$2:$L$1081,$B$42&TA!$C$18&$C42,Dados!K$2:K$1081))","v":46430},null,null,null,null,{"$f":"IF(TA!$C$17=3,SUMIF(Dados!$B$2:$L$1081,$B$42&$C42&TA!$F$17,Dados!L$2:L$1081),VLOOKUP($B$42&TA!$C$18&$C42&TA!$F$17,Dados!$A$2:$L$1081,12,0))","v":572508},{"$f":"IF(W42=0,\"\",(W42/W38)-1)","v":-2.1052631578947323E-2}]
[null,null,"Juizados",{"$f":"IF(TA!$C$17=3,SUMIF(Dados!$D$2:$L$1081,$B$42&$C43,Dados!I$2:I$1081),SUMIF(Dados!$C$2:$L$1081,$B$42&TA!$C$18&$C43,Dados!I$2:I$1081))","v":114855},9.9175056463652655E-2,null,null,null,null,null,{"$f":"IF(TA!$C$17=3,SUMIF(Dados!$D$2:$L$1081,$B$42&$C43,Dados!J$2:J$1081),SUMIF(Dados!$C$2:$L$1081,$B$42&TA!$C$18&$C43,Dados!J$2:J$1081))","v":119417},-4.1280272199613055E-3,null,null,null,null,null,{"$f":"IF(TA!$C$17=3,SUMIF(Dados!$D$2:$L$1081,$B$42&$C43,Dados!K$2:K$1081),SUMIF(Dados!$C$2:$L$1081,$B$42&TA!$C$18&$C43,Dados!K$2:K$1081))","v":50430},null,null,null,null,{"$f":"IF(TA!$C$17=3,SUMIF(Dados!$B$2:$L$1081,$B$42&$C43&TA!$F$17,Dados!L$2:L$1081),VLOOKUP($B$42&TA!$C$18&$C43&TA!$F$17,Dados!$A$2:$L$1081,12,0))","v":102785},-3.5407946845849247E-2]
[null,null,"Turmas Recursais",{"$f":"IF(TA!$C$17=3,SUMIF(Dados!$D$2:$L$1081,$B$42&$C44,Dados!I$2:I$1081),SUMIF(Dados!$C$2:$L$1081,$B$42&TA!$C$18&$C44,Dados!I$2:I$1081))","v":49996},-0.21480062192766169,null,null,null,null,null,{"$f":"IF(TA!$C$17=3,SUMIF(Dados!$D$2:$L$1081,$B$42&$C44,Dados!J$2:J$1081),SUMIF(Dados!$C$2:$L$1081,$B$42&TA!$C$18&$C44,Dados!J$2:J$1081))","v":73020},0.23582574552347424,null,null,null,null,null,{"$f":"IF(TA!$C$17=3,SUMIF(Dados!$D$2:$L$1081,$B$42&$C44,Dados!K$2:K$1081),SUMIF(Dados!$C$2:$L$1081,$B$42&TA!$C$18&$C44,Dados!K$2:K$1081))","v":0},null,null,null,null,{"$f":"IF(TA!$C$17=3,SUMIF(Dados!$B$2:$L$1081,$B$42&$C44&TA!$F$17,Dados!L$2:L$1081),VLOOKUP($B$42&TA!$C$18&$C44&TA!$F$17,Dados!$A$2:$L$1081,12,0))","v":83589},7.6359468960455423E-2]
[null,"Total",null,{"$f":"SUM(D42:D44)","v":286517},0.11865644253219121,null,null,null,null,null,{"$f":"SUM(K42:K44)","v":315120},4.5812369738082337E-2,null,null,null,null,null,{"$f":"SUM(R42:R44)","v":96860},null,null,null,null,{"$f":"SUM(W42:W44)","v":758882},-1.3204826295743932E-2]
[null,2015,"Varas",{"$f":"IF(TA!$C$17=3,SUMIF(Dados!$D$2:$L$1081,$B$46&$C46,Dados!I$2:I$1081),SUMIF(Dados!$C$2:$L$1081,$B$46&TA!$C$18&$C46,Dados!I$2:I$1081))","v":108911},-0.1048361908832377,null,null,null,null,null,{"$f":"IF(TA!$C$17=3,SUMIF(Dados!$D$2:$L$1081,$B$46&$C46,Dados!J$2:J$1081),SUMIF(Dados!$C$2:$L$1081,$B$46&TA!$C$18&$C46,Dados!J$2:J$1081))","v":97679},-0.20380981880130089,null,null,null,null,null,{"$f":"IF(TA!$C$17=3,SUMIF(Dados!$D$2:$L$1081,$B$46&$C46,Dados!K$2:K$1081),SUMIF(Dados!$C$2:$L$1081,$B$46&TA!$C$18&$C46,Dados!K$2:K$1081))","v":32606},null,null,null,null,{"$f":"IF(TA!$C$17=3,SUMIF(Dados!$B$2:$L$1081,$B$46&$C46&TA!$F$17,Dados!L$2:L$1081),VLOOKUP($B$46&TA!$C$18&$C46&TA!$F$17,Dados!$A$2:$L$1081,12,0))","v":571789},-1.255877647124537E-3]
[null,null,"Juizados",{"$f":"IF(TA!$C$17=3,SUMIF(Dados!$D$2:$L$1081,$B$46&$C47,Dados!I$2:I$1081),SUMIF(Dados!$C$2:$L$1081,$B$46&TA!$C$18&$C47,Dados!I$2:I$1081))","v":98404},-0.14323277175569193,null,null,null,null,null,{"$f":"IF(TA!$C$17=3,SUMIF(Dados!$D$2:$L$1081,$B$46&$C47,Dados!J$2:J$1081),SUMIF(Dados!$C$2:$L$1081,$B$46&TA!$C$18&$C47,Dados!J$2:J$1081))","v":102541},-0.14131991257526144,null,null,null,null,null,{"$f":"IF(TA!$C$17=3,SUMIF(Dados!$D$2:$L$1081,$B$46&$C47,Dados!K$2:K$1081),SUMIF(Dados!$C$2:$L$1081,$B$46&TA!$C$18&$C47,Dados!K$2:K$1081))","v":36846},null,null,null,null,{"$f":"IF(TA!$C$17=3,SUMIF(Dados!$B$2:$L$1081,$B$46&$C47&TA!$F$17,Dados!L$2:L$1081),VLOOKUP($B$46&TA!$C$18&$C47&TA!$F$17,Dados!$A$2:$L$1081,12,0))","v":102983},1.9263511212725959E-3]
[null,null,"Turmas Recursais",{"$f":"IF(TA!$C$17=3,SUMIF(Dados!$D$2:$L$1081,$B$46&$C48,Dados!I$2:I$1081),SUMIF(Dados!$C$2:$L$1081,$B$46&TA!$C$18&$C48,Dados!I$2:I$1081))","v":36910},-0.26174093927514197,null,null,null,null,null,{"$f":"IF(TA!$C$17=3,SUMIF(Dados!$D$2:$L$1081,$B$46&$C48,Dados!J$2:J$1081),SUMIF(Dados!$C$2:$L$1081,$B$46&TA!$C$18&$C48,Dados!J$2:J$1081))","v":47344},-0.35162969049575454,null,null,null,null,null,{"$f":"IF(TA!$C$17=3,SUMIF(Dados!$D$2:$L$1081,$B$46&$C48,Dados!K$2:K$1081),SUMIF(Dados!$C$2:$L$1081,$B$46&TA!$C$18&$C48,Dados!K$2:K$1081))","v":0},null,null,null,null,{"$f":"IF(TA!$C$17=3,SUMIF(Dados!$B$2:$L$1081,$B$46&$C48&TA!$F$17,Dados!L$2:L$1081),VLOOKUP($B$46&TA!$C$18&$C48&TA!$F$17,Dados!$A$2:$L$1081,12,0))","v":83891},3.6129155750157516E-3]
[null,"Total",null,{"$f":"SUM(D46:D48)","v":244225},-0.14760729729824063,null,null,null,null,null,{"$f":"SUM(K46:K48)","v":247564},-0.21438182279766438,null,null,null,null,null,{"$f":"SUM(R46:R48)","v":69452},null,null,null,null,{"$f":"SUM(W46:W48)","v":758663},-2.8858241465734569E-4]
[null,2016,"Varas",{"$f":"IF(TA!$C$17=3,SUMIF(Dados!$D$2:$L$1081,$B$50&$C50,Dados!I$2:I$1081),SUMIF(Dados!$C$2:$L$1081,$B$50&TA!$C$18&$C50,Dados!I$2:I$1081))","v":101809},-6.5209207518065249E-2,null,null,null,null,null,{"$f":"IF(TA!$C$17=3,SUMIF(Dados!$D$2:$L$1081,$B$50&$C50,Dados!J$2:J$1081),SUMIF(Dados!$C$2:$L$1081,$B$50&TA!$C$18&$C50,Dados!J$2:J$1081))","v":76760},-0.21416066913051934,null,null,null,null,null,{"$f":"IF(TA!$C$17=3,SUMIF(Dados!$D$2:$L$1081,$B$50&$C50,Dados!K$2:K$1081),SUMIF(Dados!$C$2:$L$1081,$B$50&TA!$C$18&$C50,Dados!K$2:K$1081))","v":24922},null,null,null,null,{"$f":"IF(TA!$C$17=3,SUMIF(Dados!$B$2:$L$1081,$B$50&$C50&TA!$F$17,Dados!L$2:L$1081),VLOOKUP($B$50&TA!$C$18&$C50&TA!$F$17,Dados!$A$2:$L$1081,12,0))","v":592525},3.6265125771919315E-2]
[null,null,"Juizados",{"$f":"IF(TA!$C$17=3,SUMIF(Dados!$D$2:$L$1081,$B$50&$C51,Dados!I$2:I$1081),SUMIF(Dados!$C$2:$L$1081,$B$50&TA!$C$18&$C51,Dados!I$2:I$1081))","v":110348},0.1213771797894394,null,null,null,null,null,{"$f":"IF(TA!$C$17=3,SUMIF(Dados!$D$2:$L$1081,$B$50&$C51,Dados!J$2:J$1081),SUMIF(Dados!$C$2:$L$1081,$B$50&TA!$C$18&$C51,Dados!J$2:J$1081))","v":100637},-1.8568182483104323E-2,null,null,null,null,null,{"$f":"IF(TA!$C$17=3,SUMIF(Dados!$D$2:$L$1081,$B$50&$C51,Dados!K$2:K$1081),SUMIF(Dados!$C$2:$L$1081,$B$50&TA!$C$18&$C51,Dados!K$2:K$1081))","v":32608},null,null,null,null,{"$f":"IF(TA!$C$17=3,SUMIF(Dados!$B$2:$L$1081,$B$50&$C51&TA!$F$17,Dados!L$2:L$1081),VLOOKUP($B$50&TA!$C$18&$C51&TA!$F$17,Dados!$A$2:$L$1081,12,0))","v":120229},0.1674645329811717]
[null,null,"Turmas Recursais",{"$f":"IF(TA!$C$17=3,SUMIF(Dados!$D$2:$L$1081,$B$50&$C52,Dados!I$2:I$1081),SUMIF(Dados!$C$2:$L$1081,$B$50&TA!$C$18&$C52,Dados!I$2:I$1081))","v":32732},-0.11319425629910596,null,null,null,null,null,{"$f":"IF(TA!$C$17=3,SUMIF(Dados!$D$2:$L$1081,$B$50&$C52,Dados!J$2:J$1081),SUMIF(Dados!$C$2:$L$1081,$B$50&TA!$C$18&$C52,Dados!J$2:J$1081))","v":43802},-7.481412639405205E-2,null,null,null,null,null,{"$f":"IF(TA!$C$17=3,SUMIF(Dados!$D$2:$L$1081,$B$50&$C52,Dados!K$2:K$1081),SUMIF(Dados!$C$2:$L$1081,$B$50&TA!$C$18&$C52,Dados!K$2:K$1081))","v":0},null,null,null,null,{"$f":"IF(TA!$C$17=3,SUMIF(Dados!$B$2:$L$1081,$B$50&$C52&TA!$F$17,Dados!L$2:L$1081),VLOOKUP($B$50&TA!$C$18&$C52&TA!$F$17,Dados!$A$2:$L$1081,12,0))","v":83901},1.1920229822037776E-4]
[null,"Total",null,{"$f":"SUM(D50:D52)","v":244889},2.7188043812058638E-3,null,null,null,null,null,{"$f":"SUM(K50:K52)","v":221199},-0.10649771372251216,null,null,null,null,null,{"$f":"SUM(R50:R52)","v":57530},null,null,null,null,{"$f":"SUM(W50:W52)","v":796655},5.0077570673672023E-2]
[null,2017,"Varas",{"$f":"IF(TA!$C$17=3,SUMIF(Dados!$D$2:$L$217,$B$54&$C54,Dados!$I$2:$I$217),SUMIF(Dados!$C$2:$L$217,$B$54&TA!$C$18&$C54,Dados!$I$2:$I$217))","v":151464},0.48772701824003772,null,null,null,null,null,{"$f":"IF(TA!$C$17=3,SUMIF(Dados!$D$2:$L$217,$B$54&$C54,Dados!$J$2:$J$217),SUMIF(Dados!$C$2:$L$217,$B$54&TA!$C$18&$C54,Dados!$J$2:$J$217))","v":139362},0.81555497655028653,null,null,null,null,null,{"$f":"IF(TA!$C$17=3,SUMIF(Dados!$D$2:$L$217,$B$54&$C54,Dados!$K$2:$K$217),SUMIF(Dados!$C$2:$L$217,$B$54&TA!$C$18&$C54,Dados!$K$2:$K$217))","v":24516},null,null,null,null,{"$f":"IF(TA!$C$17=3,SUMIF(Dados!$B$2:$L$217,$B$54&$C54&TA!$F$17,   Dados!$L$2:$L$217),VLOOKUP($B$54&TA!$C$18&$C54&TA!$F$17,Dados!$A$2:$L$217,12,0))","v":621087},4.8203873254293095E-2,null,null,null,null,null,null,null,null,null,"range 2017 -> #"]
[null,null,"Juizados",{"$f":"IF(TA!$C$17=3,SUMIF(Dados!$D$2:$L$217,$B$54&$C55,Dados!$I$2:$I$217),SUMIF(Dados!$C$2:$L$217,$B$54&TA!$C$18&$C55,Dados!$I$2:$I$217))","v":114818},4.050821038895136E-2,null,null,null,null,null,{"$f":"IF(TA!$C$17=3,SUMIF(Dados!$D$2:$L$217,$B$54&$C55,Dados!$J$2:$J$217),SUMIF(Dados!$C$2:$L$217,$B$54&TA!$C$18&$C55,Dados!$J$2:$J$217))","v":108028},7.3442173355724005E-2,null,null,null,null,null,{"$f":"IF(TA!$C$17=3,SUMIF(Dados!$D$2:$L$217,$B$54&$C55,Dados!$K$2:$K$217),SUMIF(Dados!$C$2:$L$217,$B$54&TA!$C$18&$C55,Dados!$K$2:$K$217))","v":32424},null,null,null,null,{"$f":"IF(TA!$C$17=3,SUMIF(Dados!$B$2:$L$217,$B$54&$C55&TA!$F$17,   Dados!$L$2:$L$217),VLOOKUP($B$54&TA!$C$18&$C55&TA!$F$17,Dados!$A$2:$L$217,12,0))","v":139350},0.15903816882782018]
[null,null,"Turmas Recursais",{"$f":"IF(TA!$C$17=3,SUMIF(Dados!$D$2:$L$217,$B$54&$C56,Dados!$I$2:$I$217),SUMIF(Dados!$C$2:$L$217,$B$54&TA!$C$18&$C56,Dados!$I$2:$I$217))","v":32247},-1.481730416717586E-2,null,null,null,null,null,{"$f":"IF(TA!$C$17=3,SUMIF(Dados!$D$2:$L$217,$B$54&$C56,Dados!$J$2:$J$217),SUMIF(Dados!$C$2:$L$217,$B$54&TA!$C$18&$C56,Dados!$J$2:$J$217))","v":46970},7.2325464590657917E-2,null,null,null,null,null,{"$f":"IF(TA!$C$17=3,SUMIF(Dados!$D$2:$L$217,$B$54&$C56,Dados!$K$2:$K$217),SUMIF(Dados!$C$2:$L$217,$B$54&TA!$C$18&$C56,Dados!$K$2:$K$217))","v":0},null,null,null,null,{"$f":"IF(TA!$C$17=3,SUMIF(Dados!$B$2:$L$217,$B$54&$C56&TA!$F$17,   Dados!$L$2:$L$217),VLOOKUP($B$54&TA!$C$18&$C56&TA!$F$17,Dados!$A$2:$L$217,12,0))","v":56454},-0.32713555261558269]
[null,"Total",null,{"$f":"SUM(D54:D56)","v":298529},0.2190380131406473,null,null,null,null,null,{"$f":"SUM(K54:K56)","v":294360},0.33074742652543643,null,null,null,null,null,{"$f":"SUM(R54:R56)","v":56940},null,null,null,null,{"$f":"SUM(W54:W56)","v":816891},2.5401208804312958E-2]
[null,2018,"Varas",{"$f":"IF(TA!$C$17=3,SUMIF(Dados!$D$2:$L$217,$B$58&$C58,Dados!$I$2:$I$217),SUMIF(Dados!$C$2:$L$217,$B$58&TA!$C$18&$C58,Dados!$I$2:$I$217))","v":59120},-0.60967622669413202,{"$f":"IF(TA!$C$17=3,SUMIF(Dados!$D$2:$P$217,$B$58&$C58,Dados!$M$2:$M$217 ),SUMIF(Dados!$C$2:$P$217,$B$58&TA!$C$18&$C58,Dados!$M$2:$M$217 ))","v":43793},null,{"$f":"IF(D58=0,\"\",D58+F58)","v":102913},{"$f":"IF(H58=0,\"\",(H58/D54)-1)","v":-0.32054481592985795},null,{"$f":"IF(TA!$C$17=3,SUMIF(Dados!$D$2:$L$217,$B$58&$C58,Dados!$J$2:$J$217),SUMIF(Dados!$C$2:$L$217,$B$58&TA!$C$18&$C58,Dados!$J$2:$J$217))","v":109812},{"$f":"IF(K58=0,\"\",(K58/K54)-1)","v":-0.21203771472854871},{"$f":"IF(TA!$C$17=3,SUMIF(Dados!$D$2:$P$217,$B$58&$C58,Dados!$N$2:$N$217 ),SUMIF(Dados!$C$2:$P$217,$B$58&TA!$C$18&$C58,Dados!$N$2:$N$217 ))","v":3530},null,{"$f":"IF(K58=0,\"\",K58+M58)","v":113342},{"$f":"IF(O58=0,\"\",(O58/K54)-1)","v":-0.18670799787603509},null,{"$f":"IF(TA!$C$17=3,SUMIF(Dados!$D$2:$L$217,$B$58&$C58,Dados!$K$2:$K$217),SUMIF(Dados!$C$2:$L$217,$B$58&TA!$C$18&$C58,Dados!$K$2:$K$217))","v":24138},{"$f":"IF(TA!$C$17=3,SUMIF(Dados!$D$2:$P$217,$B$58&$C58,Dados!$O$2:$O$217 ),SUMIF(Dados!$C$2:$P$217,$B$58&TA!$C$18&$C58,Dados!$O$2:$O$217 ))","v":471},{"$f":"IF(AND(R58=0,S58=0),\"\",R58+S58)","v":24609},{"$f":"IF(T58=0,\"\",(T58/R54)-1)","v":3.7934410181106326E-3},null,{"$f":"IF(TA!$C$17=3,SUMIF(Dados!$B$2:$L$217,$B$58&$C58&TA!$F$17,   Dados!$L$2:$L$217),VLOOKUP($B$58&TA!$C$18&$C58&TA!$F$17,Dados!$A$2:$L$217,12,0))","v":530063},{"$f":"IF(W58=0,\"\",(W58/W54)-1)","v":-0.14655595753895989},{"$f":"IF(TA!$C$17=3,SUMIF(Dados!$B$2:$P$217,$B$58&$C58&TA!$F$17,   Dados!$P$2:$P$217),VLOOKUP($B$58&TA!$C$18&$C58&TA!$F$17,Dados!$A$2:$P$217,16,0))","v":61696},null,{"$f":"IF(AND(W58=0,Y58=0),\"\",W58+Y58)","v":591759},{"$f":"IF(AA58=\"\",\"\",(AA58/W54)-1)","v":-4.7220437716455232E-2}]
[null,null,"Juizados",{"$f":"IF(TA!$C$17=3,SUMIF(Dados!$D$2:$L$217,$B$58&$C59,Dados!$I$2:$I$217),SUMIF(Dados!$C$2:$L$217,$B$58&TA!$C$18&$C59,Dados!$I$2:$I$217))","v":35108},-0.69422912783709867,{"$f":"IF(TA!$C$17=3,SUMIF(Dados!$D$2:$P$217,$B$58&$C59,Dados!$M$2:$M$217 ),SUMIF(Dados!$C$2:$P$217,$B$58&TA!$C$18&$C59,Dados!$M$2:$M$217 ))","v":78214},null,113322,{"$f":"IF(H59=0,\"\",(H59/D55)-1)","v":-1.3029315960912058E-2},null,{"$f":"IF(TA!$C$17=3,SUMIF(Dados!$D$2:$L$217,$B$58&$C59,Dados!$J$2:$J$217),SUMIF(Dados!$C$2:$L$217,$B$58&TA!$C$18&$C59,Dados!$J$2:$J$217))","v":128374},0.18834005998444847,{"$f":"IF(TA!$C$17=3,SUMIF(Dados!$D$2:$P$217,$B$58&$C59,Dados!$N$2:$N$217 ),SUMIF(Dados!$C$2:$P$217,$B$58&TA!$C$18&$C59,Dados!$N$2:$N$217 ))","v":28477},null,156851,{"$f":"IF(O59=0,\"\",(O59/K55)-1)","v":0.4519476432036138},null,{"$f":"IF(TA!$C$17=3,SUMIF(Dados!$D$2:$L$217,$B$58&$C59,Dados!$K$2:$K$217),SUMIF(Dados!$C$2:$L$217,$B$58&TA!$C$18&$C59,Dados!$K$2:$K$217))","v":33578},{"$f":"IF(TA!$C$17=3,SUMIF(Dados!$D$2:$P$217,$B$58&$C59,Dados!$O$2:$O$217 ),SUMIF(Dados!$C$2:$P$217,$B$58&TA!$C$18&$C59,Dados!$O$2:$O$217 ))","v":5430},{"$f":"IF(AND(R59=0,S59=0),\"\",R59+S59)","v":39008},{"$f":"IF(T59=0,\"\",(T59/R55)-1)","v":0.20305946212681958},null,{"$f":"IF(TA!$C$17=3,SUMIF(Dados!$B$2:$L$217,$B$58&$C59&TA!$F$17,   Dados!$L$2:$L$217),VLOOKUP($B$58&TA!$C$18&$C59&TA!$F$17,Dados!$A$2:$L$217,12,0))","v":36713},-0.73654108360243997,{"$f":"IF(TA!$C$17=3,SUMIF(Dados!$B$2:$P$217,$B$58&$C59&TA!$F$17,   Dados!$P$2:$P$217),VLOOKUP($B$58&TA!$C$18&$C59&TA!$F$17,Dados!$A$2:$P$217,16,0))","v":80327},null,117040,{"$f":"IF(AA59=\"\",\"\",(AA59/W55)-1)","v":-0.16010046645138143}]
[null,null,"Turmas Recursais",{"$f":"IF(TA!$C$17=3,SUMIF(Dados!$D$2:$L$217,$B$58&$C60,Dados!$I$2:$I$217),SUMIF(Dados!$C$2:$L$217,$B$58&TA!$C$18&$C60,Dados!$I$2:$I$217))","v":32852},1.8761435172264029E-2,{"$f":"IF(TA!$C$17=3,SUMIF(Dados!$D$2:$P$217,$B$58&$C60,Dados!$M$2:$M$217 ),SUMIF(Dados!$C$2:$P$217,$B$58&TA!$C$18&$C60,Dados!$M$2:$M$217 ))","v":5748},null,38600,{"$f":"IF(H60=0,\"\",(H60/D56)-1)","v":0.19701057462709715},null,{"$f":"IF(TA!$C$17=3,SUMIF(Dados!$D$2:$L$217,$B$58&$C60,Dados!$J$2:$J$217),SUMIF(Dados!$C$2:$L$217,$B$58&TA!$C$18&$C60,Dados!$J$2:$J$217))","v":48876},4.057909303810936E-2,{"$f":"IF(TA!$C$17=3,SUMIF(Dados!$D$2:$P$217,$B$58&$C60,Dados!$N$2:$N$217 ),SUMIF(Dados!$C$2:$P$217,$B$58&TA!$C$18&$C60,Dados!$N$2:$N$217 ))","v":1186},null,50062,{"$f":"IF(O60=0,\"\",(O60/K56)-1)","v":6.5829252714498576E-2},null,{"$f":"IF(TA!$C$17=3,SUMIF(Dados!$D$2:$L$217,$B$58&$C60,Dados!$K$2:$K$217),SUMIF(Dados!$C$2:$L$217,$B$58&TA!$C$18&$C60,Dados!$K$2:$K$217))","v":0},{"$f":"IF(TA!$C$17=3,SUMIF(Dados!$D$2:$P$217,$B$58&$C60,Dados!$O$2:$O$217 ),SUMIF(Dados!$C$2:$P$217,$B$58&TA!$C$18&$C60,Dados!$O$2:$O$217 ))","v":0},{"$f":"IF(AND(R60=0,S60=0),\"\",R60+S60)","v":""},null,null,{"$f":"IF(TA!$C$17=3,SUMIF(Dados!$B$2:$L$217,$B$58&$C60&TA!$F$17,   Dados!$L$2:$L$217),VLOOKUP($B$58&TA!$C$18&$C60&TA!$F$17,Dados!$A$2:$L$217,12,0))","v":50962},-9.7282743472561717E-2,{"$f":"IF(TA!$C$17=3,SUMIF(Dados!$B$2:$P$217,$B$58&$C60&TA!$F$17,   Dados!$P$2:$P$217),VLOOKUP($B$58&TA!$C$18&$C60&TA!$F$17,Dados!$A$2:$P$217,16,0))","v":5497},null,56459,{"$f":"IF(AA60=\"\",\"\",(AA60/W56)-1)","v":8.8567683423690369E-5}]
[null,"Total",null,{"$f":"SUM(D58:D60)","v":127080},-0.57431271333773271,{"$f":"SUM(F58:F60)","v":127755},null,254835,{"$f":"IF(H61=0,\"\",(H61/D57)-1)","v":-0.14636433981288255},null,{"$f":"SUM(K58:K60)","v":287062},-2.4792770756896343E-2,{"$f":"SUM(M58:M60)","v":33193},null,320255,{"$f":"IF(O61=0,\"\",(O61/K57)-1)","v":8.7970512297866454E-2},null,{"$f":"SUM(R58:R60)","v":57716},{"$f":"SUM(S58:S60)","v":5901},{"$f":"IF(R61=0,\"\",R61+S61)","v":63617},{"$f":"IF(T61=0,\"\",(T61/R57)-1)","v":0.11726378644186863},null,{"$f":"SUM(W58:W60)","v":617738},-0.24379384764919676,{"$f":"SUM(Y58:Y60)","v":147520},null,765258,{"$f":"IF(AA61=\"\",\"\",(AA61/W57)-1)","v":-6.3206719133886868E-2}]
[null,2019,"Varas",{"$f":"IF(TA!$C$17=3,SUMIF(Dados!$D$2:$L$217,$B$62&$C62,Dados!$I$2:$I$217),SUMIF(Dados!$C$2:$L$217,$B$62&TA!$C$18&$C62,Dados!$I$2:$I$217))","v":7959},{"$f":"IF(D62=0,\"\",(D62/D58)-1)","v":-0.86537550744248981},{"$f":"IF(TA!$C$17=3,SUMIF(Dados!$D$2:$P$217,$B$62&$C62,Dados!$M$2:$M$217 ),SUMIF(Dados!$C$2:$P$217,$B$62&TA!$C$18&$C62,Dados!$M$2:$M$217 ))","v":96298},{"$f":"IF(F62=0,\"\",(F62/F58)-1)","v":1.1989359029981959},{"$f":"IF(D62=0,\"\",D62+F62)","v":104257},{"$f":"IF(H62=0,\"\",(H62/H58)-1)","v":1.305957459213114E-2},null,{"$f":"IF(TA!$C$17=3,SUMIF(Dados!$D$2:$L$217,$B$62&$C62,Dados!$J$2:$J$217),SUMIF(Dados!$C$2:$L$217,$B$62&TA!$C$18&$C62,Dados!$J$2:$J$217))","v":43371},-0.60504316468145558,{"$f":"IF(TA!$C$17=3,SUMIF(Dados!$D$2:$P$217,$B$62&$C62,Dados!$N$2:$N$217 ),SUMIF(Dados!$C$2:$P$217,$B$62&TA!$C$18&$C62,Dados!$N$2:$N$217 ))","v":62683},{"$f":"IF(M62=0,\"\",(M62/M58)-1)","v":16.757223796033994},106054,{"$f":"IF(O62=0,\"\",(O62/O58)-1)","v":-6.4300965220306705E-2},null,{"$f":"IF(TA!$C$17=3,SUMIF(Dados!$D$2:$L$217,$B$62&$C62,Dados!$K$2:$K$217),SUMIF(Dados!$C$2:$L$217,$B$62&TA!$C$18&$C62,Dados!$K$2:$K$217))","v":7806},{"$f":"IF(TA!$C$17=3,SUMIF(Dados!$D$2:$P$217,$B$62&$C62,Dados!$O$2:$O$217 ),SUMIF(Dados!$C$2:$P$217,$B$62&TA!$C$18&$C62,Dados!$O$2:$O$217 ))","v":40960},{"$f":"IF(AND(R62=0,S62=0),\"\",R62+S62)","v":48766},{"$f":"IF(T62=0,\"\",(T62/T58)-1)","v":0.98163273599089762},null,{"$f":"IF(TA!$C$17=3,SUMIF(Dados!$B$2:$L$217,$B$62&$C62&TA!$F$17,   Dados!$L$2:$L$217),VLOOKUP($B$62&TA!$C$18&$C62&TA!$F$17,Dados!$A$2:$L$217,12,0))","v":100231},-0.81090738270733853,{"$f":"IF(TA!$C$17=3,SUMIF(Dados!$B$2:$P$217,$B$62&$C62&TA!$F$17,   Dados!$P$2:$P$217),VLOOKUP($B$62&TA!$C$18&$C62&TA!$F$17,Dados!$A$2:$P$217,16,0))","v":483805},{"$f":"IF(Y62=0,\"\",(Y62/Y58)-1)","v":6.8417563537344401},584036,{"$f":"IF(AA62=\"\",\"\",(AA62/AA58)-1)","v":-1.3050921067529142E-2},null,null,null,null,null,"inv e->A"]
[null,null,"Juizados",{"$f":"IF(TA!$C$17=3,SUMIF(Dados!$D$2:$L$217,$B$62&$C63,Dados!$I$2:$I$217),SUMIF(Dados!$C$2:$L$217,$B$62&TA!$C$18&$C63,Dados!$I$2:$I$217))","v":45},{"$f":"IF(D63=0,\"\",(D63/D59)-1)","v":-0.99871824085678473},{"$f":"IF(TA!$C$17=3,SUMIF(Dados!$D$2:$P$217,$B$62&$C63,Dados!$M$2:$M$217 ),SUMIF(Dados!$C$2:$P$217,$B$62&TA!$C$18&$C63,Dados!$M$2:$M$217 ))","v":136095},{"$f":"IF(F63=0,\"\",(F63/F59)-1)","v":0.7400337535479582},136140,{"$f":"IF(H63=0,\"\",(H63/H59)-1)","v":0.20135542966061304},null,{"$f":"IF(TA!$C$17=3,SUMIF(Dados!$D$2:$L$217,$B$62&$C63,Dados!$J$2:$J$217),SUMIF(Dados!$C$2:$L$217,$B$62&TA!$C$18&$C63,Dados!$J$2:$J$217))","v":11486},-0.91052705376478105,{"$f":"IF(TA!$C$17=3,SUMIF(Dados!$D$2:$P$217,$B$62&$C63,Dados!$N$2:$N$217 ),SUMIF(Dados!$C$2:$P$217,$B$62&TA!$C$18&$C63,Dados!$N$2:$N$217 ))","v":117776},{"$f":"IF(M63=0,\"\",(M63/M59)-1)","v":3.1358289145626292},129262,{"$f":"IF(O63=0,\"\",(O63/O59)-1)","v":-0.17589304499174374},null,{"$f":"IF(TA!$C$17=3,SUMIF(Dados!$D$2:$L$217,$B$62&$C63,Dados!$K$2:$K$217),SUMIF(Dados!$C$2:$L$217,$B$62&TA!$C$18&$C63,Dados!$K$2:$K$217))","v":3106},{"$f":"IF(TA!$C$17=3,SUMIF(Dados!$D$2:$P$217,$B$62&$C63,Dados!$O$2:$O$217 ),SUMIF(Dados!$C$2:$P$217,$B$62&TA!$C$18&$C63,Dados!$O$2:$O$217 ))","v":9245},{"$f":"IF(AND(R63=0,S63=0),\"\",R63+S63)","v":12351},{"$f":"IF(T63=0,\"\",(T63/T59)-1)","v":-0.68337264150943389},null,{"$f":"IF(TA!$C$17=3,SUMIF(Dados!$B$2:$L$217,$B$62&$C63&TA!$F$17,   Dados!$L$2:$L$217),VLOOKUP($B$62&TA!$C$18&$C63&TA!$F$17,Dados!$A$2:$L$217,12,0))","v":15130},-0.58788440062103342,{"$f":"IF(TA!$C$17=3,SUMIF(Dados!$B$2:$P$217,$B$62&$C63&TA!$F$17,   Dados!$P$2:$P$217),VLOOKUP($B$62&TA!$C$18&$C63&TA!$F$17,Dados!$A$2:$P$217,16,0))","v":128057},{"$f":"IF(Y63=0,\"\",(Y63/Y59)-1)","v":0.59419622293873786},143187,{"$f":"IF(AA63=\"\",\"\",(AA63/AA59)-1)","v":0.22340225563909777}]
[null,null,"Turmas Recursais",{"$f":"IF(TA!$C$17=3,SUMIF(Dados!$D$2:$L$217,$B$62&$C64,Dados!$I$2:$I$217),SUMIF(Dados!$C$2:$L$217,$B$62&TA!$C$18&$C64,Dados!$I$2:$I$217))","v":3357},{"$f":"IF(D64=0,\"\",(D64/D60)-1)","v":-0.89781444052112502},{"$f":"IF(TA!$C$17=3,SUMIF(Dados!$D$2:$P$217,$B$62&$C64,Dados!$M$2:$M$217 ),SUMIF(Dados!$C$2:$P$217,$B$62&TA!$C$18&$C64,Dados!$M$2:$M$217 ))","v":33271},{"$f":"IF(F64=0,\"\",(F64/F60)-1)","v":4.7882741823242867},36628,{"$f":"IF(H64=0,\"\",(H64/H60)-1)","v":-5.1088082901554421E-2},null,{"$f":"IF(TA!$C$17=3,SUMIF(Dados!$D$2:$L$217,$B$62&$C64,Dados!$J$2:$J$217),SUMIF(Dados!$C$2:$L$217,$B$62&TA!$C$18&$C64,Dados!$J$2:$J$217))","v":29511},-0.39620672722808736,{"$f":"IF(TA!$C$17=3,SUMIF(Dados!$D$2:$P$217,$B$62&$C64,Dados!$N$2:$N$217 ),SUMIF(Dados!$C$2:$P$217,$B$62&TA!$C$18&$C64,Dados!$N$2:$N$217 ))","v":25868},{"$f":"IF(M64=0,\"\",(M64/M60)-1)","v":20.811129848229342},55379,{"$f":"IF(O64=0,\"\",(O64/O60)-1)","v":0.1062083017058848},null,{"$f":"IF(TA!$C$17=3,SUMIF(Dados!$D$2:$L$217,$B$62&$C64,Dados!$K$2:$K$217),SUMIF(Dados!$C$2:$L$217,$B$62&TA!$C$18&$C64,Dados!$K$2:$K$217))","v":0},{"$f":"IF(TA!$C$17=3,SUMIF(Dados!$D$2:$P$217,$B$62&$C64,Dados!$O$2:$O$217 ),SUMIF(Dados!$C$2:$P$217,$B$62&TA!$C$18&$C64,Dados!$O$2:$O$217 ))","v":0},{"$f":"IF(AND(R64=0,S64=0),\"\",R64+S64)","v":""},null,null,{"$f":"IF(TA!$C$17=3,SUMIF(Dados!$B$2:$L$217,$B$62&$C64&TA!$F$17,   Dados!$L$2:$L$217),VLOOKUP($B$62&TA!$C$18&$C64&TA!$F$17,Dados!$A$2:$L$217,12,0))","v":24048},-0.5281189906204623,{"$f":"IF(TA!$C$17=3,SUMIF(Dados!$B$2:$P$217,$B$62&$C64&TA!$F$17,   Dados!$P$2:$P$217),VLOOKUP($B$62&TA!$C$18&$C64&TA!$F$17,Dados!$A$2:$P$217,16,0))","v":19969},{"$f":"IF(Y64=0,\"\",(Y64/Y60)-1)","v":2.6327087502273967},44017,{"$f":"IF(AA64=\"\",\"\",(AA64/AA60)-1)","v":-0.22037230556687148}]
[null,"Total",null,{"$f":"SUM(D62:D64)","v":11361},{"$f":"IF(D65=0,\"\",(D65/D61)-1)","v":-0.91059962228517466},{"$f":"SUM(F62:F64)","v":265664},{"$f":"IF(F65=0,\"\",(F65/F61)-1)","v":1.0794802551759228},277025,{"$f":"IF(H65=0,\"\",(H65/H61)-1)","v":8.7075951105617388E-2},null,{"$f":"SUM(K62:K64)","v":84368},-0.70609833415777778,{"$f":"SUM(M62:M64)","v":206327},{"$f":"IF(M65=0,\"\",(M65/M61)-1)","v":5.2159792727382284},290695,{"$f":"IF(O65=0,\"\",(O65/O61)-1)","v":-9.2301447284195426E-2},null,{"$f":"SUM(R62:R64)","v":10912},{"$f":"SUM(S62:S64)","v":50205},{"$f":"IF(R65=0,\"\",R65+S65)","v":61117},{"$f":"IF(T65=0,\"\",(T65/T61)-1)","v":-3.9297672005910389E-2},null,{"$f":"SUM(W62:W64)","v":139409},-0.77432341866616594,{"$f":"SUM(Y62:Y64)","v":631831},{"$f":"IF(Y65=0,\"\",(Y65/Y61)-1)","v":3.2830192516268983},771240,{"$f":"IF(AA65=\"\",\"\",(AA65/AA61)-1)","v":7.8169715311697807E-3}]
[null,"Consolidado","Varas",{"$f":"D10+D14+D18+D22+D26+D30+D34+D38+D42+D46+D50+D54+D58+D62","v":1445551},null,{"$f":"F58+F62","v":140091},null,1585642,null,null,{"$f":"K10+K14+K18+K22+K26+K30+K34+K38+K42+K46+K50+K54+K58+K62","v":1325835},null,{"$f":"M58+M62","v":66213},null,{"$f":"IF(K66=0,\"\",K66+M66)","v":1392048},null,null,{"$f":"R10+R14+R18+R22+R26+R30+R34+R38+R42+R46+R50+R54+R58+R62","v":404792},{"$f":"S58+S62","v":41431},{"$f":"IF(AND(R66=0,S66=0),\"\",R66+S66)","v":446223}]
[null,null,"Juizados",{"$f":"D11+D15+D19+D23+D27+D31+D35+D39+D43+D47+D51+D55+D59+D63","v":1535062},null,{"$f":"F59+F63","v":214309},null,1749371,null,null,{"$f":"K11+K15+K19+K23+K27+K31+K35+K39+K43+K47+K51+K55+K59+K63","v":1614718},null,{"$f":"M59+M63","v":146253},null,{"$f":"IF(K67=0,\"\",K67+M67)","v":1760971},null,null,{"$f":"R11+R15+R19+R23+R27+R31+R35+R39+R43+R47+R51+R55+R59+R63","v":514887},{"$f":"S59+S63","v":14675},{"$f":"IF(AND(R67=0,S67=0),\"\",R67+S67)","v":529562}]
[null,null,"Turmas Recursais",{"$f":"D12+D16+D20+D24+D28+D32+D36+D40+D44+D48+D52+D56+D60+D64","v":544637},null,{"$f":"F60+F64","v":39019},null,583656,null,null,{"$f":"K12+K16+K20+K24+K28+K32+K36+K40+K44+K48+K52+K56+K60+K64","v":671566},null,{"$f":"M60+M64","v":27054},null,{"$f":"IF(K68=0,\"\",K68+M68)","v":698620},null,null,{"$f":"R12+R16+R20+R24+R28+R32+R36+R40+R44+R48+R52+R56+R60+R64","v":0},{"$f":"S60+S64","v":0},{"$f":"IF(AND(R68=0,S68=0),\"\",R68+S68)","v":""}]
[null,"Total",null,{"$f":"SUM(D66:D68)","v":3525250},null,{"$f":"SUM(F66:F68)","v":393419},null,3918669,null,null,{"$f":"SUM(K66:K68)","v":3612119},null,{"$f":"SUM(M66:M68)","v":239520},null,{"$f":"IF(K69=0,\"\",K69+M69)","v":3851639},null,null,{"$f":"SUM(R66:R68)","v":919679},{"$f":"SUM(S66:S68)","v":56106},{"$f":"IF(R69=0,\"\",R69+S69)","v":975785}]
[]
[null,"Obs. 1: Os valores poderão ser alterados, em função de modificações na base de dados, por parte do usuário.",null,null,null,null,null,null,null,null,null,"Obs. 2: Os Processos Julgados nas Varas e Juizados incluem os Embargos.",null,null,null,null,null,null,null,null,null,null,"Obs. 3: Na Tramitação \"Real\", estão incluídos os Processos suspensos e os que aguardam julgamento de recurso."]
[]
[null,"_ Desde o dia 23 de Fevereiro de 2018, o NOVO sistema processual \"Eproc\" está em funcionamento na Justiça Federal da 2ª Região."]

{"sheet":"GDvA","index":7,"n_rows":1,"n_cols":1,"rows_kept":1,"cut":false,"hidden":true,"merged":[[0,0,0,11],[26,9,49,15],[26,1,49,7],[1,1,24,7],[1,9,24,15]]}
["Total de Processos DISTRIBUÍDOS nos Anos 2006 a 2019 da Seção Judiciária:  "]

{"sheet":"GJvA","index":8,"n_rows":1,"n_cols":1,"rows_kept":1,"cut":false,"hidden":true,"merged":[[0,0,0,11],[26,1,49,7],[26,9,49,15],[1,1,24,7],[1,9,24,15]]}
["Total de Processos JULGADOS nos Anos 2006 a 2019 da Seção Judiciária:  "]

{"sheet":"GTvA","index":9,"n_rows":1,"n_cols":1,"rows_kept":1,"cut":false,"hidden":true,"merged":[[0,0,0,11],[26,1,49,7],[26,9,49,15],[1,1,24,7],[1,9,24,15]]}
["TRAMITAÇÃO de Processos em DEZEMBRO nos Anos 2006 a 2019 da Seção Judiciária:  "]

{"sheet":"GCA","index":10,"n_rows":1,"n_cols":1,"rows_kept":1,"cut":false,"hidden":true,"merged":[[0,0,0,11],[26,1,49,7],[26,9,49,15],[1,1,24,15]]}
["COMPARATIVO de Processos dos Anos 2006 a 2019 da Seção Judiciária:  "]

{"sheet":"GCA_TvA","index":11,"n_rows":1,"n_cols":1,"rows_kept":1,"cut":false,"hidden":true,"merged":[[0,0,0,11],[1,1,49,15]]}
["COMPARATIVO de Processos dos Anos 2006 a 2019 da Seção Judiciária:  "]

{"sheet":"GCA_DvA","index":12,"n_rows":1,"n_cols":1,"rows_kept":1,"cut":false,"hidden":true,"merged":[[0,0,0,11],[1,1,49,15]]}
["COMPARATIVO de Processos dos Anos 2006 a 2019 da Seção Judiciária:  "]

{"sheet":"GCA_JvA","index":13,"n_rows":1,"n_cols":1,"rows_kept":1,"cut":false,"hidden":true,"merged":[[0,0,0,11],[1,1,49,15]]}
["COMPARATIVO de Processos dos Anos 2006 a 2019 da Seção Judiciária:  "]

{"sheet":"PCAAe","index":14,"n_rows":63,"n_cols":42,"rows_kept":63,"cut":false,"hidden":true,"merged":[[62,1,62,20],[60,1,60,20],[21,1,22,1],[21,2,21,5],[21,7,21,10],[21,12,21,15],[21,17,21,20],[41,1,42,1],[41,2,41,5],[41,7,41,10],[41,12,41,15],[41,17,41,20],[1,1,2,1],[1,2,1,5],[1,7,1,10],[1,12,1,15],[0,1,0,18],[1,17,1,20]]}
[null,"Mapa Geral CONSOLIDADO do 1º Grau (2006 a 2017 Apolo)  (2018 e 2019 Apolo e \"Eproc\")",null,null,null,null,null,null,null,null,null,null,null,null,null,null,null,null,null,null,null,null,null,3,4,5,6,null,8,9,10,11,null,13,14,15,16,null,18,19,20,21]
[null,"SJRJ","VARAS",null,null,null,null,"JUIZADOS",null,null,null,null,"TURMAS RECURSAIS",null,null,null,null,"CONSOLIDADO SJRJ",null,null,null,null,null,"V",null,null,null,null,"J",null,null,null,null,"T",null,null,null,null,"C"]
[null,null,"Distrib","Julg","Remeti","TRAM",null,"Distrib","Julg","Remeti","TRAM",null,"Distrib","Julg","Remeti","TRAM",null,"Distrib","Julg","Remeti","TRAM",null,null,"D","J","R","T",null,"D","J","R","T",null,"D","J","R","T",null,"D","J","R","T"]
[null,2006,127713,70566,22501,642234,null,187586,201622,32844,143456,null,32582,27176,null,20495,null,{"$f":"C4+H4+M4","v":347881},{"$f":"D4+I4+N4","v":299364},{"$f":"E4+J4","v":55345},{"$f":"F4+K4+P4","v":806185},null,null,"S","S","S","S",null,"S","S","S","S",null,"S","S","S","S",null,"S","S","S","S"]
[null,2007,134929,72817,24587,672198,null,199569,150066,27989,171510,null,29581,39847,null,15098,null,{"$f":"C5+H5+M5","v":364079},262730,{"$f":"E5+J5","v":52576},{"$f":"F5+K5+P5","v":858806},null,null,"S","S","S","S",null,"S","S","S","S",null,"S","S","S","S",null,"S","S","S","S"]
[null,2008,107561,72582,24210,677417,null,137696,133912,50857,143213,null,52023,54089,null,45288,null,297280,260583,75067,865918,null,null,"S","S","S","S",null,"S","S","S","S",null,"S","S","S","S",null,"S","S","S","S"]
[null,2009,123306,91016,30673,685069,null,139409,117736,46039,154408,null,47148,47914,null,58182,null,309863,256666,76712,897659,null,null,"S","S","S","S",null,"S","S","S","S",null,"S","S","S","S",null,"S","S","S","S"]
[null,2010,104040,101885,35165,666379,null,116275,105828,39439,163916,null,38635,44105,null,43631,null,258950,251818,74604,873926,null,null,"S","S","S","S",null,"S","S","S","S",null,"S","S","S","S",null,"S","S","S","S"]
[null,2011,112490,104342,35631,642936,null,93418,115712,42503,141923,null,43474,60032,null,50069,null,249382,280086,78134,834928,null,null,"S","S","S","S",null,"S","S","S","S",null,"S","S","S","S",null,"S","S","S","S"]
[null,2012,96622,100642,32333,630103,null,83039,99447,39814,111759,null,49427,49794,null,65235,null,229088,249883,72147,807097,null,null,"S","S","S","S",null,"S","S","S","S",null,"S","S","S","S",null,"S","S","S","S"]
[null,2013,87961,122318,39274,584820,null,104492,119912,46410,106558,null,63673,59086,null,77659,null,256126,301316,85684,769037,null,null,"S","S","S","S",null,"S","S","S","S",null,"S","S","S","S",null,"S","S","S","S"]
[null,2014,121666,122683,46430,572508,null,114855,119417,50430,102785,null,49996,73020,null,83589,null,286517,315120,96860,758882,null,null,"S","S","S","S",null,"S","S","S","S",null,"S","S","S","S",null,"S","S","S","S"]
[null,2015,108911,97679,32606,571789,null,98404,102541,36846,102983,null,36910,47344,null,83891,null,244225,247564,69452,758663,null,null,"S","S","S","S",null,"S","S","S","S",null,"S","S","S","S",null,"S","S","S","S"]
[null,2016,101809,76760,24922,592525,null,110348,100637,32608,120229,null,32732,43802,null,83901,null,244889,221199,57530,796655,null,null,"S","S","S","S",null,"S","S","S","S",null,"S","S","S","S",null,"S","S","S","S"]
[null,2017,151464,139362,24516,621087,null,114818,108028,32424,139350,null,32247,46970,null,56454,null,298529,294360,56940,816891,null,null,"S","S","S","S",null,"S","S","S","S",null,"S","S","S","S",null,"S","S","S","S"]
[null,"2018 Apolo",59120,109812,24138,530063,null,35108,128374,33578,36713,null,32852,48876,null,50962,null,{"$f":"C16+H16+M16","v":127080},{"$f":"D16+I16+N16","v":287062},{"$f":"E16+J16","v":57716},617738,null,null,"S","S","S","S",null,"S","S","S","S",null,"S","S","S","S",null,"S","S","S","S"]
[null,"2018 Eproc",43793,3530,471,61696,null,78214,28477,5430,80327,null,5748,1186,null,5497,null,127755,33193,5901,147520,null,null,"S","S","S","S",null,"S","S","S","S",null,"S","S","S","S",null,"S","S","S","S"]
[null,"2019 Apolo",7959,43371,7806,100231,null,45,11486,3106,15130,null,3357,29511,null,24048,null,{"$f":"C18+H18+M18","v":11361},{"$f":"D18+I18+N18","v":84368},{"$f":"E18+J18","v":10912},{"$f":"F18+K18+P18","v":139409},null,null,"S","S","S","S",null,"S","S","S","S",null,"S","S","S","S",null,"S","S","S","S"]
[null,"2019 Eproc",96298,62683,40960,483805,null,136095,117776,9245,128057,null,33271,25868,null,19969,null,265664,206327,50205,{"$f":"F19+K19+P19","v":631831},null,null,"S","S","S","S",null,"S","S","S","S",null,"S","S","S","S",null,"S","S","S","S"]
[null,"Consolidado",{"$f":"SUM(C4:C19)","v":1585642},{"$f":"SUM(D4:D19)","v":1392048},{"$f":"SUM(E4:E19)","v":446223},"-",null,{"$f":"SUM(H4:H19)","v":1749371},{"$f":"SUM(I4:I19)","v":1760971},{"$f":"SUM(J4:J19)","v":529562},"-",null,{"$f":"SUM(M4:M19)","v":583656},{"$f":"SUM(N4:N19)","v":698620},null,"-",null,{"$f":"C20+H20+M20","v":3918669},{"$f":"D20+I20+N20","v":3851639},{"$f":"E20+J20","v":975785},"-",null,null,"S","S","S","N",null,"S","S","S","N",null,"S","S","S","N",null,"S","S","S","N"]
[]
[null,"SJES","VARAS",null,null,null,null,"JUIZADOS",null,null,null,null,"TURMAS RECURSAIS",null,null,null,null,"CONSOLIDADO SJES"]
[null,null,"Distrib","Julg","Remeti","TRAM",null,"Distrib","Julg","Remeti","TRAM",null,"Distrib","Julg","Remeti","TRAM",null,"Distrib","Julg","Remeti","TRAM"]
[null,2006,17096,15018,4426,101158,null,12309,14191,3509,16435,null,3832,4318,null,3493,null,{"$f":"C24+H24+M24","v":33237},{"$f":"D24+I24+N24","v":33527},{"$f":"E24+J24","v":7935},{"$f":"F24+K24+P24","v":121086}]
[null,2007,20856,14211,4717,100047,null,20992,9337,2753,25345,null,2894,5164,null,2261,null,{"$f":"C25+H25+M25","v":44742},28712,{"$f":"E25+J25","v":7470},{"$f":"F25+K25+P25","v":127653}]
[null,2008,21934,14583,4449,103899,null,15782,13686,3512,27972,null,3625,3172,null,3319,null,41341,31441,7961,135190]
[null,2009,24218,14990,3929,110035,null,14939,11410,4638,29148,null,4651,6535,null,5490,null,43808,32935,8567,144673]
[null,2010,21087,14655,4398,111700,null,13593,13189,4200,29945,null,4645,4186,null,6002,null,39325,32030,8598,147647]
[null,2011,21704,14437,4047,116456,null,16238,14399,5572,32798,null,5857,3804,null,10015,null,43799,32640,9619,159269]
[null,2012,21429,19957,5050,117094,null,17507,20667,5894,31171,null,7465,4282,null,12128,null,46401,44906,10944,160393]
[null,2013,21489,21842,5546,114324,null,14559,19727,7663,25192,null,25270,7598,null,16755,null,61318,49167,13209,156271]
[null,2014,22570,16376,5191,112258,null,22674,17078,6135,30303,null,6025,9178,null,17361,null,51269,42632,11326,159922]
[null,2015,24352,17778,4433,118569,null,19382,17357,6043,34381,null,5986,8921,null,17796,null,49720,44056,10476,170746]
[null,2016,23898,16234,5149,122374,null,21522,17494,7363,39831,null,7240,11664,null,18856,null,52660,45392,12512,181061]
[null,2017,22848,18844,4489,125316,null,22122,20707,6730,42922,null,6602,11823,null,18600,null,51572,51374,11219,186838]
[null,"2018 Apolo",12137,20406,4446,95889,null,4718,33010,8032,11569,null,7913,18181,null,13698,null,24768,71597,12478,121156]
[null,"2018 Eproc",11857,1197,65,30388,null,20183,5581,1255,21075,null,1294,239,null,1182,null,33334,7017,1320,{"$f":"F37+K37+P37","v":52645}]
[null,"2019 Apolo",1960,7497,1633,13705,null,13,3016,1716,4559,null,921,12369,null,5943,null,{"$f":"C38+H38+M38","v":2894},{"$f":"D38+I38+N38","v":22882},{"$f":"E38+J38","v":3349},{"$f":"F38+K38+P38","v":24207}]
[null,"2019 Eproc",22725,13923,7935,112998,null,32016,24857,4285,36203,null,8855,6469,null,5414,null,63596,45249,12220,{"$f":"F39+K39+P39","v":154615}]
[null,"Consolidado",{"$f":"SUM(C24:C39)","v":312160},{"$f":"SUM(D24:D39)","v":241948},{"$f":"SUM(E24:E39)","v":69903},"-",null,{"$f":"SUM(H24:H39)","v":268549},{"$f":"SUM(I24:I39)","v":255706},{"$f":"SUM(J24:J39)","v":79300},"-",null,{"$f":"SUM(M24:M39)","v":103075},{"$f":"SUM(N24:N39)","v":117903},null,"-",null,{"$f":"C40+H40+M40","v":683784},{"$f":"D40+I40+N40","v":615557},{"$f":"E40+J40","v":149203},"-"]
[]
[null,"SJRJ + SJES","VARAS CONSOLIDADO",null,null,null,null,"JUIZADOS CONSOLIDADO",null,null,null,null,"TURMAS REC. CONSOLIDADO",null,null,null,null,"CONSOLIDADO GERAL"]
[null,null,"Distrib","Julg","Remeti","TRAM",null,"Distrib","Julg","Remeti","TRAM",null,"Distrib","Julg","Remeti","TRAM",null,"Distrib","Julg","Remeti","TRAM"]
[null,2006,{"$f":"C4+C24","v":144809},{"$f":"D4+D24","v":85584},26927,743392,null,{"$f":"H4+H24","v":199895},215813,36353,159891,null,{"$f":"M4+M24","v":36414},31494,null,{"$f":"P4+P24","v":23988},null,{"$f":"R4+R24","v":381118},332891,63280,927271]
[null,2007,155785,87028,29304,772245,null,220561,159403,30742,196855,null,32475,45011,null,17359,null,408821,291442,60046,986459]
[null,2008,129495,87165,28659,781316,null,153478,147598,54369,171185,null,55648,57261,null,48607,null,338621,292024,83028,1001108]
[null,2009,147524,106006,34602,795104,null,154348,129146,50677,183556,null,51799,54449,null,63672,null,353671,289601,85279,1042332]
[null,2010,125127,116540,39563,778079,null,129868,119017,43639,193861,null,43280,48291,null,49633,null,298275,283848,83202,1021573]
[null,2011,134194,118779,39678,759392,null,109656,130111,48075,174721,null,49331,63836,null,60084,null,293181,312726,87753,994197]
[null,2012,118051,120599,37383,747197,null,100546,120114,45708,142930,null,56892,54076,null,77363,null,275489,294789,83091,967490]
[null,2013,109450,144160,44820,699144,null,119051,139639,54073,131750,null,88943,66684,null,94414,null,317444,350483,98893,925308]
[null,2014,144236,139059,51621,684766,null,137529,136495,56565,133088,null,56021,82198,null,100950,null,337786,357752,108186,918804]
[null,2015,133263,115457,37039,690358,null,117786,119898,42889,137364,null,42896,56265,null,101687,null,293945,291620,79928,929409]
[null,2016,125707,92994,30071,714899,null,131870,118131,39971,160060,null,39972,55466,null,102757,null,297549,266591,70042,977716]
[null,2017,174312,158206,29005,746403,null,136940,128735,39154,182272,null,38849,58793,null,75054,null,350101,345734,68159,1003729]
[null,"2018 Apolo",71257,130218,28584,625952,null,39826,161384,41610,48282,null,40765,67057,null,64660,null,151848,358659,70194,738894]
[null,"2018 Eproc",55650,4727,536,92084,null,98397,34058,6685,101402,null,7042,1425,null,6679,null,161089,40210,7221,200165]
[null,"2019 Apolo",{"$f":"C18+C38","v":9919},50868,9439,113936,null,{"$f":"H18+H38","v":58},14502,4822,19689,null,{"$f":"M18+M38","v":4278},41880,null,{"$f":"P18+P38","v":29991},null,{"$f":"R18+R38","v":14255},107250,14261,163616]
[null,"2019 Eproc",119023,76606,48895,{"$f":"F19+F39","v":596803},null,168111,142633,13530,164260,null,42126,32337,null,{"$f":"P19+P39","v":25383},null,329260,251576,62425,786446]
[null,"Até 2019",1897802,1633996,516126,"-",null,{"$f":"H20+H40","v":2017920},{"$f":"I20+I40","v":2016677},{"$f":"J20+J40","v":608862},"-",null,686731,816523,null,"-",null,{"$f":"R20+R40","v":4602453},{"$f":"S20+S40","v":4467196},{"$f":"T20+T40","v":1124988},"-"]
[null,"OBS.: Os valores poderão ser alterados, em função de modificações na base de dados, por parte do usuário."]
[]
[null,"_ Desde o dia 23 de Fevereiro de 2018, o NOVO sistema processual \"Eproc\" está em funcionamento na Justiça Federal da 2ª Região."]

{"sheet":"PaMAe","index":15,"n_rows":61,"n_cols":28,"rows_kept":61,"cut":false,"hidden":true,"merged":[[60,1,60,20],[49,1,51,1],[53,1,55,1],[3,3,3,8],[29,1,31,1],[33,1,35,1],[37,1,39,1],[41,1,43,1],[45,1,47,1],[1,3,1,4],[3,10,3,15],[3,22,3,27],[3,17,3,20],[25,1,27,1],[5,1,7,1],[9,1,11,1],[13,1,15,1],[17,1,19,1],[21,1,23,1]]}
[]
[null,"Ano",null,"Seção Judiciária",null,null,null,null,null,null,"     Mapa Geral Judicial do 1º Grau (Apolo e \"Eproc\")"]
[]
[null,null,null,"1ª Distribuição",null,null,null,null,null,null,"Julgados",null,null,null,null,null,null,"Remetidos ao TRF/TR",null,null,null,null,"Tramitação \"Real\""]
[null,"Mês","Tipo de Juízo","Apolo","Acum","Eproc","Acum","TOTAL","Acum",null,"Apolo","Acum","Eproc","Acum","TOTAL","Acum",null,"Apolo","Eproc","TOTAL","Acum",null,"Apolo","% Variação","Eproc","% Variação","TOTAL","% Variação"]
[null,"Dezembro","Varas",{"$f":"IF(TA!$C$17=3,SUMIF(Dados!$B$2:$L$217,TA!$A$42&PaMAe!$C6&PaMAe!$B$6,Dados!$I$2:$I$217),VLOOKUP(TA!$D$42&$C6&$B$6,Dados!$A$2:$L$217,9,0))","v":620},null,{"$f":"IF(TA!$C$17=3,SUMIF(Dados!$B$2:$P$217,TA!$A$42&PaMAe!$C6&PaMAe!$B$6,Dados!$M$2:$M$217),VLOOKUP(TA!$D$42&$C6&$B$6,Dados!$A$2:$P$217,13,0))","v":9097},null,{"$f":"IF(D6=0,\"\",D6+F6)","v":9717},null,null,{"$f":"IF(TA!$C$17=3,SUMIF(Dados!$B$2:$L$217,TA!$A$42&PaMAe!$C6&PaMAe!$B$6,Dados!$J$2:$J$217),VLOOKUP(TA!$D$42&$C6&$B$6,Dados!$A$2:$L$217,10,0))","v":5333},null,{"$f":"IF(TA!$C$17=3,SUMIF(Dados!$B$2:$P$217, TA!$A$42&PaMAe!$C6&PaMAe!$B$6,Dados!$N$2:$N$217), VLOOKUP(TA!$D$42&$C6&$B$6,Dados!$A$2:$P$217,14,0))","v":840},null,{"$f":"IF(K6=0,\"\",K6+M6)","v":6173},null,null,{"$f":"IF(TA!$C$17=3,SUMIF(Dados!$B$2:$L$217,TA!$A$42&PaMAe!$C6&PaMAe!$B$6,Dados!$K$2:$K$217),VLOOKUP(TA!$D$42&$C6&$B$6,Dados!$A$2:$L$217,11,0))","v":1127},{"$f":"IF(TA!$C$17=3,SUMIF(Dados!$B$2:$P$217, TA!$A$42&PaMAe!$C6&PaMAe!$B$6,Dados!$O$2:$O$217), VLOOKUP(TA!$D$42&$C6&$B$6,Dados!$A$2:$P$217,15,0))","v":157},{"$f":"IF(AND(R6=0,S6=0),\"\",R6+S6)","v":1284},null,null,{"$f":"IF(TA!$C$17=3,SUMIF(Dados!$B$2:$L$217,TA!$A$42&PaMAe!$C6&PaMAe!$B$6,Dados!$L$2:$L$217),VLOOKUP(TA!$D$42&$C6&$B$6,Dados!$A$2:$L$217,12,0))","v":530063},{"$f":"IF(W6=0,\"\",(W6/TA!$G$40)-1)","v":-5.1314221078366473E-2},{"$f":"IF(TA!$C$17=3,SUMIF(Dados!$B$2:$P$217, TA!$A$42&PaMAe!$C6&PaMAe!$B$6,Dados!$P$2:$P$217), VLOOKUP(TA!$D$42&$C6&$B$6,Dados!$A$2:$P$217,16,0))","v":61696},{"$f":"IF(Y6=0,\"\",(Y6/TA!$G$46)-1)","v":1.0944427470550293},{"$f":"IF(AND(W6=0,Y6=0),\"\",W6+Y6)","v":591759}]
[null,null,"Juizados",{"$f":"IF(TA!$C$17=3,SUMIF(Dados!$B$2:$L$217,TA!$A$42&PaMAe!$C7&PaMAe!$B$6,Dados!$I$2:$I$217),VLOOKUP(TA!$D$42&$C7&$B$6,Dados!$A$2:$L$217,9,0))","v":2},null,{"$f":"IF(TA!$C$17=3,SUMIF(Dados!$B$2:$P$217,TA!$A$42&PaMAe!$C7&PaMAe!$B$6,Dados!$M$2:$M$217),VLOOKUP(TA!$D$42&$C7&$B$6,Dados!$A$2:$P$217,13,0))","v":8372},null,8374,null,null,{"$f":"IF(TA!$C$17=3,SUMIF(Dados!$B$2:$L$217,TA!$A$42&PaMAe!$C7&PaMAe!$B$6,Dados!$J$2:$J$217),VLOOKUP(TA!$D$42&$C7&$B$6,Dados!$A$2:$L$217,10,0))","v":2556},null,{"$f":"IF(TA!$C$17=3,SUMIF(Dados!$B$2:$P$217, TA!$A$42&PaMAe!$C7&PaMAe!$B$6,Dados!$N$2:$N$217), VLOOKUP(TA!$D$42&$C7&$B$6,Dados!$A$2:$P$217,14,0))","v":5169},null,{"$f":"IF(K7=0,\"\",K7+M7)","v":7725},null,null,{"$f":"IF(TA!$C$17=3,SUMIF(Dados!$B$2:$L$217,TA!$A$42&PaMAe!$C7&PaMAe!$B$6,Dados!$K$2:$K$217),VLOOKUP(TA!$D$42&$C7&$B$6,Dados!$A$2:$L$217,11,0))","v":580},{"$f":"IF(TA!$C$17=3,SUMIF(Dados!$B$2:$P$217, TA!$A$42&PaMAe!$C7&PaMAe!$B$6,Dados!$O$2:$O$217), VLOOKUP(TA!$D$42&$C7&$B$6,Dados!$A$2:$P$217,15,0))","v":1389},{"$f":"IF(AND(R7=0,S7=0),\"\",R7+S7)","v":1969},null,null,{"$f":"IF(TA!$C$17=3,SUMIF(Dados!$B$2:$L$217,TA!$A$42&PaMAe!$C7&PaMAe!$B$6,Dados!$L$2:$L$217),VLOOKUP(TA!$D$42&$C7&$B$6,Dados!$A$2:$L$217,12,0))","v":36713},{"$f":"IF(W7=0,\"\",(W7/TA!$G$41)-1)","v":-0.11811193850588519},{"$f":"IF(TA!$C$17=3,SUMIF(Dados!$B$2:$P$217, TA!$A$42&PaMAe!$C7&PaMAe!$B$6,Dados!$P$2:$P$217), VLOOKUP(TA!$D$42&$C7&$B$6,Dados!$A$2:$P$217,16,0))","v":80327},{"$f":"IF(Y7=0,\"\",(Y7/TA!$G$47)-1)","v":9.237903554818172E-2},{"$f":"IF(AND(W7=0,Y7=0),\"\",W7+Y7)","v":117040}]
[null,null,"Turmas Recursais",{"$f":"IF(TA!$C$17=3,SUMIF(Dados!$B$2:$L$217,TA!$A$42&PaMAe!$C8&PaMAe!$B$6,Dados!$I$2:$I$217),VLOOKUP(TA!$D$42&$C8&$B$6,Dados!$A$2:$L$217,9,0))","v":70},null,{"$f":"IF(TA!$C$17=3,SUMIF(Dados!$B$2:$P$217,TA!$A$42&PaMAe!$C8&PaMAe!$B$6,Dados!$M$2:$M$217),VLOOKUP(TA!$D$42&$C8&$B$6,Dados!$A$2:$P$217,13,0))","v":1424},null,1494,null,null,{"$f":"IF(TA!$C$17=3,SUMIF(Dados!$B$2:$L$217,TA!$A$42&PaMAe!$C8&PaMAe!$B$6,Dados!$J$2:$J$217),VLOOKUP(TA!$D$42&$C8&$B$6,Dados!$A$2:$L$217,10,0))","v":1991},null,{"$f":"IF(TA!$C$17=3,SUMIF(Dados!$B$2:$P$217, TA!$A$42&PaMAe!$C8&PaMAe!$B$6,Dados!$N$2:$N$217), VLOOKUP(TA!$D$42&$C8&$B$6,Dados!$A$2:$P$217,14,0))","v":456},null,2447,null,null,{"$f":"IF(TA!$C$17=3,SUMIF(Dados!$B$2:$L$217,TA!$A$42&PaMAe!$C8&PaMAe!$B$6,Dados!$K$2:$K$217),VLOOKUP(TA!$D$42&$C8&$B$6,Dados!$A$2:$L$217,11,0))","v":0},{"$f":"IF(TA!$C$17=3,SUMIF(Dados!$B$2:$P$217, TA!$A$42&PaMAe!$C8&PaMAe!$B$6,Dados!$O$2:$O$217), VLOOKUP(TA!$D$42&$C8&$B$6,Dados!$A$2:$P$217,15,0))","v":0},{"$f":"IF(AND(R8=0,S8=0),\"\",R8+S8)","v":""},null,null,{"$f":"IF(TA!$C$17=3,SUMIF(Dados!$B$2:$L$217,TA!$A$42&PaMAe!$C8&PaMAe!$B$6,Dados!$L$2:$L$217),VLOOKUP(TA!$D$42&$C8&$B$6,Dados!$A$2:$L$217,12,0))","v":50962},{"$f":"IF(W8=0,\"\",(W8/TA!$G$42)-1)","v":-4.3110894137969868E-2},{"$f":"IF(TA!$C$17=3,SUMIF(Dados!$B$2:$P$217, TA!$A$42&PaMAe!$C8&PaMAe!$B$6,Dados!$P$2:$P$217), VLOOKUP(TA!$D$42&$C8&$B$6,Dados!$A$2:$P$217,16,0))","v":5497},{"$f":"IF(Y8=0,\"\",(Y8/TA!$G$48)-1)","v":0.29371616851023763},{"$f":"IF(AND(W8=0,Y8=0),\"\",W8+Y8)","v":56459}]
[null,"Total",null,{"$f":"SUM(D6:D8)","v":692},null,{"$f":"SUM(F6:F8)","v":18893},null,19585,null,null,{"$f":"SUM(K6:K8)","v":9880},null,{"$f":"SUM(M6:M8)","v":6465},null,16345,null,null,{"$f":"SUM(R6:R8)","v":1707},{"$f":"SUM(S6:S8)","v":1546},{"$f":"IF(R9=0,\"\",R9+S9)","v":3253},null,null,{"$f":"SUM(W6:W8)","v":617738},{"$f":"IF(W9=0,\"\",(W9/TA!$G$43-1))","v":-5.4900232856299191E-2},{"$f":"SUM(Y6:Y8)","v":147520},{"$f":"IF(Y9=0,\"\",(Y9/TA!$G$49-1))","v":0.37560611712047742},{"$f":"IF(W9=0,\"\",W9+Y9)","v":765258}]
[null,"Janeiro","Varas",{"$f":"IF(TA!$C$17=3,SUMIF(Dados!$B$2:$L$217,TA!$A$40&PaMAe!$C10&PaMAe!$B$10,Dados!$I$2:$I$217),VLOOKUP(TA!$D$40&$C10&$B$10,Dados!$A$2:$L$217,9,0))","v":827},{"$f":"IF(D10=0,\"\",D10)","v":827},{"$f":"IF(TA!$C$17=3,SUMIF(Dados!$B$2:$P$217,TA!$A$40&PaMAe!$C10&PaMAe!$B$10,Dados!$M$2:$M$217),VLOOKUP(TA!$D$40&$C10&$B$10,Dados!$A$2:$P$217,13,0))","v":4840},{"$f":"IF(F10=0,\"\",F10)","v":4840},5667,{"$f":"IF(H10=\"\",\"\",H10)","v":5667},null,{"$f":"IF(TA!$C$17=3,SUMIF(Dados!$B$2:$L$217,TA!$A$40&PaMAe!$C10&PaMAe!$B$10,Dados!$J$2:$J$217),VLOOKUP(TA!$D$40&$C10&$B$10,Dados!$A$2:$L$217,10,0))","v":4735},{"$f":"IF(K10=0,\"\",K10)","v":4735},{"$f":"IF(TA!$C$17=3,SUMIF(Dados!$B$2:$P$217, TA!$A$40&PaMAe!$C10&PaMAe!$B$10,Dados!$N$2:$N$217), VLOOKUP(TA!$D$40&$C10&$B$10,Dados!$A$2:$P$217,14,0))","v":1134},{"$f":"IF(M10=0,\"\",M10)","v":1134},{"$f":"IF(K10=0,\"\",K10+M10)","v":5869},{"$f":"IF(O10=\"\",\"\",O10)","v":5869},null,{"$f":"IF(TA!$C$17=3,SUMIF(Dados!$B$2:$L$217,TA!$A$40&PaMAe!$C10&PaMAe!$B$10,Dados!$K$2:$K$217),VLOOKUP(TA!$D$40&$C10&$B$10,Dados!$A$2:$L$217,11,0))","v":1009},{"$f":"IF(TA!$C$17=3,SUMIF(Dados!$B$2:$P$217, TA!$A$40&PaMAe!$C10&PaMAe!$B$10,Dados!$O$2:$O$217), VLOOKUP(TA!$D$40&$C10&$B$10,Dados!$A$2:$P$217,15,0))","v":1446},{"$f":"IF(AND(R10=0,S10=0),\"\",R10+S10)","v":2455},{"$f":"IF(T10=\"\",\"\",T10)","v":2455},null,{"$f":"IF(TA!$C$17=3,SUMIF(Dados!$B$2:$L$217,TA!$A$40&PaMAe!$C10&PaMAe!$B$10,Dados!$L$2:$L$217),VLOOKUP(TA!$D$40&$C10&$B$10,Dados!$A$2:$L$217,12,0))","v":513561},{"$f":"IF(W10=0,\"\",(W10/W6)-1)","v":-3.1132148442732266E-2},{"$f":"IF(TA!$C$17=3,SUMIF(Dados!$B$2:$P$217, TA!$A$40&PaMAe!$C10&PaMAe!$B$10,Dados!$P$2:$P$217), VLOOKUP(TA!$D$40&$C10&$B$10,Dados!$A$2:$P$217,16,0))","v":75081},{"$f":"IF(Y10=0,\"\",(Y10/Y6)-1)","v":0.21695085580912865},{"$f":"IF(AND(W10=0,Y10=0),\"\",W10+Y10)","v":588642},{"$f":"IF(AA10=\"\",\"\",(AA10/AA6)-1)","v":-5.2673470111987974E-3}]
[null,null,"Juizados",{"$f":"IF(TA!$C$17=3,SUMIF(Dados!$B$2:$L$217,TA!$A$40&PaMAe!$C11&PaMAe!$B$10,Dados!$I$2:$I$217),VLOOKUP(TA!$D$40&$C11&$B$10,Dados!$A$2:$L$217,9,0))","v":6},{"$f":"IF(D11=0,0,D11)","v":6},{"$f":"IF(TA!$C$17=3,SUMIF(Dados!$B$2:$P$217,TA!$A$40&PaMAe!$C11&PaMAe!$B$10,Dados!$M$2:$M$217),VLOOKUP(TA!$D$40&$C11&$B$10,Dados!$A$2:$P$217,13,0))","v":6950},{"$f":"IF(F11=0,\"\",F11)","v":6950},{"$f":"IF(D11=0,IF(F11=0,\"\",D11+F11),D11+F11)","v":6956},{"$f":"IF(H11=\"\",0,H11)","v":6956},null,{"$f":"IF(TA!$C$17=3,SUMIF(Dados!$B$2:$L$217,TA!$A$40&PaMAe!$C11&PaMAe!$B$10,Dados!$J$2:$J$217),VLOOKUP(TA!$D$40&$C11&$B$10,Dados!$A$2:$L$217,10,0))","v":2186},{"$f":"IF(K11=0,\"\",K11)","v":2186},{"$f":"IF(TA!$C$17=3,SUMIF(Dados!$B$2:$P$217, TA!$A$40&PaMAe!$C11&PaMAe!$B$10,Dados!$N$2:$N$217), VLOOKUP(TA!$D$40&$C11&$B$10,Dados!$A$2:$P$217,14,0))","v":6294},{"$f":"IF(M11=0,\"\",M11)","v":6294},{"$f":"IF(K11=0,\"\",K11+M11)","v":8480},{"$f":"IF(O11=\"\",\"\",O11)","v":8480},null,{"$f":"IF(TA!$C$17=3,SUMIF(Dados!$B$2:$L$217,TA!$A$40&PaMAe!$C11&PaMAe!$B$10,Dados!$K$2:$K$217),VLOOKUP(TA!$D$40&$C11&$B$10,Dados!$A$2:$L$217,11,0))","v":592},{"$f":"IF(TA!$C$17=3,SUMIF(Dados!$B$2:$P$217, TA!$A$40&PaMAe!$C11&PaMAe!$B$10,Dados!$O$2:$O$217), VLOOKUP(TA!$D$40&$C11&$B$10,Dados!$A$2:$P$217,15,0))","v":369},{"$f":"IF(AND(R11=0,S11=0),\"\",R11+S11)","v":961},{"$f":"IF(T11=\"\",\"\",T11)","v":961},null,{"$f":"IF(TA!$C$17=3,SUMIF(Dados!$B$2:$L$217,TA!$A$40&PaMAe!$C11&PaMAe!$B$10,Dados!$L$2:$L$217),VLOOKUP(TA!$D$40&$C11&$B$10,Dados!$A$2:$L$217,12,0))","v":33022},{"$f":"IF(W11=0,\"\",(W11/W7)-1)","v":-0.10053659466673925},{"$f":"IF(TA!$C$17=3,SUMIF(Dados!$B$2:$P$217, TA!$A$40&PaMAe!$C11&PaMAe!$B$10,Dados!$P$2:$P$217), VLOOKUP(TA!$D$40&$C11&$B$10,Dados!$A$2:$P$217,16,0))","v":84475},5.1638925890422849E-2,{"$f":"IF(AND(W11=0,Y11=0),\"\",W11+Y11)","v":117497},{"$f":"IF(AA11=\"\",\"\",(AA11/AA7)-1)","v":3.9046479835953551E-3}]
[null,null,"Turmas Recursais",{"$f":"IF(TA!$C$17=3,SUMIF(Dados!$B$2:$L$217,TA!$A$40&PaMAe!$C12&PaMAe!$B$10,Dados!$I$2:$I$217),VLOOKUP(TA!$D$40&$C12&$B$10,Dados!$A$2:$L$217,9,0))","v":1034},{"$f":"IF(D12=0,\"\",D12)","v":1034},{"$f":"IF(TA!$C$17=3,SUMIF(Dados!$B$2:$P$217,TA!$A$40&PaMAe!$C12&PaMAe!$B$10,Dados!$M$2:$M$217),VLOOKUP(TA!$D$40&$C12&$B$10,Dados!$A$2:$P$217,13,0))","v":1536},{"$f":"IF(F12=0,\"\",F12)","v":1536},2570,{"$f":"IF(H12=\"\",\"\",H12)","v":2570},null,{"$f":"IF(TA!$C$17=3,SUMIF(Dados!$B$2:$L$217,TA!$A$40&PaMAe!$C12&PaMAe!$B$10,Dados!$J$2:$J$217),VLOOKUP(TA!$D$40&$C12&$B$10,Dados!$A$2:$L$217,10,0))","v":1316},{"$f":"IF(K12=0,\"\",K12)","v":1316},{"$f":"IF(TA!$C$17=3,SUMIF(Dados!$B$2:$P$217, TA!$A$40&PaMAe!$C12&PaMAe!$B$10,Dados!$N$2:$N$217), VLOOKUP(TA!$D$40&$C12&$B$10,Dados!$A$2:$P$217,14,0))","v":664},{"$f":"IF(M12=0,\"\",M12)","v":664},1980,{"$f":"IF(O12=\"\",\"\",O12)","v":1980},null,{"$f":"IF(TA!$C$17=3,SUMIF(Dados!$B$2:$L$217,TA!$A$40&PaMAe!$C12&PaMAe!$B$10,Dados!$K$2:$K$217),VLOOKUP(TA!$D$40&$C12&$B$10,Dados!$A$2:$L$217,11,0))","v":0},{"$f":"IF(TA!$C$17=3,SUMIF(Dados!$B$2:$P$217, TA!$A$40&PaMAe!$C12&PaMAe!$B$10,Dados!$O$2:$O$217), VLOOKUP(TA!$D$40&$C12&$B$10,Dados!$A$2:$P$217,15,0))","v":0},{"$f":"IF(AND(R12=0,S12=0),\"\",R12+S12)","v":""},{"$f":"IF(T12=\"\",\"\",T12)","v":""},null,{"$f":"IF(TA!$C$17=3,SUMIF(Dados!$B$2:$L$217,TA!$A$40&PaMAe!$C12&PaMAe!$B$10,Dados!$L$2:$L$217),VLOOKUP(TA!$D$40&$C12&$B$10,Dados!$A$2:$L$217,12,0))","v":50625},{"$f":"IF(W12=0,\"\",(W12/W8)-1)","v":-6.6127702994388526E-3},{"$f":"IF(TA!$C$17=3,SUMIF(Dados!$B$2:$P$217, TA!$A$40&PaMAe!$C12&PaMAe!$B$10,Dados!$P$2:$P$217), VLOOKUP(TA!$D$40&$C12&$B$10,Dados!$A$2:$P$217,16,0))","v":6924},0.25959614335091863,{"$f":"IF(AND(W12=0,Y12=0),\"\",W12+Y12)","v":57549},{"$f":"IF(AA12=\"\",\"\",(AA12/AA8)-1)","v":1.9306045094670488E-2}]
[null,"Total",null,{"$f":"SUM(D10:D12)","v":1867},{"$f":"IF(D13=0,\"\",SUM(E10:E12))","v":1867},{"$f":"SUM(F10:F12)","v":13326},{"$f":"IF(F13=0,\"\",SUM(G10:G12))","v":13326},15193,{"$f":"IF(H13=\"\",\"\",SUM(I10:I12))","v":15193},null,{"$f":"SUM(K10:K12)","v":8237},{"$f":"IF(K13=0,\"\",SUM(L10:L12))","v":8237},{"$f":"SUM(M10:M12)","v":8092},{"$f":"IF(M13=0,\"\",SUM(N10:N12))","v":8092},16329,{"$f":"IF(O13=\"\",\"\",SUM(P10:P12))","v":16329},null,{"$f":"SUM(R10:R12)","v":1601},{"$f":"SUM(S10:S12)","v":1815},{"$f":"IF(R13=0,\"\",R13+S13)","v":3416},{"$f":"IF(T13=\"\",\"\",SUM(U10:U12))","v":3416},null,{"$f":"SUM(W10:W12)","v":597208},{"$f":"IF(W13=0,\"\",(W13/W9)-1)","v":-3.3234154285473827E-2},{"$f":"SUM(Y10:Y12)","v":166480},0.12852494577006501,{"$f":"IF(W13=0,\"\",W13+Y13)","v":763688},{"$f":"IF(AA13=\"\",\"\",(AA13/AA9)-1)","v":-2.0515956710024374E-3}]
[null,"Fevereiro","Varas",{"$f":"IF(TA!$C$17=3,SUMIF(Dados!$B$2:$L$217,TA!$A$40&PaMAe!$C14&PaMAe!$B$14,Dados!$I$2:$I$217),VLOOKUP(TA!$D$40&$C14&$B$14,Dados!$A$2:$L$217,9,0))","v":816},{"$f":"IF(D14=0,\"\",E10+D14)","v":1643},{"$f":"IF(TA!$C$17=3,SUMIF(Dados!$B$2:$P$217,TA!$A$40&PaMAe!$C14&PaMAe!$B$14,Dados!$M$2:$M$217),VLOOKUP(TA!$D$40&$C14&$B$14,Dados!$A$2:$P$217,13,0))","v":6355},{"$f":"IF(F14=0,\"\",IF(G10=\"\",F14,G10+F14))","v":11195},7171,{"$f":"IF(H14=\"\",\"\",I10+H14)","v":12838},null,{"$f":"IF(TA!$C$17=3,SUMIF(Dados!$B$2:$L$217,TA!$A$40&PaMAe!$C14&PaMAe!$B$14,Dados!$J$2:$J$217),VLOOKUP(TA!$D$40&$C14&$B$14,Dados!$A$2:$L$217,10,0))","v":5988},{"$f":"IF(K14=0,\"\",L10+K14)","v":10723},{"$f":"IF(TA!$C$17=3,SUMIF(Dados!$B$2:$P$217, TA!$A$40&PaMAe!$C14&PaMAe!$B$14,Dados!$N$2:$N$217), VLOOKUP(TA!$D$40&$C14&$B$14,Dados!$A$2:$P$217,14,0))","v":2828},{"$f":"IF(M14=0,\"\",IF(N10=\"\",M14,N10+M14))","v":3962},8816,{"$f":"IF(O14=\"\",\"\",P10+O14)","v":14685},null,{"$f":"IF(TA!$C$17=3,SUMIF(Dados!$B$2:$L$217,TA!$A$40&PaMAe!$C14&PaMAe!$B$14,Dados!$K$2:$K$217),VLOOKUP(TA!$D$40&$C14&$B$14,Dados!$A$2:$L$217,11,0))","v":1030},{"$f":"IF(TA!$C$17=3,SUMIF(Dados!$B$2:$P$217, TA!$A$40&PaMAe!$C14&PaMAe!$B$14,Dados!$O$2:$O$217), VLOOKUP(TA!$D$40&$C14&$B$14,Dados!$A$2:$P$217,15,0))","v":3027},{"$f":"IF(AND(R14=0,S14=0),\"\",R14+S14)","v":4057},{"$f":"IF(T14=\"\",\"\",U10+T14)","v":6512},null,{"$f":"IF(TA!$C$17=3,SUMIF(Dados!$B$2:$L$217,TA!$A$40&PaMAe!$C14&PaMAe!$B$14,Dados!$L$2:$L$217),VLOOKUP(TA!$D$40&$C14&$B$14,Dados!$A$2:$L$217,12,0))","v":481199},{"$f":"IF(W14=0,\"\",(W14/W10)-1)","v":-6.3014909621252446E-2},{"$f":"IF(TA!$C$17=3,SUMIF(Dados!$B$2:$P$217, TA!$A$40&PaMAe!$C14&PaMAe!$B$14,Dados!$P$2:$P$217), VLOOKUP(TA!$D$40&$C14&$B$14,Dados!$A$2:$P$217,16,0))","v":106459},0.41792197759752803,{"$f":"IF(AND(W14=0,Y14=0),\"\",W14+Y14)","v":587658},-1.6716442251827335E-3]
[null,null,"Juizados",{"$f":"IF(TA!$C$17=3,SUMIF(Dados!$B$2:$L$217,TA!$A$40&PaMAe!$C15&PaMAe!$B$14,Dados!$I$2:$I$217),VLOOKUP(TA!$D$40&$C15&$B$14,Dados!$A$2:$L$217,9,0))","v":3},{"$f":"IF(D15=0,\"\",E11+D15)","v":9},{"$f":"IF(TA!$C$17=3,SUMIF(Dados!$B$2:$P$217,TA!$A$40&PaMAe!$C15&PaMAe!$B$14,Dados!$M$2:$M$217),VLOOKUP(TA!$D$40&$C15&$B$14,Dados!$A$2:$P$217,13,0))","v":9717},{"$f":"IF(F15=0,\"\",IF(G11=\"\",F15,G11+F15))","v":16667},9720,{"$f":"IF(H15=\"\",\"\",I11+H15)","v":16676},null,{"$f":"IF(TA!$C$17=3,SUMIF(Dados!$B$2:$L$217,TA!$A$40&PaMAe!$C15&PaMAe!$B$14,Dados!$J$2:$J$217),VLOOKUP(TA!$D$40&$C15&$B$14,Dados!$A$2:$L$217,10,0))","v":1415},{"$f":"IF(K15=0,\"\",L11+K15)","v":3601},{"$f":"IF(TA!$C$17=3,SUMIF(Dados!$B$2:$P$217, TA!$A$40&PaMAe!$C15&PaMAe!$B$14,Dados!$N$2:$N$217), VLOOKUP(TA!$D$40&$C15&$B$14,Dados!$A$2:$P$217,14,0))","v":9600},{"$f":"IF(M15=0,\"\",IF(N11=\"\",M15,N11+M15))","v":15894},11015,{"$f":"IF(O15=\"\",\"\",P11+O15)","v":19495},null,{"$f":"IF(TA!$C$17=3,SUMIF(Dados!$B$2:$L$217,TA!$A$40&PaMAe!$C15&PaMAe!$B$14,Dados!$K$2:$K$217),VLOOKUP(TA!$D$40&$C15&$B$14,Dados!$A$2:$L$217,11,0))","v":632},{"$f":"IF(TA!$C$17=3,SUMIF(Dados!$B$2:$P$217, TA!$A$40&PaMAe!$C15&PaMAe!$B$14,Dados!$O$2:$O$217), VLOOKUP(TA!$D$40&$C15&$B$14,Dados!$A$2:$P$217,15,0))","v":765},{"$f":"IF(AND(R15=0,S15=0),\"\",R15+S15)","v":1397},{"$f":"IF(T15=\"\",\"\",U11+T15)","v":2358},null,{"$f":"IF(TA!$C$17=3,SUMIF(Dados!$B$2:$L$217,TA!$A$40&PaMAe!$C15&PaMAe!$B$14,Dados!$L$2:$L$217),VLOOKUP(TA!$D$40&$C15&$B$14,Dados!$A$2:$L$217,12,0))","v":24520},-0.25746472048937075,{"$f":"IF(TA!$C$17=3,SUMIF(Dados!$B$2:$P$217, TA!$A$40&PaMAe!$C15&PaMAe!$B$14,Dados!$P$2:$P$217), VLOOKUP(TA!$D$40&$C15&$B$14,Dados!$A$2:$P$217,16,0))","v":89246},5.6478248002367559E-2,{"$f":"IF(AND(W15=0,Y15=0),\"\",W15+Y15)","v":113766},-3.1754002229844147E-2]
[null,null,"Turmas Recursais",{"$f":"IF(TA!$C$17=3,SUMIF(Dados!$B$2:$L$217,TA!$A$40&PaMAe!$C16&PaMAe!$B$14,Dados!$I$2:$I$217),VLOOKUP(TA!$D$40&$C16&$B$14,Dados!$A$2:$L$217,9,0))","v":265},{"$f":"IF(D16=0,\"\",E12+D16)","v":1299},{"$f":"IF(TA!$C$17=3,SUMIF(Dados!$B$2:$P$217,TA!$A$40&PaMAe!$C16&PaMAe!$B$14,Dados!$M$2:$M$217),VLOOKUP(TA!$D$40&$C16&$B$14,Dados!$A$2:$P$217,13,0))","v":3118},{"$f":"IF(F16=0,\"\",IF(G12=\"\",F16,G12+F16))","v":4654},3383,{"$f":"IF(H16=\"\",\"\",I12+H16)","v":5953},null,{"$f":"IF(TA!$C$17=3,SUMIF(Dados!$B$2:$L$217,TA!$A$40&PaMAe!$C16&PaMAe!$B$14,Dados!$J$2:$J$217),VLOOKUP(TA!$D$40&$C16&$B$14,Dados!$A$2:$L$217,10,0))","v":2355},{"$f":"IF(K16=0,\"\",L12+K16)","v":3671},{"$f":"IF(TA!$C$17=3,SUMIF(Dados!$B$2:$P$217, TA!$A$40&PaMAe!$C16&PaMAe!$B$14,Dados!$N$2:$N$217), VLOOKUP(TA!$D$40&$C16&$B$14,Dados!$A$2:$P$217,14,0))","v":860},{"$f":"IF(M16=0,\"\",IF(N12=\"\",M16,N12+M16))","v":1524},3215,{"$f":"IF(O16=\"\",\"\",P12+O16)","v":5195},null,{"$f":"IF(TA!$C$17=3,SUMIF(Dados!$B$2:$L$217,TA!$A$40&PaMAe!$C16&PaMAe!$B$14,Dados!$K$2:$K$217),VLOOKUP(TA!$D$40&$C16&$B$14,Dados!$A$2:$L$217,11,0))","v":0},{"$f":"IF(TA!$C$17=3,SUMIF(Dados!$B$2:$P$217, TA!$A$40&PaMAe!$C16&PaMAe!$B$14,Dados!$O$2:$O$217), VLOOKUP(TA!$D$40&$C16&$B$14,Dados!$A$2:$P$217,15,0))","v":0},{"$f":"IF(AND(R16=0,S16=0),\"\",R16+S16)","v":""},{"$f":"IF(T16=\"\",\"\",U12+T16)","v":""},null,{"$f":"IF(TA!$C$17=3,SUMIF(Dados!$B$2:$L$217,TA!$A$40&PaMAe!$C16&PaMAe!$B$14,Dados!$L$2:$L$217),VLOOKUP(TA!$D$40&$C16&$B$14,Dados!$A$2:$L$217,12,0))","v":48799},-3.6069135802469177E-2,{"$f":"IF(TA!$C$17=3,SUMIF(Dados!$B$2:$P$217, TA!$A$40&PaMAe!$C16&PaMAe!$B$14,Dados!$P$2:$P$217), VLOOKUP(TA!$D$40&$C16&$B$14,Dados!$A$2:$P$217,16,0))","v":9296},0.34257654534950888,{"$f":"IF(AND(W16=0,Y16=0),\"\",W16+Y16)","v":58095},9.4875671167178321E-3]
[null,"Total",null,{"$f":"SUM(D14:D16)","v":1084},{"$f":"IF(D17=0,\"\",SUM(E14:E16))","v":2951},{"$f":"SUM(F14:F16)","v":19190},{"$f":"IF(F17=0,\"\",SUM(G14:G16))","v":32516},20274,{"$f":"IF(H17=\"\",\"\",SUM(I14:I16))","v":35467},null,{"$f":"SUM(K14:K16)","v":9758},{"$f":"IF(K17=0,\"\",SUM(L14:L16))","v":17995},{"$f":"SUM(M14:M16)","v":13288},{"$f":"IF(M17=0,\"\",SUM(N14:N16))","v":21380},23046,{"$f":"IF(O17=\"\",\"\",SUM(P14:P16))","v":39375},null,{"$f":"SUM(R14:R16)","v":1662},{"$f":"SUM(S14:S16)","v":3792},{"$f":"IF(R17=0,\"\",R17+S17)","v":5454},{"$f":"IF(T17=\"\",\"\",SUM(U14:U16))","v":8870},null,{"$f":"SUM(W14:W16)","v":554518},-7.1482632516644107E-2,{"$f":"SUM(Y14:Y16)","v":205001},0.23138515136953397,{"$f":"IF(W17=0,\"\",W17+Y17)","v":759519},-5.4590356271146945E-3]
[null,"Março","Varas",{"$f":"IF(TA!$C$17=3,SUMIF(Dados!$B$2:$L$217,TA!$A$40&PaMAe!$C18&PaMAe!$B$18,Dados!$I$2:$I$217),VLOOKUP(TA!$D$40&$C18&$B$18,Dados!$A$2:$L$217,9,0))","v":616},{"$f":"IF(D18=0,\"\",E14+D18)","v":2259},{"$f":"IF(TA!$C$17=3,SUMIF(Dados!$B$2:$P$217,TA!$A$40&PaMAe!$C18&PaMAe!$B$18,Dados!$M$2:$M$217),VLOOKUP(TA!$D$40&$C18&$B$18,Dados!$A$2:$P$217,13,0))","v":11446},{"$f":"IF(F18=0,\"\",IF(G14=\"\",F18,G14+F18))","v":22641},12062,{"$f":"IF(H18=\"\",\"\",I14+H18)","v":24900},null,{"$f":"IF(TA!$C$17=3,SUMIF(Dados!$B$2:$L$217,TA!$A$40&PaMAe!$C18&PaMAe!$B$18,Dados!$J$2:$J$217),VLOOKUP(TA!$D$40&$C18&$B$18,Dados!$A$2:$L$217,10,0))","v":4023},{"$f":"IF(K18=0,\"\",L14+K18)","v":14746},{"$f":"IF(TA!$C$17=3,SUMIF(Dados!$B$2:$P$217, TA!$A$40&PaMAe!$C18&PaMAe!$B$18,Dados!$N$2:$N$217), VLOOKUP(TA!$D$40&$C18&$B$18,Dados!$A$2:$P$217,14,0))","v":2814},{"$f":"IF(M18=0,\"\",IF(N14=\"\",M18,N14+M18))","v":6776},6837,{"$f":"IF(O18=\"\",\"\",P14+O18)","v":21522},null,{"$f":"IF(TA!$C$17=3,SUMIF(Dados!$B$2:$L$217,TA!$A$40&PaMAe!$C18&PaMAe!$B$18,Dados!$K$2:$K$217),VLOOKUP(TA!$D$40&$C18&$B$18,Dados!$A$2:$L$217,11,0))","v":797},{"$f":"IF(TA!$C$17=3,SUMIF(Dados!$B$2:$P$217, TA!$A$40&PaMAe!$C18&PaMAe!$B$18,Dados!$O$2:$O$217), VLOOKUP(TA!$D$40&$C18&$B$18,Dados!$A$2:$P$217,15,0))","v":2545},{"$f":"IF(AND(R18=0,S18=0),\"\",R18+S18)","v":3342},{"$f":"IF(T18=\"\",\"\",U14+T18)","v":9854},null,{"$f":"IF(TA!$C$17=3,SUMIF(Dados!$B$2:$L$217,TA!$A$40&PaMAe!$C18&PaMAe!$B$18,Dados!$L$2:$L$217),VLOOKUP(TA!$D$40&$C18&$B$18,Dados!$A$2:$L$217,12,0))","v":460944},-4.209277242887044E-2,{"$f":"IF(TA!$C$17=3,SUMIF(Dados!$B$2:$P$217, TA!$A$40&PaMAe!$C18&PaMAe!$B$18,Dados!$P$2:$P$217), VLOOKUP(TA!$D$40&$C18&$B$18,Dados!$A$2:$P$217,16,0))","v":132396},0.24363369935843848,{"$f":"IF(AND(W18=0,Y18=0),\"\",W18+Y18)","v":593340},9.6688890477114597E-3]
[null,null,"Juizados",{"$f":"IF(TA!$C$17=3,SUMIF(Dados!$B$2:$L$217,TA!$A$40&PaMAe!$C19&PaMAe!$B$18,Dados!$I$2:$I$217),VLOOKUP(TA!$D$40&$C19&$B$18,Dados!$A$2:$L$217,9,0))","v":1},{"$f":"IF(D19=0,\"\",E15+D19)","v":10},{"$f":"IF(TA!$C$17=3,SUMIF(Dados!$B$2:$P$217,TA!$A$40&PaMAe!$C19&PaMAe!$B$18,Dados!$M$2:$M$217),VLOOKUP(TA!$D$40&$C19&$B$18,Dados!$A$2:$P$217,13,0))","v":8355},{"$f":"IF(F19=0,\"\",IF(G15=\"\",F19,G15+F19))","v":25022},8356,{"$f":"IF(H19=\"\",\"\",I15+H19)","v":25032},null,{"$f":"IF(TA!$C$17=3,SUMIF(Dados!$B$2:$L$217,TA!$A$40&PaMAe!$C19&PaMAe!$B$18,Dados!$J$2:$J$217),VLOOKUP(TA!$D$40&$C19&$B$18,Dados!$A$2:$L$217,10,0))","v":867},{"$f":"IF(K19=0,\"\",L15+K19)","v":4468},{"$f":"IF(TA!$C$17=3,SUMIF(Dados!$B$2:$P$217, TA!$A$40&PaMAe!$C19&PaMAe!$B$18,Dados!$N$2:$N$217), VLOOKUP(TA!$D$40&$C19&$B$18,Dados!$A$2:$P$217,14,0))","v":8220},{"$f":"IF(M19=0,\"\",IF(N15=\"\",M19,N15+M19))","v":24114},9087,{"$f":"IF(O19=\"\",\"\",P15+O19)","v":28582},null,{"$f":"IF(TA!$C$17=3,SUMIF(Dados!$B$2:$L$217,TA!$A$40&PaMAe!$C19&PaMAe!$B$18,Dados!$K$2:$K$217),VLOOKUP(TA!$D$40&$C19&$B$18,Dados!$A$2:$L$217,11,0))","v":331},{"$f":"IF(TA!$C$17=3,SUMIF(Dados!$B$2:$P$217, TA!$A$40&PaMAe!$C19&PaMAe!$B$18,Dados!$O$2:$O$217), VLOOKUP(TA!$D$40&$C19&$B$18,Dados!$A$2:$P$217,15,0))","v":568},{"$f":"IF(AND(R19=0,S19=0),\"\",R19+S19)","v":899},{"$f":"IF(T19=\"\",\"\",U15+T19)","v":3257},null,{"$f":"IF(TA!$C$17=3,SUMIF(Dados!$B$2:$L$217,TA!$A$40&PaMAe!$C19&PaMAe!$B$18,Dados!$L$2:$L$217),VLOOKUP(TA!$D$40&$C19&$B$18,Dados!$A$2:$L$217,12,0))","v":21189},-0.13584828711256114,{"$f":"IF(TA!$C$17=3,SUMIF(Dados!$B$2:$P$217, TA!$A$40&PaMAe!$C19&PaMAe!$B$18,Dados!$P$2:$P$217), VLOOKUP(TA!$D$40&$C19&$B$18,Dados!$A$2:$P$217,16,0))","v":91926},3.0029357058019457E-2,{"$f":"IF(AND(W19=0,Y19=0),\"\",W19+Y19)","v":113115},-5.7222720320657672E-3]
[null,null,"Turmas Recursais",{"$f":"IF(TA!$C$17=3,SUMIF(Dados!$B$2:$L$217,TA!$A$40&PaMAe!$C20&PaMAe!$B$18,Dados!$I$2:$I$217),VLOOKUP(TA!$D$40&$C20&$B$18,Dados!$A$2:$L$217,9,0))","v":492},{"$f":"IF(D20=0,\"\",E16+D20)","v":1791},{"$f":"IF(TA!$C$17=3,SUMIF(Dados!$B$2:$P$217,TA!$A$40&PaMAe!$C20&PaMAe!$B$18,Dados!$M$2:$M$217),VLOOKUP(TA!$D$40&$C20&$B$18,Dados!$A$2:$P$217,13,0))","v":2419},{"$f":"IF(F20=0,\"\",IF(G16=\"\",F20,G16+F20))","v":7073},2911,{"$f":"IF(H20=\"\",\"\",I16+H20)","v":8864},null,{"$f":"IF(TA!$C$17=3,SUMIF(Dados!$B$2:$L$217,TA!$A$40&PaMAe!$C20&PaMAe!$B$18,Dados!$J$2:$J$217),VLOOKUP(TA!$D$40&$C20&$B$18,Dados!$A$2:$L$217,10,0))","v":2338},{"$f":"IF(K20=0,\"\",L16+K20)","v":6009},{"$f":"IF(TA!$C$17=3,SUMIF(Dados!$B$2:$P$217, TA!$A$40&PaMAe!$C20&PaMAe!$B$18,Dados!$N$2:$N$217), VLOOKUP(TA!$D$40&$C20&$B$18,Dados!$A$2:$P$217,14,0))","v":1860},{"$f":"IF(M20=0,\"\",IF(N16=\"\",M20,N16+M20))","v":3384},4198,{"$f":"IF(O20=\"\",\"\",P16+O20)","v":9393},null,{"$f":"IF(TA!$C$17=3,SUMIF(Dados!$B$2:$L$217,TA!$A$40&PaMAe!$C20&PaMAe!$B$18,Dados!$K$2:$K$217),VLOOKUP(TA!$D$40&$C20&$B$18,Dados!$A$2:$L$217,11,0))","v":0},{"$f":"IF(TA!$C$17=3,SUMIF(Dados!$B$2:$P$217, TA!$A$40&PaMAe!$C20&PaMAe!$B$18,Dados!$O$2:$O$217), VLOOKUP(TA!$D$40&$C20&$B$18,Dados!$A$2:$P$217,15,0))","v":0},{"$f":"IF(AND(R20=0,S20=0),\"\",R20+S20)","v":""},{"$f":"IF(T20=\"\",\"\",U16+T20)","v":""},null,{"$f":"IF(TA!$C$17=3,SUMIF(Dados!$B$2:$L$217,TA!$A$40&PaMAe!$C20&PaMAe!$B$18,Dados!$L$2:$L$217),VLOOKUP(TA!$D$40&$C20&$B$18,Dados!$A$2:$L$217,12,0))","v":47420},-2.8258775794585911E-2,{"$f":"IF(TA!$C$17=3,SUMIF(Dados!$B$2:$P$217, TA!$A$40&PaMAe!$C20&PaMAe!$B$18,Dados!$P$2:$P$217), VLOOKUP(TA!$D$40&$C20&$B$18,Dados!$A$2:$P$217,16,0))","v":10848},0.16695352839931155,{"$f":"IF(AND(W20=0,Y20=0),\"\",W20+Y20)","v":58268},2.9778810568896752E-3]
[null,"Total",null,{"$f":"SUM(D18:D20)","v":1109},{"$f":"IF(D21=0,\"\",SUM(E18:E20))","v":4060},{"$f":"SUM(F18:F20)","v":22220},{"$f":"IF(F21=0,\"\",SUM(G18:G20))","v":54736},23329,{"$f":"IF(H21=\"\",\"\",SUM(I18:I20))","v":58796},null,{"$f":"SUM(K18:K20)","v":7228},{"$f":"IF(K21=0,\"\",SUM(L18:L20))","v":25223},{"$f":"SUM(M18:M20)","v":12894},{"$f":"IF(M21=0,\"\",SUM(N18:N20))","v":34274},20122,{"$f":"IF(O21=\"\",\"\",SUM(P18:P20))","v":59497},null,{"$f":"SUM(R18:R20)","v":1128},{"$f":"SUM(S18:S20)","v":3113},{"$f":"IF(R21=0,\"\",R21+S21)","v":4241},{"$f":"IF(T21=\"\",\"\",SUM(U18:U20))","v":13111},null,{"$f":"SUM(W18:W20)","v":529553},-4.5021081371569571E-2,{"$f":"SUM(Y18:Y20)","v":235170},0.14716513577982537,{"$f":"IF(W21=0,\"\",W21+Y21)","v":764723},6.8517048289773452E-3]
[null,"Abril","Varas",{"$f":"IF(TA!$C$17=3,SUMIF(Dados!$B$2:$L$217,TA!$A$40&PaMAe!$C22&PaMAe!$B$22,Dados!$I$2:$I$217),VLOOKUP(TA!$D$40&$C22&$B$22,Dados!$A$2:$L$217,9,0))","v":641},{"$f":"IF(D22=0,\"\",E18+D22)","v":2900},{"$f":"IF(TA!$C$17=3,SUMIF(Dados!$B$2:$P$217,TA!$A$40&PaMAe!$C22&PaMAe!$B$22,Dados!$M$2:$M$217),VLOOKUP(TA!$D$40&$C22&$B$22,Dados!$A$2:$P$217,13,0))","v":6743},{"$f":"IF(F22=0,\"\",IF(G18=\"\",F22,G18+F22))","v":29384},7384,{"$f":"IF(H22=\"\",\"\",I18+H22)","v":32284},null,{"$f":"IF(TA!$C$17=3,SUMIF(Dados!$B$2:$L$217,TA!$A$40&PaMAe!$C22&PaMAe!$B$22,Dados!$J$2:$J$217),VLOOKUP(TA!$D$40&$C22&$B$22,Dados!$A$2:$L$217,10,0))","v":4226},{"$f":"IF(K22=0,\"\",L18+K22)","v":18972},{"$f":"IF(TA!$C$17=3,SUMIF(Dados!$B$2:$P$217, TA!$A$40&PaMAe!$C22&PaMAe!$B$22,Dados!$N$2:$N$217), VLOOKUP(TA!$D$40&$C22&$B$22,Dados!$A$2:$P$217,14,0))","v":3283},{"$f":"IF(M22=0,\"\",IF(N18=\"\",M22,N18+M22))","v":10059},7509,{"$f":"IF(O22=\"\",\"\",P18+O22)","v":29031},null,{"$f":"IF(TA!$C$17=3,SUMIF(Dados!$B$2:$L$217,TA!$A$40&PaMAe!$C22&PaMAe!$B$22,Dados!$K$2:$K$217),VLOOKUP(TA!$D$40&$C22&$B$22,Dados!$A$2:$L$217,11,0))","v":771},{"$f":"IF(TA!$C$17=3,SUMIF(Dados!$B$2:$P$217, TA!$A$40&PaMAe!$C22&PaMAe!$B$22,Dados!$O$2:$O$217), VLOOKUP(TA!$D$40&$C22&$B$22,Dados!$A$2:$P$217,15,0))","v":2746},{"$f":"IF(AND(R22=0,S22=0),\"\",R22+S22)","v":3517},{"$f":"IF(T22=\"\",\"\",U18+T22)","v":13371},null,{"$f":"IF(TA!$C$17=3,SUMIF(Dados!$B$2:$L$217,TA!$A$40&PaMAe!$C22&PaMAe!$B$22,Dados!$L$2:$L$217),VLOOKUP(TA!$D$40&$C22&$B$22,Dados!$A$2:$L$217,12,0))","v":436204},-5.3672463466277853E-2,{"$f":"IF(TA!$C$17=3,SUMIF(Dados!$B$2:$P$217, TA!$A$40&PaMAe!$C22&PaMAe!$B$22,Dados!$P$2:$P$217), VLOOKUP(TA!$D$40&$C22&$B$22,Dados!$A$2:$P$217,16,0))","v":156924},{"$f":"IF(Y22=0,\"\",IF(Y18=0,\"100,00%\",(Y22/Y18)-1))","v":0.18526239463427907},{"$f":"IF(AND(W22=0,Y22=0),\"\",W22+Y22)","v":593128},-3.5729935618700193E-4]
[null,null,"Juizados",{"$f":"IF(TA!$C$17=3,SUMIF(Dados!$B$2:$L$217,TA!$A$40&PaMAe!$C23&PaMAe!$B$22,Dados!$I$2:$I$217),VLOOKUP(TA!$D$40&$C23&$B$22,Dados!$A$2:$L$217,9,0))","v":2},{"$f":"IF(D23=0,\"\",E19+D23)","v":12},{"$f":"IF(TA!$C$17=3,SUMIF(Dados!$B$2:$P$217,TA!$A$40&PaMAe!$C23&PaMAe!$B$22,Dados!$M$2:$M$217),VLOOKUP(TA!$D$40&$C23&$B$22,Dados!$A$2:$P$217,13,0))","v":9609},{"$f":"IF(F23=0,\"\",IF(G19=\"\",F23,G19+F23))","v":34631},9611,{"$f":"IF(H23=\"\",\"\",I19+H23)","v":34643},null,{"$f":"IF(TA!$C$17=3,SUMIF(Dados!$B$2:$L$217,TA!$A$40&PaMAe!$C23&PaMAe!$B$22,Dados!$J$2:$J$217),VLOOKUP(TA!$D$40&$C23&$B$22,Dados!$A$2:$L$217,10,0))","v":597},{"$f":"IF(K23=0,\"\",L19+K23)","v":5065},{"$f":"IF(TA!$C$17=3,SUMIF(Dados!$B$2:$P$217, TA!$A$40&PaMAe!$C23&PaMAe!$B$22,Dados!$N$2:$N$217), VLOOKUP(TA!$D$40&$C23&$B$22,Dados!$A$2:$P$217,14,0))","v":8286},{"$f":"IF(M23=0,\"\",IF(N19=\"\",M23,N19+M23))","v":32400},8883,{"$f":"IF(O23=\"\",\"\",P19+O23)","v":37465},null,{"$f":"IF(TA!$C$17=3,SUMIF(Dados!$B$2:$L$217,TA!$A$40&PaMAe!$C23&PaMAe!$B$22,Dados!$K$2:$K$217),VLOOKUP(TA!$D$40&$C23&$B$22,Dados!$A$2:$L$217,11,0))","v":267},{"$f":"IF(TA!$C$17=3,SUMIF(Dados!$B$2:$P$217, TA!$A$40&PaMAe!$C23&PaMAe!$B$22,Dados!$O$2:$O$217), VLOOKUP(TA!$D$40&$C23&$B$22,Dados!$A$2:$P$217,15,0))","v":573},{"$f":"IF(AND(R23=0,S23=0),\"\",R23+S23)","v":840},{"$f":"IF(T23=\"\",\"\",U19+T23)","v":4097},null,{"$f":"IF(TA!$C$17=3,SUMIF(Dados!$B$2:$L$217,TA!$A$40&PaMAe!$C23&PaMAe!$B$22,Dados!$L$2:$L$217),VLOOKUP(TA!$D$40&$C23&$B$22,Dados!$A$2:$L$217,12,0))","v":18944},-0.10595120109490774,{"$f":"IF(TA!$C$17=3,SUMIF(Dados!$B$2:$P$217, TA!$A$40&PaMAe!$C23&PaMAe!$B$22,Dados!$P$2:$P$217), VLOOKUP(TA!$D$40&$C23&$B$22,Dados!$A$2:$P$217,16,0))","v":94920},{"$f":"IF(Y23=0,\"\",IF(Y19=0,\"100,00%\",(Y23/Y19)-1))","v":3.2569675608641768E-2},{"$f":"IF(AND(W23=0,Y23=0),\"\",W23+Y23)","v":113864},6.6215798081599164E-3]
[null,null,"Turmas Recursais",{"$f":"IF(TA!$C$17=3,SUMIF(Dados!$B$2:$L$217,TA!$A$40&PaMAe!$C24&PaMAe!$B$22,Dados!$I$2:$I$217),VLOOKUP(TA!$D$40&$C24&$B$22,Dados!$A$2:$L$217,9,0))","v":473},{"$f":"IF(D24=0,\"\",E20+D24)","v":2264},{"$f":"IF(TA!$C$17=3,SUMIF(Dados!$B$2:$P$217,TA!$A$40&PaMAe!$C24&PaMAe!$B$22,Dados!$M$2:$M$217),VLOOKUP(TA!$D$40&$C24&$B$22,Dados!$A$2:$P$217,13,0))","v":2404},{"$f":"IF(F24=0,\"\",IF(G20=\"\",F24,G20+F24))","v":9477},{"$f":"IF(D24=0,\"\",D24+F24)","v":2877},{"$f":"IF(H24=\"\",\"\",I20+H24)","v":11741},null,{"$f":"IF(TA!$C$17=3,SUMIF(Dados!$B$2:$L$217,TA!$A$40&PaMAe!$C24&PaMAe!$B$22,Dados!$J$2:$J$217),VLOOKUP(TA!$D$40&$C24&$B$22,Dados!$A$2:$L$217,10,0))","v":2011},{"$f":"IF(K24=0,\"\",L20+K24)","v":8020},{"$f":"IF(TA!$C$17=3,SUMIF(Dados!$B$2:$P$217, TA!$A$40&PaMAe!$C24&PaMAe!$B$22,Dados!$N$2:$N$217), VLOOKUP(TA!$D$40&$C24&$B$22,Dados!$A$2:$P$217,14,0))","v":1308},{"$f":"IF(M24=0,\"\",IF(N20=\"\",M24,N20+M24))","v":4692},3319,{"$f":"IF(O24=\"\",\"\",P20+O24)","v":12712},null,{"$f":"IF(TA!$C$17=3,SUMIF(Dados!$B$2:$L$217,TA!$A$40&PaMAe!$C24&PaMAe!$B$22,Dados!$K$2:$K$217),VLOOKUP(TA!$D$40&$C24&$B$22,Dados!$A$2:$L$217,11,0))","v":0},{"$f":"IF(TA!$C$17=3,SUMIF(Dados!$B$2:$P$217, TA!$A$40&PaMAe!$C24&PaMAe!$B$22,Dados!$O$2:$O$217), VLOOKUP(TA!$D$40&$C24&$B$22,Dados!$A$2:$P$217,15,0))","v":0},{"$f":"IF(AND(R24=0,S24=0),\"\",R24+S24)","v":""},{"$f":"IF(T24=\"\",\"\",U20+T24)","v":""},null,{"$f":"IF(TA!$C$17=3,SUMIF(Dados!$B$2:$L$217,TA!$A$40&PaMAe!$C24&PaMAe!$B$22,Dados!$L$2:$L$217),VLOOKUP(TA!$D$40&$C24&$B$22,Dados!$A$2:$L$217,12,0))","v":46210},-2.5516659637283889E-2,{"$f":"IF(TA!$C$17=3,SUMIF(Dados!$B$2:$P$217, TA!$A$40&PaMAe!$C24&PaMAe!$B$22,Dados!$P$2:$P$217), VLOOKUP(TA!$D$40&$C24&$B$22,Dados!$A$2:$P$217,16,0))","v":12228},{"$f":"IF(Y24=0,\"\",IF(Y20=0,\"100,00%\",(Y24/Y20)-1))","v":0.12721238938053103},{"$f":"IF(AND(W24=0,Y24=0),\"\",W24+Y24)","v":58438},2.9175533740646298E-3]
[null,"Total",null,{"$f":"SUM(D22:D24)","v":1116},{"$f":"IF(D25=0,\"\",SUM(E22:E24))","v":5176},{"$f":"SUM(F22:F24)","v":18756},{"$f":"IF(F25=0,\"\",SUM(G22:G24))","v":73492},19872,{"$f":"IF(H25=\"\",\"\",SUM(I22:I24))","v":78668},null,{"$f":"SUM(K22:K24)","v":6834},{"$f":"IF(K25=0,\"\",SUM(L22:L24))","v":32057},{"$f":"SUM(M22:M24)","v":12877},{"$f":"IF(M25=0,\"\",SUM(N22:N24))","v":47151},19711,{"$f":"IF(O25=\"\",\"\",SUM(P22:P24))","v":79208},null,{"$f":"SUM(R22:R24)","v":1038},{"$f":"SUM(S22:S24)","v":3319},{"$f":"IF(R25=0,\"\",R25+S25)","v":4357},{"$f":"IF(T25=\"\",\"\",SUM(U22:U24))","v":17468},null,{"$f":"SUM(W22:W24)","v":501358},-5.3243018168153133E-2,{"$f":"SUM(Y22:Y24)","v":264072},{"$f":"IF(Y25=0,\"\",IF(Y21=0,\"100,00%\",(Y25/Y21)-1))","v":0.12289832886847818},{"$f":"IF(W25=0,\"\",W25+Y25)","v":765430},9.2451776656377049E-4]
[null,"Maio","Varas",{"$f":"IF(TA!$C$17=3,SUMIF(Dados!$B$2:$L$217,TA!$A$40&PaMAe!$C26&PaMAe!$B$26,Dados!$I$2:$I$217),VLOOKUP(TA!$D$40&$C26&$B$26,Dados!$A$2:$L$217,9,0))","v":821},{"$f":"IF(D26=0,\"\",E22+D26)","v":3721},{"$f":"IF(TA!$C$17=3,SUMIF(Dados!$B$2:$P$217,TA!$A$40&PaMAe!$C26&PaMAe!$B$26,Dados!$M$2:$M$217),VLOOKUP(TA!$D$40&$C26&$B$26,Dados!$A$2:$P$217,13,0))","v":7485},{"$f":"IF(F26=0,\"\",IF(G22=\"\",F26,G22+F26))","v":36869},{"$f":"IF(D26=0,\"\",D26+F26)","v":8306},{"$f":"IF(H26=\"\",\"\",I22+H26)","v":40590},null,{"$f":"IF(TA!$C$17=3,SUMIF(Dados!$B$2:$L$217,TA!$A$40&PaMAe!$C26&PaMAe!$B$26,Dados!$J$2:$J$217),VLOOKUP(TA!$D$40&$C26&$B$26,Dados!$A$2:$L$217,10,0))","v":5621},{"$f":"IF(K26=0,\"\",L22+K26)","v":24593},{"$f":"IF(TA!$C$17=3,SUMIF(Dados!$B$2:$P$217, TA!$A$40&PaMAe!$C26&PaMAe!$B$26,Dados!$N$2:$N$217), VLOOKUP(TA!$D$40&$C26&$B$26,Dados!$A$2:$P$217,14,0))","v":4718},{"$f":"IF(M26=0,\"\",IF(N22=\"\",M26,N22+M26))","v":14777},10339,{"$f":"IF(O26=\"\",\"\",P22+O26)","v":39370},null,{"$f":"IF(TA!$C$17=3,SUMIF(Dados!$B$2:$L$217,TA!$A$40&PaMAe!$C26&PaMAe!$B$26,Dados!$K$2:$K$217),VLOOKUP(TA!$D$40&$C26&$B$26,Dados!$A$2:$L$217,11,0))","v":1045},{"$f":"IF(TA!$C$17=3,SUMIF(Dados!$B$2:$P$217, TA!$A$40&PaMAe!$C26&PaMAe!$B$26,Dados!$O$2:$O$217), VLOOKUP(TA!$D$40&$C26&$B$26,Dados!$A$2:$P$217,15,0))","v":3540},{"$f":"IF(AND(R26=0,S26=0),\"\",R26+S26)","v":4585},{"$f":"IF(T26=\"\",\"\",U22+T26)","v":17956},null,{"$f":"IF(TA!$C$17=3,SUMIF(Dados!$B$2:$L$217,TA!$A$40&PaMAe!$C26&PaMAe!$B$26,Dados!$L$2:$L$217),VLOOKUP(TA!$D$40&$C26&$B$26,Dados!$A$2:$L$217,12,0))","v":401153},-8.0354604726229018E-2,{"$f":"IF(TA!$C$17=3,SUMIF(Dados!$B$2:$P$217, TA!$A$40&PaMAe!$C26&PaMAe!$B$26,Dados!$P$2:$P$217), VLOOKUP(TA!$D$40&$C26&$B$26,Dados!$A$2:$P$217,16,0))","v":240346},{"$f":"IF(Y26=0,\"\",IF(Y22=0,\"100,00%\",(Y26/Y22)-1))","v":0.53160765720985959},{"$f":"IF(AND(W26=0,Y26=0),\"\",W26+Y26)","v":641499},8.1552379924737961E-2]
[null,null,"Juizados",{"$f":"IF(TA!$C$17=3,SUMIF(Dados!$B$2:$L$217,TA!$A$40&PaMAe!$C27&PaMAe!$B$26,Dados!$I$2:$I$217),VLOOKUP(TA!$D$40&$C27&$B$26,Dados!$A$2:$L$217,9,0))","v":3},{"$f":"IF(D27=0,\"\",E23+D27)","v":15},{"$f":"IF(TA!$C$17=3,SUMIF(Dados!$B$2:$P$217,TA!$A$40&PaMAe!$C27&PaMAe!$B$26,Dados!$M$2:$M$217),VLOOKUP(TA!$D$40&$C27&$B$26,Dados!$A$2:$P$217,13,0))","v":11209},{"$f":"IF(F27=0,\"\",IF(G23=\"\",F27,G23+F27))","v":45840},11212,{"$f":"IF(H27=\"\",\"\",I23+H27)","v":45855},null,{"$f":"IF(TA!$C$17=3,SUMIF(Dados!$B$2:$L$217,TA!$A$40&PaMAe!$C27&PaMAe!$B$26,Dados!$J$2:$J$217),VLOOKUP(TA!$D$40&$C27&$B$26,Dados!$A$2:$L$217,10,0))","v":776},{"$f":"IF(K27=0,\"\",L23+K27)","v":5841},{"$f":"IF(TA!$C$17=3,SUMIF(Dados!$B$2:$P$217, TA!$A$40&PaMAe!$C27&PaMAe!$B$26,Dados!$N$2:$N$217), VLOOKUP(TA!$D$40&$C27&$B$26,Dados!$A$2:$P$217,14,0))","v":11093},{"$f":"IF(M27=0,\"\",IF(N23=\"\",M27,N23+M27))","v":43493},11869,{"$f":"IF(O27=\"\",\"\",P23+O27)","v":49334},null,{"$f":"IF(TA!$C$17=3,SUMIF(Dados!$B$2:$L$217,TA!$A$40&PaMAe!$C27&PaMAe!$B$26,Dados!$K$2:$K$217),VLOOKUP(TA!$D$40&$C27&$B$26,Dados!$A$2:$L$217,11,0))","v":273},{"$f":"IF(TA!$C$17=3,SUMIF(Dados!$B$2:$P$217, TA!$A$40&PaMAe!$C27&PaMAe!$B$26,Dados!$O$2:$O$217), VLOOKUP(TA!$D$40&$C27&$B$26,Dados!$A$2:$P$217,15,0))","v":734},{"$f":"IF(AND(R27=0,S27=0),\"\",R27+S27)","v":1007},{"$f":"IF(T27=\"\",\"\",U23+T27)","v":5104},null,{"$f":"IF(TA!$C$17=3,SUMIF(Dados!$B$2:$L$217,TA!$A$40&PaMAe!$C27&PaMAe!$B$26,Dados!$L$2:$L$217),VLOOKUP(TA!$D$40&$C27&$B$26,Dados!$A$2:$L$217,12,0))","v":16638},-0.12172719594594594,{"$f":"IF(TA!$C$17=3,SUMIF(Dados!$B$2:$P$217, TA!$A$40&PaMAe!$C27&PaMAe!$B$26,Dados!$P$2:$P$217), VLOOKUP(TA!$D$40&$C27&$B$26,Dados!$A$2:$P$217,16,0))","v":98227},{"$f":"IF(Y27=0,\"\",(Y27/Y23)-1)","v":3.483986514959958E-2},{"$f":"IF(AND(W27=0,Y27=0),\"\",W27+Y27)","v":114865},8.7911894892152009E-3]
[null,null,"Turmas Recursais",{"$f":"IF(TA!$C$17=3,SUMIF(Dados!$B$2:$L$217,TA!$A$40&PaMAe!$C28&PaMAe!$B$26,Dados!$I$2:$I$217),VLOOKUP(TA!$D$40&$C28&$B$26,Dados!$A$2:$L$217,9,0))","v":277},{"$f":"IF(D28=0,\"\",E24+D28)","v":2541},{"$f":"IF(TA!$C$17=3,SUMIF(Dados!$B$2:$P$217,TA!$A$40&PaMAe!$C28&PaMAe!$B$26,Dados!$M$2:$M$217),VLOOKUP(TA!$D$40&$C28&$B$26,Dados!$A$2:$P$217,13,0))","v":2815},{"$f":"IF(F28=0,\"\",IF(G24=\"\",F28,G24+F28))","v":12292},3092,{"$f":"IF(H28=\"\",\"\",I24+H28)","v":14833},null,{"$f":"IF(TA!$C$17=3,SUMIF(Dados!$B$2:$L$217,TA!$A$40&PaMAe!$C28&PaMAe!$B$26,Dados!$J$2:$J$217),VLOOKUP(TA!$D$40&$C28&$B$26,Dados!$A$2:$L$217,10,0))","v":13070},{"$f":"IF(K28=0,\"\",L24+K28)","v":21090},{"$f":"IF(TA!$C$17=3,SUMIF(Dados!$B$2:$P$217, TA!$A$40&PaMAe!$C28&PaMAe!$B$26,Dados!$N$2:$N$217), VLOOKUP(TA!$D$40&$C28&$B$26,Dados!$A$2:$P$217,14,0))","v":2246},{"$f":"IF(M28=0,\"\",IF(N24=\"\",M28,N24+M28))","v":6938},15316,{"$f":"IF(O28=\"\",\"\",P24+O28)","v":28028},null,{"$f":"IF(TA!$C$17=3,SUMIF(Dados!$B$2:$L$217,TA!$A$40&PaMAe!$C28&PaMAe!$B$26,Dados!$K$2:$K$217),VLOOKUP(TA!$D$40&$C28&$B$26,Dados!$A$2:$L$217,11,0))","v":0},{"$f":"IF(TA!$C$17=3,SUMIF(Dados!$B$2:$P$217, TA!$A$40&PaMAe!$C28&PaMAe!$B$26,Dados!$O$2:$O$217), VLOOKUP(TA!$D$40&$C28&$B$26,Dados!$A$2:$P$217,15,0))","v":0},{"$f":"IF(AND(R28=0,S28=0),\"\",R28+S28)","v":""},{"$f":"IF(T28=\"\",\"\",U24+T28)","v":""},null,{"$f":"IF(TA!$C$17=3,SUMIF(Dados!$B$2:$L$217,TA!$A$40&PaMAe!$C28&PaMAe!$B$26,Dados!$L$2:$L$217),VLOOKUP(TA!$D$40&$C28&$B$26,Dados!$A$2:$L$217,12,0))","v":45393},-1.7680155810430698E-2,{"$f":"IF(TA!$C$17=3,SUMIF(Dados!$B$2:$P$217, TA!$A$40&PaMAe!$C28&PaMAe!$B$26,Dados!$P$2:$P$217), VLOOKUP(TA!$D$40&$C28&$B$26,Dados!$A$2:$P$217,16,0))","v":14078},{"$f":"IF(Y28=0,\"\",IF(Y24=0,\"100,00%\",(Y28/Y24)-1))","v":0.15129211645403995},{"$f":"IF(AND(W28=0,Y28=0),\"\",W28+Y28)","v":59471},1.7676854101783102E-2]
[null,"Total",null,{"$f":"SUM(D26:D28)","v":1101},{"$f":"IF(D29=0,\"\",SUM(E26:E28))","v":6277},{"$f":"SUM(F26:F28)","v":21509},{"$f":"IF(F29=0,\"\",SUM(G26:G28))","v":95001},22610,{"$f":"IF(H29=\"\",\"\",SUM(I26:I28))","v":101278},null,{"$f":"SUM(K26:K28)","v":19467},{"$f":"IF(K29=0,\"\",SUM(L26:L28))","v":51524},{"$f":"SUM(M26:M28)","v":18057},{"$f":"IF(M29=0,\"\",SUM(N26:N28))","v":65208},37524,{"$f":"IF(O29=\"\",\"\",SUM(P26:P28))","v":116732},null,{"$f":"SUM(R26:R28)","v":1318},{"$f":"SUM(S26:S28)","v":4274},{"$f":"IF(R29=0,\"\",R29+S29)","v":5592},{"$f":"IF(T29=\"\",\"\",SUM(U26:U28))","v":23060},null,{"$f":"SUM(W26:W28)","v":463184},-7.6141200499443507E-2,{"$f":"SUM(Y26:Y28)","v":352651},0.33543503286982346,{"$f":"IF(W29=0,\"\",W29+Y29)","v":815835},6.5851874109977393E-2]
[null,"Junho","Varas",{"$f":"IF(TA!$C$17=3,SUMIF(Dados!$B$2:$L$217,TA!$A$40&PaMAe!$C30&PaMAe!$B$30,Dados!$I$2:$I$217),VLOOKUP(TA!$D$40&$C30&$B$30,Dados!$A$2:$L$217,9,0))","v":551},{"$f":"IF(D30=0,\"\",E26+D30)","v":4272},{"$f":"IF(TA!$C$17=3,SUMIF(Dados!$B$2:$P$217,TA!$A$40&PaMAe!$C30&PaMAe!$B$30,Dados!$M$2:$M$217),VLOOKUP(TA!$D$40&$C30&$B$30,Dados!$A$2:$P$217,13,0))","v":5970},{"$f":"IF(F30=0,\"\",IF(G26=\"\",F30,G26+F30))","v":42839},6521,{"$f":"IF(H30=\"\",\"\",I26+H30)","v":47111},null,{"$f":"IF(TA!$C$17=3,SUMIF(Dados!$B$2:$L$217,TA!$A$40&PaMAe!$C30&PaMAe!$B$30,Dados!$J$2:$J$217),VLOOKUP(TA!$D$40&$C30&$B$30,Dados!$A$2:$L$217,10,0))","v":3266},{"$f":"IF(K30=0,\"\",L26+K30)","v":27859},{"$f":"IF(TA!$C$17=3,SUMIF(Dados!$B$2:$P$217, TA!$A$40&PaMAe!$C30&PaMAe!$B$30,Dados!$N$2:$N$217), VLOOKUP(TA!$D$40&$C30&$B$30,Dados!$A$2:$P$217,14,0))","v":4656},{"$f":"IF(M30=0,\"\",IF(N26=\"\",M30,N26+M30))","v":19433},7922,{"$f":"IF(O30=\"\",\"\",P26+O30)","v":47292},null,{"$f":"IF(TA!$C$17=3,SUMIF(Dados!$B$2:$L$217,TA!$A$40&PaMAe!$C30&PaMAe!$B$30,Dados!$K$2:$K$217),VLOOKUP(TA!$D$40&$C30&$B$30,Dados!$A$2:$L$217,11,0))","v":680},{"$f":"IF(TA!$C$17=3,SUMIF(Dados!$B$2:$P$217, TA!$A$40&PaMAe!$C30&PaMAe!$B$30,Dados!$O$2:$O$217), VLOOKUP(TA!$D$40&$C30&$B$30,Dados!$A$2:$P$217,15,0))","v":3278},{"$f":"IF(AND(R30=0,S30=0),\"\",R30+S30)","v":3958},{"$f":"IF(T30=\"\",\"\",U26+T30)","v":21914},null,{"$f":"IF(TA!$C$17=3,SUMIF(Dados!$B$2:$L$217,TA!$A$40&PaMAe!$C30&PaMAe!$B$30,Dados!$L$2:$L$217),VLOOKUP(TA!$D$40&$C30&$B$30,Dados!$A$2:$L$217,12,0))","v":268732},-0.33010098391386833,{"$f":"IF(TA!$C$17=3,SUMIF(Dados!$B$2:$P$217, TA!$A$40&PaMAe!$C30&PaMAe!$B$30,Dados!$P$2:$P$217), VLOOKUP(TA!$D$40&$C30&$B$30,Dados!$A$2:$P$217,16,0))","v":320014},0.33147212768259093,{"$f":"IF(AND(W30=0,Y30=0),\"\",W30+Y30)","v":588746},-8.2233955158153016E-2]
[null,null,"Juizados",{"$f":"IF(TA!$C$17=3,SUMIF(Dados!$B$2:$L$217,TA!$A$40&PaMAe!$C31&PaMAe!$B$30,Dados!$I$2:$I$217),VLOOKUP(TA!$D$40&$C31&$B$30,Dados!$A$2:$L$217,9,0))","v":5},{"$f":"IF(D31=0,\"\",E27+D31)","v":20},{"$f":"IF(TA!$C$17=3,SUMIF(Dados!$B$2:$P$217,TA!$A$40&PaMAe!$C31&PaMAe!$B$30,Dados!$M$2:$M$217),VLOOKUP(TA!$D$40&$C31&$B$30,Dados!$A$2:$P$217,13,0))","v":9276},{"$f":"IF(F31=0,\"\",IF(G27=\"\",F31,G27+F31))","v":55116},9281,{"$f":"IF(H31=\"\",\"\",I27+H31)","v":55136},null,{"$f":"IF(TA!$C$17=3,SUMIF(Dados!$B$2:$L$217,TA!$A$40&PaMAe!$C31&PaMAe!$B$30,Dados!$J$2:$J$217),VLOOKUP(TA!$D$40&$C31&$B$30,Dados!$A$2:$L$217,10,0))","v":538},{"$f":"IF(K31=0,\"\",L27+K31)","v":6379},{"$f":"IF(TA!$C$17=3,SUMIF(Dados!$B$2:$P$217, TA!$A$40&PaMAe!$C31&PaMAe!$B$30,Dados!$N$2:$N$217), VLOOKUP(TA!$D$40&$C31&$B$30,Dados!$A$2:$P$217,14,0))","v":9850},{"$f":"IF(M31=0,\"\",IF(N27=\"\",M31,N27+M31))","v":53343},10388,{"$f":"IF(O31=\"\",\"\",P27+O31)","v":59722},null,{"$f":"IF(TA!$C$17=3,SUMIF(Dados!$B$2:$L$217,TA!$A$40&PaMAe!$C31&PaMAe!$B$30,Dados!$K$2:$K$217),VLOOKUP(TA!$D$40&$C31&$B$30,Dados!$A$2:$L$217,11,0))","v":162},{"$f":"IF(TA!$C$17=3,SUMIF(Dados!$B$2:$P$217, TA!$A$40&PaMAe!$C31&PaMAe!$B$30,Dados!$O$2:$O$217), VLOOKUP(TA!$D$40&$C31&$B$30,Dados!$A$2:$P$217,15,0))","v":754},{"$f":"IF(AND(R31=0,S31=0),\"\",R31+S31)","v":916},{"$f":"IF(T31=\"\",\"\",U27+T31)","v":6020},null,{"$f":"IF(TA!$C$17=3,SUMIF(Dados!$B$2:$L$217,TA!$A$40&PaMAe!$C31&PaMAe!$B$30,Dados!$L$2:$L$217),VLOOKUP(TA!$D$40&$C31&$B$30,Dados!$A$2:$L$217,12,0))","v":18370},0.10409905036663059,{"$f":"IF(TA!$C$17=3,SUMIF(Dados!$B$2:$P$217, TA!$A$40&PaMAe!$C31&PaMAe!$B$30,Dados!$P$2:$P$217), VLOOKUP(TA!$D$40&$C31&$B$30,Dados!$A$2:$P$217,16,0))","v":100045},1.8508149490465975E-2,{"$f":"IF(AND(W31=0,Y31=0),\"\",W31+Y31)","v":118415},3.0905845993122405E-2]
[null,null,"Turmas Recursais",{"$f":"IF(TA!$C$17=3,SUMIF(Dados!$B$2:$L$217,TA!$A$40&PaMAe!$C32&PaMAe!$B$30,Dados!$I$2:$I$217),VLOOKUP(TA!$D$40&$C32&$B$30,Dados!$A$2:$L$217,9,0))","v":164},{"$f":"IF(D32=0,\"\",E28+D32)","v":2705},{"$f":"IF(TA!$C$17=3,SUMIF(Dados!$B$2:$P$217,TA!$A$40&PaMAe!$C32&PaMAe!$B$30,Dados!$M$2:$M$217),VLOOKUP(TA!$D$40&$C32&$B$30,Dados!$A$2:$P$217,13,0))","v":2683},{"$f":"IF(F32=0,\"\",IF(G28=\"\",F32,G28+F32))","v":14975},2847,{"$f":"IF(H32=\"\",\"\",I28+H32)","v":17680},null,{"$f":"IF(TA!$C$17=3,SUMIF(Dados!$B$2:$L$217,TA!$A$40&PaMAe!$C32&PaMAe!$B$30,Dados!$J$2:$J$217),VLOOKUP(TA!$D$40&$C32&$B$30,Dados!$A$2:$L$217,10,0))","v":2398},{"$f":"IF(K32=0,\"\",L28+K32)","v":23488},{"$f":"IF(TA!$C$17=3,SUMIF(Dados!$B$2:$P$217, TA!$A$40&PaMAe!$C32&PaMAe!$B$30,Dados!$N$2:$N$217), VLOOKUP(TA!$D$40&$C32&$B$30,Dados!$A$2:$P$217,14,0))","v":1834},{"$f":"IF(M32=0,\"\",IF(N28=\"\",M32,N28+M32))","v":8772},4232,{"$f":"IF(O32=\"\",\"\",P28+O32)","v":32260},null,{"$f":"IF(TA!$C$17=3,SUMIF(Dados!$B$2:$L$217,TA!$A$40&PaMAe!$C32&PaMAe!$B$30,Dados!$K$2:$K$217),VLOOKUP(TA!$D$40&$C32&$B$30,Dados!$A$2:$L$217,11,0))","v":0},{"$f":"IF(TA!$C$17=3,SUMIF(Dados!$B$2:$P$217, TA!$A$40&PaMAe!$C32&PaMAe!$B$30,Dados!$O$2:$O$217), VLOOKUP(TA!$D$40&$C32&$B$30,Dados!$A$2:$P$217,15,0))","v":0},{"$f":"IF(AND(R32=0,S32=0),\"\",R32+S32)","v":""},{"$f":"IF(T32=\"\",\"\",U28+T32)","v":""},null,{"$f":"IF(TA!$C$17=3,SUMIF(Dados!$B$2:$L$217,TA!$A$40&PaMAe!$C32&PaMAe!$B$30,Dados!$L$2:$L$217),VLOOKUP(TA!$D$40&$C32&$B$30,Dados!$A$2:$L$217,12,0))","v":39786},-0.12352124776947992,{"$f":"IF(TA!$C$17=3,SUMIF(Dados!$B$2:$P$217, TA!$A$40&PaMAe!$C32&PaMAe!$B$30,Dados!$P$2:$P$217), VLOOKUP(TA!$D$40&$C32&$B$30,Dados!$A$2:$P$217,16,0))","v":14875},5.6613155277738247E-2,{"$f":"IF(AND(W32=0,Y32=0),\"\",W32+Y32)","v":54661},-8.087975651998458E-2]
[null,"Total",null,{"$f":"SUM(D30:D32)","v":720},{"$f":"IF(D33=0,\"\",SUM(E30:E32))","v":6997},{"$f":"SUM(F30:F32)","v":17929},{"$f":"IF(F33=0,\"\",SUM(G30:G32))","v":112930},18649,{"$f":"IF(H33=\"\",\"\",SUM(I30:I32))","v":119927},null,{"$f":"SUM(K30:K32)","v":6202},{"$f":"IF(K33=0,\"\",SUM(L30:L32))","v":57726},{"$f":"SUM(M30:M32)","v":16340},{"$f":"IF(M33=0,\"\",SUM(N30:N32))","v":81548},22542,{"$f":"IF(O33=\"\",\"\",SUM(P30:P32))","v":139274},null,{"$f":"SUM(R30:R32)","v":842},{"$f":"SUM(S30:S32)","v":4032},{"$f":"IF(R33=0,\"\",R33+S33)","v":4874},{"$f":"IF(T33=\"\",\"\",SUM(U30:U32))","v":27934},null,{"$f":"SUM(W30:W32)","v":326888},-0.29425886904556287,{"$f":"SUM(Y30:Y32)","v":434934},0.23332700034878684,{"$f":"IF(W33=0,\"\",W33+Y33)","v":761822},-6.6205789160798445E-2]
[null,"Julho","Varas",{"$f":"IF(TA!$C$17=3,SUMIF(Dados!$B$2:$L$217,TA!$A$40&PaMAe!$C34&PaMAe!$B$34,Dados!$I$2:$I$217),VLOOKUP(TA!$D$40&$C34&$B$34,Dados!$A$2:$L$217,9,0))","v":760},{"$f":"IF(D34=0,\"\",E30+D34)","v":5032},{"$f":"IF(TA!$C$17=3,SUMIF(Dados!$B$2:$P$217,TA!$A$40&PaMAe!$C34&PaMAe!$B$34,Dados!$M$2:$M$217),VLOOKUP(TA!$D$40&$C34&$B$34,Dados!$A$2:$P$217,13,0))","v":8257},{"$f":"IF(F34=0,\"\",IF(G30=\"\",F34,G30+F34))","v":51096},9017,{"$f":"IF(H34=\"\",\"\",I30+H34)","v":56128},null,{"$f":"IF(TA!$C$17=3,SUMIF(Dados!$B$2:$L$217,TA!$A$40&PaMAe!$C34&PaMAe!$B$34,Dados!$J$2:$J$217),VLOOKUP(TA!$D$40&$C34&$B$34,Dados!$A$2:$L$217,10,0))","v":3973},{"$f":"IF(K34=0,\"\",L30+K34)","v":31832},{"$f":"IF(TA!$C$17=3,SUMIF(Dados!$B$2:$P$217, TA!$A$40&PaMAe!$C34&PaMAe!$B$34,Dados!$N$2:$N$217), VLOOKUP(TA!$D$40&$C34&$B$34,Dados!$A$2:$P$217,14,0))","v":6676},{"$f":"IF(M34=0,\"\",IF(N30=\"\",M34,N30+M34))","v":26109},10649,{"$f":"IF(O34=\"\",\"\",P30+O34)","v":57941},null,{"$f":"IF(TA!$C$17=3,SUMIF(Dados!$B$2:$L$217,TA!$A$40&PaMAe!$C34&PaMAe!$B$34,Dados!$K$2:$K$217),VLOOKUP(TA!$D$40&$C34&$B$34,Dados!$A$2:$L$217,11,0))","v":659},{"$f":"IF(TA!$C$17=3,SUMIF(Dados!$B$2:$P$217, TA!$A$40&PaMAe!$C34&PaMAe!$B$34,Dados!$O$2:$O$217), VLOOKUP(TA!$D$40&$C34&$B$34,Dados!$A$2:$P$217,15,0))","v":4527},{"$f":"IF(AND(R34=0,S34=0),\"\",R34+S34)","v":5186},{"$f":"IF(T34=\"\",\"\",U30+T34)","v":27100},null,{"$f":"IF(TA!$C$17=3,SUMIF(Dados!$B$2:$L$217,TA!$A$40&PaMAe!$C34&PaMAe!$B$34,Dados!$L$2:$L$217),VLOOKUP(TA!$D$40&$C34&$B$34,Dados!$A$2:$L$217,12,0))","v":258410},-3.8410014438176376E-2,{"$f":"IF(TA!$C$17=3,SUMIF(Dados!$B$2:$P$217, TA!$A$40&PaMAe!$C34&PaMAe!$B$34,Dados!$P$2:$P$217), VLOOKUP(TA!$D$40&$C34&$B$34,Dados!$A$2:$P$217,16,0))","v":327480},2.3330229302467975E-2,{"$f":"IF(AND(W34=0,Y34=0),\"\",W34+Y34)","v":585890},-4.8509883718955704E-3]
[null,null,"Juizados",{"$f":"IF(TA!$C$17=3,SUMIF(Dados!$B$2:$L$217,TA!$A$40&PaMAe!$C35&PaMAe!$B$34,Dados!$I$2:$I$217),VLOOKUP(TA!$D$40&$C35&$B$34,Dados!$A$2:$L$217,9,0))","v":2},{"$f":"IF(D35=0,\"\",E31+D35)","v":22},{"$f":"IF(TA!$C$17=3,SUMIF(Dados!$B$2:$P$217,TA!$A$40&PaMAe!$C35&PaMAe!$B$34,Dados!$M$2:$M$217),VLOOKUP(TA!$D$40&$C35&$B$34,Dados!$A$2:$P$217,13,0))","v":11862},{"$f":"IF(F35=0,\"\",IF(G31=\"\",F35,G31+F35))","v":66978},11864,{"$f":"IF(H35=\"\",\"\",I31+H35)","v":67000},null,{"$f":"IF(TA!$C$17=3,SUMIF(Dados!$B$2:$L$217,TA!$A$40&PaMAe!$C35&PaMAe!$B$34,Dados!$J$2:$J$217),VLOOKUP(TA!$D$40&$C35&$B$34,Dados!$A$2:$L$217,10,0))","v":983},{"$f":"IF(K35=0,\"\",L31+K35)","v":7362},{"$f":"IF(TA!$C$17=3,SUMIF(Dados!$B$2:$P$217, TA!$A$40&PaMAe!$C35&PaMAe!$B$34,Dados!$N$2:$N$217), VLOOKUP(TA!$D$40&$C35&$B$34,Dados!$A$2:$P$217,14,0))","v":11845},{"$f":"IF(M35=0,\"\",IF(N31=\"\",M35,N31+M35))","v":65188},12828,{"$f":"IF(O35=\"\",\"\",P31+O35)","v":72550},null,{"$f":"IF(TA!$C$17=3,SUMIF(Dados!$B$2:$L$217,TA!$A$40&PaMAe!$C35&PaMAe!$B$34,Dados!$K$2:$K$217),VLOOKUP(TA!$D$40&$C35&$B$34,Dados!$A$2:$L$217,11,0))","v":174},{"$f":"IF(TA!$C$17=3,SUMIF(Dados!$B$2:$P$217, TA!$A$40&PaMAe!$C35&PaMAe!$B$34,Dados!$O$2:$O$217), VLOOKUP(TA!$D$40&$C35&$B$34,Dados!$A$2:$P$217,15,0))","v":1042},{"$f":"IF(AND(R35=0,S35=0),\"\",R35+S35)","v":1216},{"$f":"IF(T35=\"\",\"\",U31+T35)","v":7236},null,{"$f":"IF(TA!$C$17=3,SUMIF(Dados!$B$2:$L$217,TA!$A$40&PaMAe!$C35&PaMAe!$B$34,Dados!$L$2:$L$217),VLOOKUP(TA!$D$40&$C35&$B$34,Dados!$A$2:$L$217,12,0))","v":20586},0.12063146434403915,{"$f":"IF(TA!$C$17=3,SUMIF(Dados!$B$2:$P$217, TA!$A$40&PaMAe!$C35&PaMAe!$B$34,Dados!$P$2:$P$217), VLOOKUP(TA!$D$40&$C35&$B$34,Dados!$A$2:$P$217,16,0))","v":102569},2.5228647108801017E-2,{"$f":"IF(AND(W35=0,Y35=0),\"\",W35+Y35)","v":123155},4.0028712578642933E-2]
[null,null,"Turmas Recursais",{"$f":"IF(TA!$C$17=3,SUMIF(Dados!$B$2:$L$217,TA!$A$40&PaMAe!$C36&PaMAe!$B$34,Dados!$I$2:$I$217),VLOOKUP(TA!$D$40&$C36&$B$34,Dados!$A$2:$L$217,9,0))","v":142},{"$f":"IF(D36=0,\"\",E32+D36)","v":2847},{"$f":"IF(TA!$C$17=3,SUMIF(Dados!$B$2:$P$217,TA!$A$40&PaMAe!$C36&PaMAe!$B$34,Dados!$M$2:$M$217),VLOOKUP(TA!$D$40&$C36&$B$34,Dados!$A$2:$P$217,13,0))","v":3571},{"$f":"IF(F36=0,\"\",IF(G32=\"\",F36,G32+F36))","v":18546},3713,{"$f":"IF(H36=\"\",\"\",I32+H36)","v":21393},null,{"$f":"IF(TA!$C$17=3,SUMIF(Dados!$B$2:$L$217,TA!$A$40&PaMAe!$C36&PaMAe!$B$34,Dados!$J$2:$J$217),VLOOKUP(TA!$D$40&$C36&$B$34,Dados!$A$2:$L$217,10,0))","v":1747},{"$f":"IF(K36=0,\"\",L32+K36)","v":25235},{"$f":"IF(TA!$C$17=3,SUMIF(Dados!$B$2:$P$217, TA!$A$40&PaMAe!$C36&PaMAe!$B$34,Dados!$N$2:$N$217), VLOOKUP(TA!$D$40&$C36&$B$34,Dados!$A$2:$P$217,14,0))","v":1943},{"$f":"IF(M36=0,\"\",IF(N32=\"\",M36,N32+M36))","v":10715},3690,{"$f":"IF(O36=\"\",\"\",P32+O36)","v":35950},null,{"$f":"IF(TA!$C$17=3,SUMIF(Dados!$B$2:$L$217,TA!$A$40&PaMAe!$C36&PaMAe!$B$34,Dados!$K$2:$K$217),VLOOKUP(TA!$D$40&$C36&$B$34,Dados!$A$2:$L$217,11,0))","v":0},{"$f":"IF(TA!$C$17=3,SUMIF(Dados!$B$2:$P$217, TA!$A$40&PaMAe!$C36&PaMAe!$B$34,Dados!$O$2:$O$217), VLOOKUP(TA!$D$40&$C36&$B$34,Dados!$A$2:$P$217,15,0))","v":0},{"$f":"IF(AND(R36=0,S36=0),\"\",R36+S36)","v":""},{"$f":"IF(T36=\"\",\"\",U32+T36)","v":""},null,{"$f":"IF(TA!$C$17=3,SUMIF(Dados!$B$2:$L$217,TA!$A$40&PaMAe!$C36&PaMAe!$B$34,Dados!$L$2:$L$217),VLOOKUP(TA!$D$40&$C36&$B$34,Dados!$A$2:$L$217,12,0))","v":33433},-0.15967928417031119,{"$f":"IF(TA!$C$17=3,SUMIF(Dados!$B$2:$P$217, TA!$A$40&PaMAe!$C36&PaMAe!$B$34,Dados!$P$2:$P$217), VLOOKUP(TA!$D$40&$C36&$B$34,Dados!$A$2:$P$217,16,0))","v":16257},9.2907563025210083E-2,{"$f":"IF(AND(W36=0,Y36=0),\"\",W36+Y36)","v":49690},-9.0942353780574803E-2]
[null,"Total",null,{"$f":"SUM(D34:D36)","v":904},{"$f":"IF(D37=0,\"\",SUM(E34:E36))","v":7901},{"$f":"SUM(F34:F36)","v":23690},{"$f":"IF(F37=0,\"\",SUM(G34:G36))","v":136620},24594,{"$f":"IF(H37=\"\",\"\",SUM(I34:I36))","v":144521},null,{"$f":"SUM(K34:K36)","v":6703},{"$f":"IF(K37=0,\"\",SUM(L34:L36))","v":64429},{"$f":"SUM(M34:M36)","v":20464},{"$f":"IF(M37=0,\"\",SUM(N34:N36))","v":102012},27167,{"$f":"IF(O37=\"\",\"\",SUM(P34:P36))","v":166441},null,{"$f":"SUM(R34:R36)","v":833},{"$f":"SUM(S34:S36)","v":5569},{"$f":"IF(R37=0,\"\",R37+S37)","v":6402},{"$f":"IF(T37=\"\",\"\",SUM(U34:U36))","v":34336},null,{"$f":"SUM(W34:W36)","v":312429},-4.4232275274711852E-2,{"$f":"SUM(Y34:Y36)","v":446306},2.6146495790165813E-2,{"$f":"IF(W37=0,\"\",W37+Y37)","v":758735},-4.0521276623672886E-3]
[null,"Agosto","Varas",{"$f":"IF(TA!$C$17=3,SUMIF(Dados!$B$2:$L$217,TA!$A$40&PaMAe!$C38&PaMAe!$B$38,Dados!$I$2:$I$217),VLOOKUP(TA!$D$40&$C38&$B$38,Dados!$A$2:$L$217,9,0))","v":640},{"$f":"IF(D38=0,\"\",E34+D38)","v":5672},{"$f":"IF(TA!$C$17=3,SUMIF(Dados!$B$2:$P$217,TA!$A$40&PaMAe!$C38&PaMAe!$B$38,Dados!$M$2:$M$217),VLOOKUP(TA!$D$40&$C38&$B$38,Dados!$A$2:$P$217,13,0))","v":7965},{"$f":"IF(F38=0,\"\",IF(G34=\"\",F38,G34+F38))","v":59061},8605,{"$f":"IF(H38=\"\",\"\",I34+H38)","v":64733},null,{"$f":"IF(TA!$C$17=3,SUMIF(Dados!$B$2:$L$217,TA!$A$40&PaMAe!$C38&PaMAe!$B$38,Dados!$J$2:$J$217),VLOOKUP(TA!$D$40&$C38&$B$38,Dados!$A$2:$L$217,10,0))","v":4279},{"$f":"IF(K38=0,\"\",L34+K38)","v":36111},{"$f":"IF(TA!$C$17=3,SUMIF(Dados!$B$2:$P$217, TA!$A$40&PaMAe!$C38&PaMAe!$B$38,Dados!$N$2:$N$217), VLOOKUP(TA!$D$40&$C38&$B$38,Dados!$A$2:$P$217,14,0))","v":8359},{"$f":"IF(M38=0,\"\",IF(N34=\"\",M38,N34+M38))","v":34468},12638,{"$f":"IF(O38=\"\",\"\",P34+O38)","v":70579},null,{"$f":"IF(TA!$C$17=3,SUMIF(Dados!$B$2:$L$217,TA!$A$40&PaMAe!$C38&PaMAe!$B$38,Dados!$K$2:$K$217),VLOOKUP(TA!$D$40&$C38&$B$38,Dados!$A$2:$L$217,11,0))","v":542},{"$f":"IF(TA!$C$17=3,SUMIF(Dados!$B$2:$P$217, TA!$A$40&PaMAe!$C38&PaMAe!$B$38,Dados!$O$2:$O$217), VLOOKUP(TA!$D$40&$C38&$B$38,Dados!$A$2:$P$217,15,0))","v":4559},{"$f":"IF(AND(R38=0,S38=0),\"\",R38+S38)","v":5101},{"$f":"IF(T38=\"\",\"\",U34+T38)","v":32201},null,{"$f":"IF(TA!$C$17=3,SUMIF(Dados!$B$2:$L$217,TA!$A$40&PaMAe!$C38&PaMAe!$B$38,Dados!$L$2:$L$217),VLOOKUP(TA!$D$40&$C38&$B$38,Dados!$A$2:$L$217,12,0))","v":154374},-0.40260051855578349,{"$f":"IF(TA!$C$17=3,SUMIF(Dados!$B$2:$P$217, TA!$A$40&PaMAe!$C38&PaMAe!$B$38,Dados!$P$2:$P$217), VLOOKUP(TA!$D$40&$C38&$B$38,Dados!$A$2:$P$217,16,0))","v":428772},0.30930743862220589,{"$f":"IF(AND(W38=0,Y38=0),\"\",W38+Y38)","v":583146},-4.6834730068784358E-3]
[null,null,"Juizados",{"$f":"IF(TA!$C$17=3,SUMIF(Dados!$B$2:$L$217,TA!$A$40&PaMAe!$C39&PaMAe!$B$38,Dados!$I$2:$I$217),VLOOKUP(TA!$D$40&$C39&$B$38,Dados!$A$2:$L$217,9,0))","v":9},{"$f":"IF(D39=0,\"\",E35+D39)","v":31},{"$f":"IF(TA!$C$17=3,SUMIF(Dados!$B$2:$P$217,TA!$A$40&PaMAe!$C39&PaMAe!$B$38,Dados!$M$2:$M$217),VLOOKUP(TA!$D$40&$C39&$B$38,Dados!$A$2:$P$217,13,0))","v":11077},{"$f":"IF(F39=0,\"\",IF(G35=\"\",F39,G35+F39))","v":78055},{"$f":"IF(D39=0,IF(F39=0,\"\",D39+F39),D39+F39)","v":11086},{"$f":"IF(H39=\"\",\"\",I35+H39)","v":78086},null,{"$f":"IF(TA!$C$17=3,SUMIF(Dados!$B$2:$L$217,TA!$A$40&PaMAe!$C39&PaMAe!$B$38,Dados!$J$2:$J$217),VLOOKUP(TA!$D$40&$C39&$B$38,Dados!$A$2:$L$217,10,0))","v":913},{"$f":"IF(K39=0,\"\",L35+K39)","v":8275},{"$f":"IF(TA!$C$17=3,SUMIF(Dados!$B$2:$P$217, TA!$A$40&PaMAe!$C39&PaMAe!$B$38,Dados!$N$2:$N$217), VLOOKUP(TA!$D$40&$C39&$B$38,Dados!$A$2:$P$217,14,0))","v":12639},{"$f":"IF(M39=0,\"\",IF(N35=\"\",M39,N35+M39))","v":77827},13552,{"$f":"IF(O39=\"\",\"\",P35+O39)","v":86102},null,{"$f":"IF(TA!$C$17=3,SUMIF(Dados!$B$2:$L$217,TA!$A$40&PaMAe!$C39&PaMAe!$B$38,Dados!$K$2:$K$217),VLOOKUP(TA!$D$40&$C39&$B$38,Dados!$A$2:$L$217,11,0))","v":151},{"$f":"IF(TA!$C$17=3,SUMIF(Dados!$B$2:$P$217, TA!$A$40&PaMAe!$C39&PaMAe!$B$38,Dados!$O$2:$O$217), VLOOKUP(TA!$D$40&$C39&$B$38,Dados!$A$2:$P$217,15,0))","v":1044},{"$f":"IF(AND(R39=0,S39=0),\"\",R39+S39)","v":1195},{"$f":"IF(T39=\"\",\"\",U35+T39)","v":8431},null,{"$f":"IF(TA!$C$17=3,SUMIF(Dados!$B$2:$L$217,TA!$A$40&PaMAe!$C39&PaMAe!$B$38,Dados!$L$2:$L$217),VLOOKUP(TA!$D$40&$C39&$B$38,Dados!$A$2:$L$217,12,0))","v":19869},-3.482949577382688E-2,{"$f":"IF(TA!$C$17=3,SUMIF(Dados!$B$2:$P$217, TA!$A$40&PaMAe!$C39&PaMAe!$B$38,Dados!$P$2:$P$217), VLOOKUP(TA!$D$40&$C39&$B$38,Dados!$A$2:$P$217,16,0))","v":103180},5.9569655548947775E-3,{"$f":"IF(AND(W39=0,Y39=0),\"\",W39+Y39)","v":123049},-8.6070399090576455E-4]
[null,null,"Turmas Recursais",{"$f":"IF(TA!$C$17=3,SUMIF(Dados!$B$2:$L$217,TA!$A$40&PaMAe!$C40&PaMAe!$B$38,Dados!$I$2:$I$217),VLOOKUP(TA!$D$40&$C40&$B$38,Dados!$A$2:$L$217,9,0))","v":124},{"$f":"IF(D40=0,\"\",E36+D40)","v":2971},{"$f":"IF(TA!$C$17=3,SUMIF(Dados!$B$2:$P$217,TA!$A$40&PaMAe!$C40&PaMAe!$B$38,Dados!$M$2:$M$217),VLOOKUP(TA!$D$40&$C40&$B$38,Dados!$A$2:$P$217,13,0))","v":3460},{"$f":"IF(F40=0,\"\",IF(G36=\"\",F40,G36+F40))","v":22006},3584,{"$f":"IF(H40=\"\",\"\",I36+H40)","v":24977},null,{"$f":"IF(TA!$C$17=3,SUMIF(Dados!$B$2:$L$217,TA!$A$40&PaMAe!$C40&PaMAe!$B$38,Dados!$J$2:$J$217),VLOOKUP(TA!$D$40&$C40&$B$38,Dados!$A$2:$L$217,10,0))","v":1300},{"$f":"IF(K40=0,\"\",L36+K40)","v":26535},{"$f":"IF(TA!$C$17=3,SUMIF(Dados!$B$2:$P$217, TA!$A$40&PaMAe!$C40&PaMAe!$B$38,Dados!$N$2:$N$217), VLOOKUP(TA!$D$40&$C40&$B$38,Dados!$A$2:$P$217,14,0))","v":2603},{"$f":"IF(M40=0,\"\",IF(N36=\"\",M40,N36+M40))","v":13318},3903,{"$f":"IF(O40=\"\",\"\",P36+O40)","v":39853},null,{"$f":"IF(TA!$C$17=3,SUMIF(Dados!$B$2:$L$217,TA!$A$40&PaMAe!$C40&PaMAe!$B$38,Dados!$K$2:$K$217),VLOOKUP(TA!$D$40&$C40&$B$38,Dados!$A$2:$L$217,11,0))","v":0},{"$f":"IF(TA!$C$17=3,SUMIF(Dados!$B$2:$P$217, TA!$A$40&PaMAe!$C40&PaMAe!$B$38,Dados!$O$2:$O$217), VLOOKUP(TA!$D$40&$C40&$B$38,Dados!$A$2:$P$217,15,0))","v":0},{"$f":"IF(AND(R40=0,S40=0),\"\",R40+S40)","v":""},{"$f":"IF(T40=\"\",\"\",U36+T40)","v":""},null,{"$f":"IF(TA!$C$17=3,SUMIF(Dados!$B$2:$L$217,TA!$A$40&PaMAe!$C40&PaMAe!$B$38,Dados!$L$2:$L$217),VLOOKUP(TA!$D$40&$C40&$B$38,Dados!$A$2:$L$217,12,0))","v":29722},-0.11099811563425355,{"$f":"IF(TA!$C$17=3,SUMIF(Dados!$B$2:$P$217, TA!$A$40&PaMAe!$C40&PaMAe!$B$38,Dados!$P$2:$P$217), VLOOKUP(TA!$D$40&$C40&$B$38,Dados!$A$2:$P$217,16,0))","v":18107},0.11379713354247412,{"$f":"IF(AND(W40=0,Y40=0),\"\",W40+Y40)","v":47829},-3.7452203662708849E-2]
[null,"Total",null,{"$f":"SUM(D38:D40)","v":773},{"$f":"IF(D41=0,\"\",SUM(E38:E40))","v":8674},{"$f":"SUM(F38:F40)","v":22502},{"$f":"IF(F41=0,\"\",SUM(G38:G40))","v":159122},23275,{"$f":"IF(H41=\"\",\"\",SUM(I38:I40))","v":167796},null,{"$f":"SUM(K38:K40)","v":6492},{"$f":"IF(K41=0,\"\",SUM(L38:L40))","v":70921},{"$f":"SUM(M38:M40)","v":23601},{"$f":"IF(M41=0,\"\",SUM(N38:N40))","v":125613},30093,{"$f":"IF(O41=\"\",\"\",SUM(P38:P40))","v":196534},null,{"$f":"SUM(R38:R40)","v":693},{"$f":"SUM(S38:S40)","v":5603},{"$f":"IF(R41=0,\"\",R41+S41)","v":6296},{"$f":"IF(T41=\"\",\"\",SUM(U38:U40))","v":40632},null,{"$f":"SUM(W38:W40)","v":203965},-0.34716367558709338,{"$f":"SUM(Y38:Y40)","v":550059},0.23247054711341542,{"$f":"IF(W41=0,\"\",W41+Y41)","v":754024},-6.2090189591886835E-3]
[null,"Setembro","Varas",{"$f":"IF(TA!$C$17=3,SUMIF(Dados!$B$2:$L$217,TA!$A$40&PaMAe!$C42&PaMAe!$B$42,Dados!$I$2:$I$217),VLOOKUP(TA!$D$40&$C42&$B$42,Dados!$A$2:$L$217,9,0))","v":673},{"$f":"IF(D42=0,\"\",E38+D42)","v":6345},{"$f":"IF(TA!$C$17=3,SUMIF(Dados!$B$2:$P$217,TA!$A$40&PaMAe!$C42&PaMAe!$B$42,Dados!$M$2:$M$217),VLOOKUP(TA!$D$40&$C42&$B$42,Dados!$A$2:$P$217,13,0))","v":7127},{"$f":"IF(F42=0,\"\",IF(G38=\"\",F42,G38+F42))","v":66188},7800,{"$f":"IF(H42=\"\",\"\",I38+H42)","v":72533},null,{"$f":"IF(TA!$C$17=3,SUMIF(Dados!$B$2:$L$217,TA!$A$40&PaMAe!$C42&PaMAe!$B$42,Dados!$J$2:$J$217),VLOOKUP(TA!$D$40&$C42&$B$42,Dados!$A$2:$L$217,10,0))","v":2512},{"$f":"IF(K42=0,\"\",L38+K42)","v":38623},{"$f":"IF(TA!$C$17=3,SUMIF(Dados!$B$2:$P$217, TA!$A$40&PaMAe!$C42&PaMAe!$B$42,Dados!$N$2:$N$217), VLOOKUP(TA!$D$40&$C42&$B$42,Dados!$A$2:$P$217,14,0))","v":8264},{"$f":"IF(M42=0,\"\",IF(N38=\"\",M42,N38+M42))","v":42732},10776,{"$f":"IF(O42=\"\",\"\",P38+O42)","v":81355},null,{"$f":"IF(TA!$C$17=3,SUMIF(Dados!$B$2:$L$217,TA!$A$40&PaMAe!$C42&PaMAe!$B$42,Dados!$K$2:$K$217),VLOOKUP(TA!$D$40&$C42&$B$42,Dados!$A$2:$L$217,11,0))","v":397},{"$f":"IF(TA!$C$17=3,SUMIF(Dados!$B$2:$P$217, TA!$A$40&PaMAe!$C42&PaMAe!$B$42,Dados!$O$2:$O$217), VLOOKUP(TA!$D$40&$C42&$B$42,Dados!$A$2:$P$217,15,0))","v":4561},{"$f":"IF(AND(R42=0,S42=0),\"\",R42+S42)","v":4958},{"$f":"IF(T42=\"\",\"\",U38+T42)","v":37159},null,{"$f":"IF(TA!$C$17=3,SUMIF(Dados!$B$2:$L$217,TA!$A$40&PaMAe!$C42&PaMAe!$B$42,Dados!$L$2:$L$217),VLOOKUP(TA!$D$40&$C42&$B$42,Dados!$A$2:$L$217,12,0))","v":132698},-0.14041224558539656,{"$f":"IF(TA!$C$17=3,SUMIF(Dados!$B$2:$P$217, TA!$A$40&PaMAe!$C42&PaMAe!$B$42,Dados!$P$2:$P$217), VLOOKUP(TA!$D$40&$C42&$B$42,Dados!$A$2:$P$217,16,0))","v":447088},4.2717341617456439E-2,{"$f":"IF(AND(W42=0,Y42=0),\"\",W42+Y42)","v":579786},-5.7618503770925367E-3]
[null,null,"Juizados",{"$f":"IF(TA!$C$17=3,SUMIF(Dados!$B$2:$L$217,TA!$A$40&PaMAe!$C43&PaMAe!$B$42,Dados!$I$2:$I$217),VLOOKUP(TA!$D$40&$C43&$B$42,Dados!$A$2:$L$217,9,0))","v":4},{"$f":"IF(D43=0,0,E39+D43)","v":35},{"$f":"IF(TA!$C$17=3,SUMIF(Dados!$B$2:$P$217,TA!$A$40&PaMAe!$C43&PaMAe!$B$42,Dados!$M$2:$M$217),VLOOKUP(TA!$D$40&$C43&$B$42,Dados!$A$2:$P$217,13,0))","v":10457},{"$f":"IF(F43=0,\"\",IF(G39=\"\",F43,G39+F43))","v":88512},{"$f":"IF(D43=0,IF(F43=0,\"\",D43+F43),D43+F43)","v":10461},{"$f":"IF(H43=\"\",0,I39+H43)","v":88547},null,{"$f":"IF(TA!$C$17=3,SUMIF(Dados!$B$2:$L$217,TA!$A$40&PaMAe!$C43&PaMAe!$B$42,Dados!$J$2:$J$217),VLOOKUP(TA!$D$40&$C43&$B$42,Dados!$A$2:$L$217,10,0))","v":1043},{"$f":"IF(K43=0,\"\",L39+K43)","v":9318},{"$f":"IF(TA!$C$17=3,SUMIF(Dados!$B$2:$P$217, TA!$A$40&PaMAe!$C43&PaMAe!$B$42,Dados!$N$2:$N$217), VLOOKUP(TA!$D$40&$C43&$B$42,Dados!$A$2:$P$217,14,0))","v":10656},{"$f":"IF(M43=0,\"\",IF(N39=\"\",M43,N39+M43))","v":88483},11699,{"$f":"IF(O43=\"\",\"\",P39+O43)","v":97801},null,{"$f":"IF(TA!$C$17=3,SUMIF(Dados!$B$2:$L$217,TA!$A$40&PaMAe!$C43&PaMAe!$B$42,Dados!$K$2:$K$217),VLOOKUP(TA!$D$40&$C43&$B$42,Dados!$A$2:$L$217,11,0))","v":142},{"$f":"IF(TA!$C$17=3,SUMIF(Dados!$B$2:$P$217, TA!$A$40&PaMAe!$C43&PaMAe!$B$42,Dados!$O$2:$O$217), VLOOKUP(TA!$D$40&$C43&$B$42,Dados!$A$2:$P$217,15,0))","v":1034},{"$f":"IF(AND(R43=0,S43=0),\"\",R43+S43)","v":1176},{"$f":"IF(T43=\"\",\"\",U39+T43)","v":9607},null,{"$f":"IF(TA!$C$17=3,SUMIF(Dados!$B$2:$L$217,TA!$A$40&PaMAe!$C43&PaMAe!$B$42,Dados!$L$2:$L$217),VLOOKUP(TA!$D$40&$C43&$B$42,Dados!$A$2:$L$217,12,0))","v":21248},6.940460013085703E-2,{"$f":"IF(TA!$C$17=3,SUMIF(Dados!$B$2:$P$217, TA!$A$40&PaMAe!$C43&PaMAe!$B$42,Dados!$P$2:$P$217), VLOOKUP(TA!$D$40&$C43&$B$42,Dados!$A$2:$P$217,16,0))","v":104121},9.1199844931189045E-3,{"$f":"IF(AND(W43=0,Y43=0),\"\",W43+Y43)","v":125369},1.8854277564222421E-2]
[null,null,"Turmas Recursais",{"$f":"IF(TA!$C$17=3,SUMIF(Dados!$B$2:$L$217,TA!$A$40&PaMAe!$C44&PaMAe!$B$42,Dados!$I$2:$I$217),VLOOKUP(TA!$D$40&$C44&$B$42,Dados!$A$2:$L$217,9,0))","v":91},{"$f":"IF(D44=0,\"\",E40+D44)","v":3062},{"$f":"IF(TA!$C$17=3,SUMIF(Dados!$B$2:$P$217,TA!$A$40&PaMAe!$C44&PaMAe!$B$42,Dados!$M$2:$M$217),VLOOKUP(TA!$D$40&$C44&$B$42,Dados!$A$2:$P$217,13,0))","v":3445},{"$f":"IF(F44=0,\"\",IF(G40=\"\",F44,G40+F44))","v":25451},3536,{"$f":"IF(H44=\"\",\"\",I40+H44)","v":28513},null,{"$f":"IF(TA!$C$17=3,SUMIF(Dados!$B$2:$L$217,TA!$A$40&PaMAe!$C44&PaMAe!$B$42,Dados!$J$2:$J$217),VLOOKUP(TA!$D$40&$C44&$B$42,Dados!$A$2:$L$217,10,0))","v":916},{"$f":"IF(K44=0,\"\",L40+K44)","v":27451},{"$f":"IF(TA!$C$17=3,SUMIF(Dados!$B$2:$P$217, TA!$A$40&PaMAe!$C44&PaMAe!$B$42,Dados!$N$2:$N$217), VLOOKUP(TA!$D$40&$C44&$B$42,Dados!$A$2:$P$217,14,0))","v":3625},{"$f":"IF(M44=0,\"\",IF(N40=\"\",M44,N40+M44))","v":16943},4541,{"$f":"IF(O44=\"\",\"\",P40+O44)","v":44394},null,{"$f":"IF(TA!$C$17=3,SUMIF(Dados!$B$2:$L$217,TA!$A$40&PaMAe!$C44&PaMAe!$B$42,Dados!$K$2:$K$217),VLOOKUP(TA!$D$40&$C44&$B$42,Dados!$A$2:$L$217,11,0))","v":0},{"$f":"IF(TA!$C$17=3,SUMIF(Dados!$B$2:$P$217, TA!$A$40&PaMAe!$C44&PaMAe!$B$42,Dados!$O$2:$O$217), VLOOKUP(TA!$D$40&$C44&$B$42,Dados!$A$2:$P$217,15,0))","v":0},{"$f":"IF(AND(R44=0,S44=0),\"\",R44+S44)","v":""},{"$f":"IF(T44=\"\",\"\",U40+T44)","v":""},null,{"$f":"IF(TA!$C$17=3,SUMIF(Dados!$B$2:$L$217,TA!$A$40&PaMAe!$C44&PaMAe!$B$42,Dados!$L$2:$L$217),VLOOKUP(TA!$D$40&$C44&$B$42,Dados!$A$2:$L$217,12,0))","v":26449},-0.11012044949868782,{"$f":"IF(TA!$C$17=3,SUMIF(Dados!$B$2:$P$217, TA!$A$40&PaMAe!$C44&PaMAe!$B$42,Dados!$P$2:$P$217), VLOOKUP(TA!$D$40&$C44&$B$42,Dados!$A$2:$P$217,16,0))","v":19884},9.8138841332081617E-2,{"$f":"IF(AND(W44=0,Y44=0),\"\",W44+Y44)","v":46333},-3.1278094879675478E-2]
[null,"Total",null,{"$f":"SUM(D42:D44)","v":768},{"$f":"IF(D45=0,\"\",SUM(E42:E44))","v":9442},{"$f":"SUM(F42:F44)","v":21029},{"$f":"IF(F45=0,\"\",SUM(G42:G44))","v":180151},21797,{"$f":"IF(H45=\"\",\"\",SUM(I42:I44))","v":189593},null,{"$f":"SUM(K42:K44)","v":4471},{"$f":"IF(K45=0,\"\",SUM(L42:L44))","v":75392},{"$f":"SUM(M42:M44)","v":22545},{"$f":"IF(M45=0,\"\",SUM(N42:N44))","v":148158},27016,{"$f":"IF(O45=\"\",\"\",SUM(P42:P44))","v":223550},null,{"$f":"SUM(R42:R44)","v":539},{"$f":"SUM(S42:S44)","v":5595},{"$f":"IF(R45=0,\"\",R45+S45)","v":6134},{"$f":"IF(T45=\"\",\"\",SUM(U42:U44))","v":46766},null,{"$f":"SUM(W42:W44)","v":180395},-0.11555904199249867,{"$f":"SUM(Y42:Y44)","v":571093},3.8239534304501888E-2,{"$f":"IF(W45=0,\"\",W45+Y45)","v":751488},-3.3632881711987972E-3]
[null,"Outubro","Varas",{"$f":"IF(TA!$C$17=3,SUMIF(Dados!$B$2:$L$217,TA!$A$40&PaMAe!$C46&PaMAe!$B$46,Dados!$I$2:$I$217),VLOOKUP(TA!$D$40&$C46&$B$46,Dados!$A$2:$L$217,9,0))","v":567},{"$f":"IF(D46=0,\"\",E42+D46)","v":6912},{"$f":"IF(TA!$C$17=3,SUMIF(Dados!$B$2:$P$217,TA!$A$40&PaMAe!$C46&PaMAe!$B$46,Dados!$M$2:$M$217),VLOOKUP(TA!$D$40&$C46&$B$46,Dados!$A$2:$P$217,13,0))","v":8176},{"$f":"IF(F46=0,\"\",IF(G42=\"\",F46,G42+F46))","v":74364},8743,{"$f":"IF(H46=\"\",\"\",I42+H46)","v":81276},null,{"$f":"IF(TA!$C$17=3,SUMIF(Dados!$B$2:$L$217,TA!$A$40&PaMAe!$C46&PaMAe!$B$46,Dados!$J$2:$J$217),VLOOKUP(TA!$D$40&$C46&$B$46,Dados!$A$2:$L$217,10,0))","v":2358},{"$f":"IF(K46=0,\"\",L42+K46)","v":40981},{"$f":"IF(TA!$C$17=3,SUMIF(Dados!$B$2:$P$217, TA!$A$40&PaMAe!$C46&PaMAe!$B$46,Dados!$N$2:$N$217), VLOOKUP(TA!$D$40&$C46&$B$46,Dados!$A$2:$P$217,14,0))","v":7642},{"$f":"IF(M46=0,\"\",IF(N42=\"\",M46,N42+M46))","v":50374},10000,{"$f":"IF(O46=\"\",\"\",P42+O46)","v":91355},null,{"$f":"IF(TA!$C$17=3,SUMIF(Dados!$B$2:$L$217,TA!$A$40&PaMAe!$C46&PaMAe!$B$46,Dados!$K$2:$K$217),VLOOKUP(TA!$D$40&$C46&$B$46,Dados!$A$2:$L$217,11,0))","v":442},{"$f":"IF(TA!$C$17=3,SUMIF(Dados!$B$2:$P$217, TA!$A$40&PaMAe!$C46&PaMAe!$B$46,Dados!$O$2:$O$217), VLOOKUP(TA!$D$40&$C46&$B$46,Dados!$A$2:$P$217,15,0))","v":4497},{"$f":"IF(AND(R46=0,S46=0),\"\",R46+S46)","v":4939},{"$f":"IF(T46=\"\",\"\",U42+T46)","v":42098},null,{"$f":"IF(TA!$C$17=3,SUMIF(Dados!$B$2:$L$217,TA!$A$40&PaMAe!$C46&PaMAe!$B$46,Dados!$L$2:$L$217),VLOOKUP(TA!$D$40&$C46&$B$46,Dados!$A$2:$L$217,12,0))","v":118947},-0.10362627922048562,{"$f":"IF(TA!$C$17=3,SUMIF(Dados!$B$2:$P$217, TA!$A$40&PaMAe!$C46&PaMAe!$B$46,Dados!$P$2:$P$217), VLOOKUP(TA!$D$40&$C46&$B$46,Dados!$A$2:$P$217,16,0))","v":457423},2.3116254518126267E-2,{"$f":"IF(AND(W46=0,Y46=0),\"\",W46+Y46)","v":576370},-5.8918290541682961E-3]
[null,null,"Juizados",{"$f":"IF(TA!$C$17=3,SUMIF(Dados!$B$2:$L$217,TA!$A$40&PaMAe!$C47&PaMAe!$B$46,Dados!$I$2:$I$217),VLOOKUP(TA!$D$40&$C47&$B$46,Dados!$A$2:$L$217,9,0))","v":5},{"$f":"IF(D47=0,\"\",E43+D47)","v":40},{"$f":"IF(TA!$C$17=3,SUMIF(Dados!$B$2:$P$217,TA!$A$40&PaMAe!$C47&PaMAe!$B$46,Dados!$M$2:$M$217),VLOOKUP(TA!$D$40&$C47&$B$46,Dados!$A$2:$P$217,13,0))","v":13300},{"$f":"IF(F47=0,\"\",IF(G43=\"\",F47,G43+F47))","v":101812},13305,{"$f":"IF(H47=\"\",\"\",I43+H47)","v":101852},null,{"$f":"IF(TA!$C$17=3,SUMIF(Dados!$B$2:$L$217,TA!$A$40&PaMAe!$C47&PaMAe!$B$46,Dados!$J$2:$J$217),VLOOKUP(TA!$D$40&$C47&$B$46,Dados!$A$2:$L$217,10,0))","v":1369},{"$f":"IF(K47=0,\"\",L43+K47)","v":10687},{"$f":"IF(TA!$C$17=3,SUMIF(Dados!$B$2:$P$217, TA!$A$40&PaMAe!$C47&PaMAe!$B$46,Dados!$N$2:$N$217), VLOOKUP(TA!$D$40&$C47&$B$46,Dados!$A$2:$P$217,14,0))","v":11175},{"$f":"IF(M47=0,\"\",IF(N43=\"\",M47,N43+M47))","v":99658},12544,{"$f":"IF(O47=\"\",\"\",P43+O47)","v":110345},null,{"$f":"IF(TA!$C$17=3,SUMIF(Dados!$B$2:$L$217,TA!$A$40&PaMAe!$C47&PaMAe!$B$46,Dados!$K$2:$K$217),VLOOKUP(TA!$D$40&$C47&$B$46,Dados!$A$2:$L$217,11,0))","v":144},{"$f":"IF(TA!$C$17=3,SUMIF(Dados!$B$2:$P$217, TA!$A$40&PaMAe!$C47&PaMAe!$B$46,Dados!$O$2:$O$217), VLOOKUP(TA!$D$40&$C47&$B$46,Dados!$A$2:$P$217,15,0))","v":1019},{"$f":"IF(AND(R47=0,S47=0),\"\",R47+S47)","v":1163},{"$f":"IF(T47=\"\",\"\",U43+T47)","v":10770},null,{"$f":"IF(TA!$C$17=3,SUMIF(Dados!$B$2:$L$217,TA!$A$40&PaMAe!$C47&PaMAe!$B$46,Dados!$L$2:$L$217),VLOOKUP(TA!$D$40&$C47&$B$46,Dados!$A$2:$L$217,12,0))","v":18345},-0.13662462349397586,{"$f":"IF(TA!$C$17=3,SUMIF(Dados!$B$2:$P$217, TA!$A$40&PaMAe!$C47&PaMAe!$B$46,Dados!$P$2:$P$217), VLOOKUP(TA!$D$40&$C47&$B$46,Dados!$A$2:$P$217,16,0))","v":107979},3.7053044054513595E-2,{"$f":"IF(AND(W47=0,Y47=0),\"\",W47+Y47)","v":126324},7.6175131013249686E-3]
[null,null,"Turmas Recursais",{"$f":"IF(TA!$C$17=3,SUMIF(Dados!$B$2:$L$217,TA!$A$40&PaMAe!$C48&PaMAe!$B$46,Dados!$I$2:$I$217),VLOOKUP(TA!$D$40&$C48&$B$46,Dados!$A$2:$L$217,9,0))","v":132},{"$f":"IF(D48=0,\"\",E44+D48)","v":3194},{"$f":"IF(TA!$C$17=3,SUMIF(Dados!$B$2:$P$217,TA!$A$40&PaMAe!$C48&PaMAe!$B$46,Dados!$M$2:$M$217),VLOOKUP(TA!$D$40&$C48&$B$46,Dados!$A$2:$P$217,13,0))","v":3260},{"$f":"IF(F48=0,\"\",IF(G44=\"\",F48,G44+F48))","v":28711},3392,{"$f":"IF(H48=\"\",\"\",I44+H48)","v":31905},null,{"$f":"IF(TA!$C$17=3,SUMIF(Dados!$B$2:$L$217,TA!$A$40&PaMAe!$C48&PaMAe!$B$46,Dados!$J$2:$J$217),VLOOKUP(TA!$D$40&$C48&$B$46,Dados!$A$2:$L$217,10,0))","v":806},{"$f":"IF(K48=0,\"\",L44+K48)","v":28257},{"$f":"IF(TA!$C$17=3,SUMIF(Dados!$B$2:$P$217, TA!$A$40&PaMAe!$C48&PaMAe!$B$46,Dados!$N$2:$N$217), VLOOKUP(TA!$D$40&$C48&$B$46,Dados!$A$2:$P$217,14,0))","v":3515},{"$f":"IF(M48=0,\"\",IF(N44=\"\",M48,N44+M48))","v":20458},4321,{"$f":"IF(O48=\"\",\"\",P44+O48)","v":48715},null,{"$f":"IF(TA!$C$17=3,SUMIF(Dados!$B$2:$L$217,TA!$A$40&PaMAe!$C48&PaMAe!$B$46,Dados!$K$2:$K$217),VLOOKUP(TA!$D$40&$C48&$B$46,Dados!$A$2:$L$217,11,0))","v":0},{"$f":"IF(TA!$C$17=3,SUMIF(Dados!$B$2:$P$217, TA!$A$40&PaMAe!$C48&PaMAe!$B$46,Dados!$O$2:$O$217), VLOOKUP(TA!$D$40&$C48&$B$46,Dados!$A$2:$P$217,15,0))","v":0},{"$f":"IF(AND(R48=0,S48=0),\"\",R48+S48)","v":""},{"$f":"IF(T48=\"\",\"\",U44+T48)","v":""},null,{"$f":"IF(TA!$C$17=3,SUMIF(Dados!$B$2:$L$217,TA!$A$40&PaMAe!$C48&PaMAe!$B$46,Dados!$L$2:$L$217),VLOOKUP(TA!$D$40&$C48&$B$46,Dados!$A$2:$L$217,12,0))","v":25098},-5.1079435895497016E-2,{"$f":"IF(TA!$C$17=3,SUMIF(Dados!$B$2:$P$217, TA!$A$40&PaMAe!$C48&PaMAe!$B$46,Dados!$P$2:$P$217), VLOOKUP(TA!$D$40&$C48&$B$46,Dados!$A$2:$P$217,16,0))","v":19449},-2.1876885938442947E-2,{"$f":"IF(AND(W48=0,Y48=0),\"\",W48+Y48)","v":44547},-3.8547039906761893E-2]
[null,"Total",null,{"$f":"SUM(D46:D48)","v":704},{"$f":"IF(D49=0,\"\",SUM(E46:E48))","v":10146},{"$f":"SUM(F46:F48)","v":24736},{"$f":"IF(F49=0,\"\",SUM(G46:G48))","v":204887},25440,{"$f":"IF(H49=\"\",\"\",SUM(I46:I48))","v":215033},null,{"$f":"SUM(K46:K48)","v":4533},{"$f":"IF(K49=0,\"\",SUM(L46:L48))","v":79925},{"$f":"SUM(M46:M48)","v":22332},{"$f":"IF(M49=0,\"\",SUM(N46:N48))","v":170490},26865,{"$f":"IF(O49=\"\",\"\",SUM(P46:P48))","v":250415},null,{"$f":"SUM(R46:R48)","v":586},{"$f":"SUM(S46:S48)","v":5516},{"$f":"IF(R49=0,\"\",R49+S49)","v":6102},{"$f":"IF(T49=\"\",\"\",SUM(U46:U48))","v":52868},null,{"$f":"SUM(W46:W48)","v":162390},-9.9808753014218765E-2,{"$f":"SUM(Y46:Y48)","v":584851},2.4090647232587248E-2,{"$f":"IF(W49=0,\"\",W49+Y49)","v":747241},-5.6514541815704256E-3]
[null,"Novembro","Varas",{"$f":"IF(TA!$C$17=3,SUMIF(Dados!$B$2:$L$217,TA!$A$40&PaMAe!$C50&PaMAe!$B$50,Dados!$I$2:$I$217),VLOOKUP(TA!$D$40&$C50&$B$50,Dados!$A$2:$L$217,9,0))","v":562},{"$f":"IF(D50=0,\"\",E46+D50)","v":7474},{"$f":"IF(TA!$C$17=3,SUMIF(Dados!$B$2:$P$217,TA!$A$40&PaMAe!$C50&PaMAe!$B$50,Dados!$M$2:$M$217),VLOOKUP(TA!$D$40&$C50&$B$50,Dados!$A$2:$P$217,13,0))","v":11226},{"$f":"IF(F50=0,\"\",IF(G46=\"\",F50,G46+F50))","v":85590},11788,{"$f":"IF(H50=\"\",\"\",I46+H50)","v":93064},null,{"$f":"IF(TA!$C$17=3,SUMIF(Dados!$B$2:$L$217,TA!$A$40&PaMAe!$C50&PaMAe!$B$50,Dados!$J$2:$J$217),VLOOKUP(TA!$D$40&$C50&$B$50,Dados!$A$2:$L$217,10,0))","v":1323},{"$f":"IF(K50=0,\"\",L46+K50)","v":42304},{"$f":"IF(TA!$C$17=3,SUMIF(Dados!$B$2:$P$217, TA!$A$40&PaMAe!$C50&PaMAe!$B$50,Dados!$N$2:$N$217), VLOOKUP(TA!$D$40&$C50&$B$50,Dados!$A$2:$P$217,14,0))","v":6652},{"$f":"IF(M50=0,\"\",IF(N46=\"\",M50,N46+M50))","v":57026},7975,{"$f":"IF(O50=\"\",\"\",P46+O50)","v":99330},null,{"$f":"IF(TA!$C$17=3,SUMIF(Dados!$B$2:$L$217,TA!$A$40&PaMAe!$C50&PaMAe!$B$50,Dados!$K$2:$K$217),VLOOKUP(TA!$D$40&$C50&$B$50,Dados!$A$2:$L$217,11,0))","v":243},{"$f":"IF(TA!$C$17=3,SUMIF(Dados!$B$2:$P$217, TA!$A$40&PaMAe!$C50&PaMAe!$B$50,Dados!$O$2:$O$217), VLOOKUP(TA!$D$40&$C50&$B$50,Dados!$A$2:$P$217,15,0))","v":3494},{"$f":"IF(AND(R50=0,S50=0),\"\",R50+S50)","v":3737},{"$f":"IF(T50=\"\",\"\",U46+T50)","v":45835},null,{"$f":"IF(TA!$C$17=3,SUMIF(Dados!$B$2:$L$217,TA!$A$40&PaMAe!$C50&PaMAe!$B$50,Dados!$L$2:$L$217),VLOOKUP(TA!$D$40&$C50&$B$50,Dados!$A$2:$L$217,12,0))","v":109315},-8.0977241964908742E-2,{"$f":"IF(TA!$C$17=3,SUMIF(Dados!$B$2:$P$217, TA!$A$40&PaMAe!$C50&PaMAe!$B$50,Dados!$P$2:$P$217), VLOOKUP(TA!$D$40&$C50&$B$50,Dados!$A$2:$P$217,16,0))","v":469916},2.7311700548507511E-2,{"$f":"IF(AND(W50=0,Y50=0),\"\",W50+Y50)","v":579231},4.9638253205406269E-3]
[null,null,"Juizados",{"$f":"IF(TA!$C$17=3,SUMIF(Dados!$B$2:$L$217,TA!$A$40&PaMAe!$C51&PaMAe!$B$50,Dados!$I$2:$I$217),VLOOKUP(TA!$D$40&$C51&$B$50,Dados!$A$2:$L$217,9,0))","v":2},{"$f":"IF(D51=0,\"\",E47+D51)","v":42},{"$f":"IF(TA!$C$17=3,SUMIF(Dados!$B$2:$P$217,TA!$A$40&PaMAe!$C51&PaMAe!$B$50,Dados!$M$2:$M$217),VLOOKUP(TA!$D$40&$C51&$B$50,Dados!$A$2:$P$217,13,0))","v":24928},{"$f":"IF(F51=0,\"\",IF(G47=\"\",F51,G47+F51))","v":126740},24930,{"$f":"IF(H51=\"\",\"\",I47+H51)","v":126782},null,{"$f":"IF(TA!$C$17=3,SUMIF(Dados!$B$2:$L$217,TA!$A$40&PaMAe!$C51&PaMAe!$B$50,Dados!$J$2:$J$217),VLOOKUP(TA!$D$40&$C51&$B$50,Dados!$A$2:$L$217,10,0))","v":480},{"$f":"IF(K51=0,\"\",L47+K51)","v":11167},{"$f":"IF(TA!$C$17=3,SUMIF(Dados!$B$2:$P$217, TA!$A$40&PaMAe!$C51&PaMAe!$B$50,Dados!$N$2:$N$217), VLOOKUP(TA!$D$40&$C51&$B$50,Dados!$A$2:$P$217,14,0))","v":10091},{"$f":"IF(M51=0,\"\",IF(N47=\"\",M51,N47+M51))","v":109749},10571,{"$f":"IF(O51=\"\",\"\",P47+O51)","v":120916},null,{"$f":"IF(TA!$C$17=3,SUMIF(Dados!$B$2:$L$217,TA!$A$40&PaMAe!$C51&PaMAe!$B$50,Dados!$K$2:$K$217),VLOOKUP(TA!$D$40&$C51&$B$50,Dados!$A$2:$L$217,11,0))","v":85},{"$f":"IF(TA!$C$17=3,SUMIF(Dados!$B$2:$P$217, TA!$A$40&PaMAe!$C51&PaMAe!$B$50,Dados!$O$2:$O$217), VLOOKUP(TA!$D$40&$C51&$B$50,Dados!$A$2:$P$217,15,0))","v":776},{"$f":"IF(AND(R51=0,S51=0),\"\",R51+S51)","v":861},{"$f":"IF(T51=\"\",\"\",U47+T51)","v":11631},null,{"$f":"IF(TA!$C$17=3,SUMIF(Dados!$B$2:$L$217,TA!$A$40&PaMAe!$C51&PaMAe!$B$50,Dados!$L$2:$L$217),VLOOKUP(TA!$D$40&$C51&$B$50,Dados!$A$2:$L$217,12,0))","v":16675},-9.1032979013355164E-2,{"$f":"IF(TA!$C$17=3,SUMIF(Dados!$B$2:$P$217, TA!$A$40&PaMAe!$C51&PaMAe!$B$50,Dados!$P$2:$P$217), VLOOKUP(TA!$D$40&$C51&$B$50,Dados!$A$2:$P$217,16,0))","v":125479},0.16206855036627488,{"$f":"IF(AND(W51=0,Y51=0),\"\",W51+Y51)","v":142154},0.12531268800861284]
[null,null,"Turmas Recursais",{"$f":"IF(TA!$C$17=3,SUMIF(Dados!$B$2:$L$217,TA!$A$40&PaMAe!$C52&PaMAe!$B$50,Dados!$I$2:$I$217),VLOOKUP(TA!$D$40&$C52&$B$50,Dados!$A$2:$L$217,9,0))","v":100},{"$f":"IF(D52=0,\"\",E48+D52)","v":3294},{"$f":"IF(TA!$C$17=3,SUMIF(Dados!$B$2:$P$217,TA!$A$40&PaMAe!$C52&PaMAe!$B$50,Dados!$M$2:$M$217),VLOOKUP(TA!$D$40&$C52&$B$50,Dados!$A$2:$P$217,13,0))","v":2503},{"$f":"IF(F52=0,\"\",IF(G48=\"\",F52,G48+F52))","v":31214},2603,{"$f":"IF(H52=\"\",\"\",I48+H52)","v":34508},null,{"$f":"IF(TA!$C$17=3,SUMIF(Dados!$B$2:$L$217,TA!$A$40&PaMAe!$C52&PaMAe!$B$50,Dados!$J$2:$J$217),VLOOKUP(TA!$D$40&$C52&$B$50,Dados!$A$2:$L$217,10,0))","v":721},{"$f":"IF(K52=0,\"\",L48+K52)","v":28978},{"$f":"IF(TA!$C$17=3,SUMIF(Dados!$B$2:$P$217, TA!$A$40&PaMAe!$C52&PaMAe!$B$50,Dados!$N$2:$N$217), VLOOKUP(TA!$D$40&$C52&$B$50,Dados!$A$2:$P$217,14,0))","v":2594},{"$f":"IF(M52=0,\"\",IF(N48=\"\",M52,N48+M52))","v":23052},3315,{"$f":"IF(O52=\"\",\"\",P48+O52)","v":52030},null,{"$f":"IF(TA!$C$17=3,SUMIF(Dados!$B$2:$L$217,TA!$A$40&PaMAe!$C52&PaMAe!$B$50,Dados!$K$2:$K$217),VLOOKUP(TA!$D$40&$C52&$B$50,Dados!$A$2:$L$217,11,0))","v":0},{"$f":"IF(TA!$C$17=3,SUMIF(Dados!$B$2:$P$217, TA!$A$40&PaMAe!$C52&PaMAe!$B$50,Dados!$O$2:$O$217), VLOOKUP(TA!$D$40&$C52&$B$50,Dados!$A$2:$P$217,15,0))","v":0},{"$f":"IF(AND(R52=0,S52=0),\"\",R52+S52)","v":""},{"$f":"IF(T52=\"\",\"\",U48+T52)","v":""},null,{"$f":"IF(TA!$C$17=3,SUMIF(Dados!$B$2:$L$217,TA!$A$40&PaMAe!$C52&PaMAe!$B$50,Dados!$L$2:$L$217),VLOOKUP(TA!$D$40&$C52&$B$50,Dados!$A$2:$L$217,12,0))","v":24537},-2.23523786755917E-2,{"$f":"IF(TA!$C$17=3,SUMIF(Dados!$B$2:$P$217, TA!$A$40&PaMAe!$C52&PaMAe!$B$50,Dados!$P$2:$P$217), VLOOKUP(TA!$D$40&$C52&$B$50,Dados!$A$2:$P$217,16,0))","v":19654},1.0540387680600505E-2,{"$f":"IF(AND(W52=0,Y52=0),\"\",W52+Y52)","v":44191},-7.9915594765079812E-3]
[null,"Total",null,{"$f":"SUM(D50:D52)","v":664},{"$f":"IF(D53=0,\"\",SUM(E50:E52))","v":10810},{"$f":"SUM(F50:F52)","v":38657},{"$f":"IF(F53=0,\"\",SUM(G50:G52))","v":243544},39321,{"$f":"IF(H53=\"\",\"\",SUM(I50:I52))","v":254354},null,{"$f":"SUM(K50:K52)","v":2524},{"$f":"IF(K53=0,\"\",SUM(L50:L52))","v":82449},{"$f":"SUM(M50:M52)","v":19337},{"$f":"IF(M53=0,\"\",SUM(N50:N52))","v":189827},21861,{"$f":"IF(O53=\"\",\"\",SUM(P50:P52))","v":272276},null,{"$f":"SUM(R50:R52)","v":328},{"$f":"SUM(S50:S52)","v":4270},{"$f":"IF(R53=0,\"\",R53+S53)","v":4598},{"$f":"IF(T53=\"\",\"\",SUM(U50:U52))","v":57466},null,{"$f":"SUM(W50:W52)","v":150527},-7.305252786501637E-2,{"$f":"SUM(Y50:Y52)","v":615049},5.1633663958854381E-2,{"$f":"IF(W53=0,\"\",W53+Y53)","v":765576},2.4536929852617906E-2]
[null,"Dezembro","Varas",{"$f":"IF(TA!$C$17=3,SUMIF(Dados!$B$2:$L$217,TA!$A$40&PaMAe!$C54&PaMAe!$B$54,Dados!$I$2:$I$217),VLOOKUP(TA!$D$40&$C54&$B$54,Dados!$A$2:$L$217,9,0))","v":485},{"$f":"IF(D54=0,\"\",E50+D54)","v":7959},{"$f":"IF(TA!$C$17=3,SUMIF(Dados!$B$2:$P$217,TA!$A$40&PaMAe!$C54&PaMAe!$B$54,Dados!$M$2:$M$217),VLOOKUP(TA!$D$40&$C54&$B$54,Dados!$A$2:$P$217,13,0))","v":10708},{"$f":"IF(F54=0,\"\",IF(G50=\"\",F54,G50+F54))","v":96298},11193,{"$f":"IF(H54=\"\",\"\",I50+H54)","v":104257},null,{"$f":"IF(TA!$C$17=3,SUMIF(Dados!$B$2:$L$217,TA!$A$40&PaMAe!$C54&PaMAe!$B$54,Dados!$J$2:$J$217),VLOOKUP(TA!$D$40&$C54&$B$54,Dados!$A$2:$L$217,10,0))","v":1067},{"$f":"IF(K54=0,\"\",L50+K54)","v":43371},{"$f":"IF(TA!$C$17=3,SUMIF(Dados!$B$2:$P$217, TA!$A$40&PaMAe!$C54&PaMAe!$B$54,Dados!$N$2:$N$217), VLOOKUP(TA!$D$40&$C54&$B$54,Dados!$A$2:$P$217,14,0))","v":5657},{"$f":"IF(M54=0,\"\",IF(N50=\"\",M54,N50+M54))","v":62683},6724,{"$f":"IF(O54=\"\",\"\",P50+O54)","v":106054},null,{"$f":"IF(TA!$C$17=3,SUMIF(Dados!$B$2:$L$217,TA!$A$40&PaMAe!$C54&PaMAe!$B$54,Dados!$K$2:$K$217),VLOOKUP(TA!$D$40&$C54&$B$54,Dados!$A$2:$L$217,11,0))","v":191},{"$f":"IF(TA!$C$17=3,SUMIF(Dados!$B$2:$P$217, TA!$A$40&PaMAe!$C54&PaMAe!$B$54,Dados!$O$2:$O$217), VLOOKUP(TA!$D$40&$C54&$B$54,Dados!$A$2:$P$217,15,0))","v":2740},{"$f":"IF(AND(R54=0,S54=0),\"\",R54+S54)","v":2931},{"$f":"IF(T54=\"\",\"\",U50+T54)","v":48766},null,{"$f":"IF(TA!$C$17=3,SUMIF(Dados!$B$2:$L$217,TA!$A$40&PaMAe!$C54&PaMAe!$B$54,Dados!$L$2:$L$217),VLOOKUP(TA!$D$40&$C54&$B$54,Dados!$A$2:$L$217,12,0))","v":100231},-8.3099300187531422E-2,{"$f":"IF(TA!$C$17=3,SUMIF(Dados!$B$2:$P$217, TA!$A$40&PaMAe!$C54&PaMAe!$B$54,Dados!$P$2:$P$217), VLOOKUP(TA!$D$40&$C54&$B$54,Dados!$A$2:$P$217,16,0))","v":483805},2.9556346240604769E-2,{"$f":"IF(AND(W54=0,Y54=0),\"\",W54+Y54)","v":584036},8.2954814227829132E-3]
[null,null,"Juizados",{"$f":"IF(TA!$C$17=3,SUMIF(Dados!$B$2:$L$217,TA!$A$40&PaMAe!$C55&PaMAe!$B$54,Dados!$I$2:$I$217),VLOOKUP(TA!$D$40&$C55&$B$54,Dados!$A$2:$L$217,9,0))","v":3},{"$f":"IF(D55=0,\"\",E51+D55)","v":45},{"$f":"IF(TA!$C$17=3,SUMIF(Dados!$B$2:$P$217,TA!$A$40&PaMAe!$C55&PaMAe!$B$54,Dados!$M$2:$M$217),VLOOKUP(TA!$D$40&$C55&$B$54,Dados!$A$2:$P$217,13,0))","v":9355},{"$f":"IF(F55=0,\"\",IF(G51=\"\",F55,G51+F55))","v":136095},9358,{"$f":"IF(H55=\"\",\"\",I51+H55)","v":136140},null,{"$f":"IF(TA!$C$17=3,SUMIF(Dados!$B$2:$L$217,TA!$A$40&PaMAe!$C55&PaMAe!$B$54,Dados!$J$2:$J$217),VLOOKUP(TA!$D$40&$C55&$B$54,Dados!$A$2:$L$217,10,0))","v":319},{"$f":"IF(K55=0,\"\",L51+K55)","v":11486},{"$f":"IF(TA!$C$17=3,SUMIF(Dados!$B$2:$P$217, TA!$A$40&PaMAe!$C55&PaMAe!$B$54,Dados!$N$2:$N$217), VLOOKUP(TA!$D$40&$C55&$B$54,Dados!$A$2:$P$217,14,0))","v":8027},{"$f":"IF(M55=0,\"\",IF(N51=\"\",M55,N51+M55))","v":117776},8346,{"$f":"IF(O55=\"\",\"\",P51+O55)","v":129262},null,{"$f":"IF(TA!$C$17=3,SUMIF(Dados!$B$2:$L$217,TA!$A$40&PaMAe!$C55&PaMAe!$B$54,Dados!$K$2:$K$217),VLOOKUP(TA!$D$40&$C55&$B$54,Dados!$A$2:$L$217,11,0))","v":153},{"$f":"IF(TA!$C$17=3,SUMIF(Dados!$B$2:$P$217, TA!$A$40&PaMAe!$C55&PaMAe!$B$54,Dados!$O$2:$O$217), VLOOKUP(TA!$D$40&$C55&$B$54,Dados!$A$2:$P$217,15,0))","v":567},{"$f":"IF(AND(R55=0,S55=0),\"\",R55+S55)","v":720},{"$f":"IF(T55=\"\",\"\",U51+T55)","v":12351},null,{"$f":"IF(TA!$C$17=3,SUMIF(Dados!$B$2:$L$217,TA!$A$40&PaMAe!$C55&PaMAe!$B$54,Dados!$L$2:$L$217),VLOOKUP(TA!$D$40&$C55&$B$54,Dados!$A$2:$L$217,12,0))","v":15130},-9.2653673163418326E-2,{"$f":"IF(TA!$C$17=3,SUMIF(Dados!$B$2:$P$217, TA!$A$40&PaMAe!$C55&PaMAe!$B$54,Dados!$P$2:$P$217), VLOOKUP(TA!$D$40&$C55&$B$54,Dados!$A$2:$P$217,16,0))","v":128057},2.054527052335442E-2,{"$f":"IF(AND(W55=0,Y55=0),\"\",W55+Y55)","v":143187},7.2667670273083296E-3]
[null,null,"Turmas Recursais",{"$f":"IF(TA!$C$17=3,SUMIF(Dados!$B$2:$L$217,TA!$A$40&PaMAe!$C56&PaMAe!$B$54,Dados!$I$2:$I$217),VLOOKUP(TA!$D$40&$C56&$B$54,Dados!$A$2:$L$217,9,0))","v":63},{"$f":"IF(D56=0,\"\",E52+D56)","v":3357},{"$f":"IF(TA!$C$17=3,SUMIF(Dados!$B$2:$P$217,TA!$A$40&PaMAe!$C56&PaMAe!$B$54,Dados!$M$2:$M$217),VLOOKUP(TA!$D$40&$C56&$B$54,Dados!$A$2:$P$217,13,0))","v":2057},{"$f":"IF(F56=0,\"\",IF(G52=\"\",F56,G52+F56))","v":33271},2120,{"$f":"IF(H56=\"\",\"\",I52+H56)","v":36628},null,{"$f":"IF(TA!$C$17=3,SUMIF(Dados!$B$2:$L$217,TA!$A$40&PaMAe!$C56&PaMAe!$B$54,Dados!$J$2:$J$217),VLOOKUP(TA!$D$40&$C56&$B$54,Dados!$A$2:$L$217,10,0))","v":533},{"$f":"IF(K56=0,\"\",L52+K56)","v":29511},{"$f":"IF(TA!$C$17=3,SUMIF(Dados!$B$2:$P$217, TA!$A$40&PaMAe!$C56&PaMAe!$B$54,Dados!$N$2:$N$217), VLOOKUP(TA!$D$40&$C56&$B$54,Dados!$A$2:$P$217,14,0))","v":2816},{"$f":"IF(M56=0,\"\",IF(N52=\"\",M56,N52+M56))","v":25868},3349,{"$f":"IF(O56=\"\",\"\",P52+O56)","v":55379},null,{"$f":"IF(TA!$C$17=3,SUMIF(Dados!$B$2:$L$217,TA!$A$40&PaMAe!$C56&PaMAe!$B$54,Dados!$K$2:$K$217),VLOOKUP(TA!$D$40&$C56&$B$54,Dados!$A$2:$L$217,11,0))","v":0},{"$f":"IF(TA!$C$17=3,SUMIF(Dados!$B$2:$P$217, TA!$A$40&PaMAe!$C56&PaMAe!$B$54,Dados!$O$2:$O$217), VLOOKUP(TA!$D$40&$C56&$B$54,Dados!$A$2:$P$217,15,0))","v":0},{"$f":"IF(AND(R56=0,S56=0),\"\",R56+S56)","v":""},{"$f":"IF(T56=\"\",\"\",U52+T56)","v":""},null,{"$f":"IF(TA!$C$17=3,SUMIF(Dados!$B$2:$L$217,TA!$A$40&PaMAe!$C56&PaMAe!$B$54,Dados!$L$2:$L$217),VLOOKUP(TA!$D$40&$C56&$B$54,Dados!$A$2:$L$217,12,0))","v":24048},-1.9929086685413822E-2,{"$f":"IF(TA!$C$17=3,SUMIF(Dados!$B$2:$P$217, TA!$A$40&PaMAe!$C56&PaMAe!$B$54,Dados!$P$2:$P$217), VLOOKUP(TA!$D$40&$C56&$B$54,Dados!$A$2:$P$217,16,0))","v":19969},1.6027271802177667E-2,{"$f":"IF(AND(W56=0,Y56=0),\"\",W56+Y56)","v":44017},-3.9374533276006485E-3]
[null,"Total",null,{"$f":"SUM(D54:D56)","v":551},{"$f":"IF(D57=0,\"\",SUM(E54:E56))","v":11361},{"$f":"SUM(F54:F56)","v":22120},{"$f":"IF(F57=0,\"\",SUM(G54:G56))","v":265664},22671,{"$f":"IF(H57=\"\",\"\",SUM(I54:I56))","v":277025},null,{"$f":"SUM(K54:K56)","v":1919},{"$f":"IF(K57=0,\"\",SUM(L54:L56))","v":84368},{"$f":"SUM(M54:M56)","v":16500},{"$f":"IF(M57=0,\"\",SUM(N54:N56))","v":206327},18419,{"$f":"IF(O57=\"\",\"\",SUM(P54:P56))","v":290695},null,{"$f":"SUM(R54:R56)","v":344},{"$f":"SUM(S54:S56)","v":3307},{"$f":"IF(R57=0,\"\",R57+S57)","v":3651},{"$f":"IF(T57=\"\",\"\",SUM(U54:U56))","v":61117},null,{"$f":"SUM(W54:W56)","v":139409},-7.3860503431278146E-2,{"$f":"SUM(Y54:Y56)","v":631831},2.7285630900952595E-2,{"$f":"IF(W57=0,\"\",W57+Y57)","v":771240},7.3983510454873613E-3]
[]
[null,"Obs. 1: Os valores poderão ser alterados, em função de modificações na base de dados, por parte do usuário.",null,null,null,null,null,null,null,null,null,"Obs. 2: Os Processos Julgados nas Varas e Juizados incluem os Embargos.",null,null,null,null,null,null,null,null,null,null,"Obs. 3: Na Tramitação \"Real\", estão incluídos os Processos suspensos e os que aguardam julgamento de recurso."]
[]
[null,"_ Desde o dia 23 de Fevereiro de 2018, o NOVO sistema processual \"Eproc\" está em funcionamento na Justiça Federal da 2ª Região."]

{"sheet":"GTvMAe","index":16,"n_rows":1,"n_cols":11,"rows_kept":1,"cut":false,"hidden":true,"merged":[[0,0,0,6],[0,10,0,11],[0,14,0,15],[2,1,12,5],[2,7,12,11],[2,13,12,17],[38,1,48,5],[38,7,48,11],[38,13,48,17],[14,1,24,5],[14,7,24,11],[14,13,24,17],[26,1,36,5],[26,7,36,11],[26,13,36,17]]}
["TRAMITAÇÃO de Processos na Seção Judiciária:  ",null,null,null,null,null,null,null,null,null,"no Ano de:  "]

{"sheet":"GDaMAe","index":17,"n_rows":1,"n_cols":11,"rows_kept":1,"cut":false,"hidden":true,"merged":[[0,0,0,6],[0,10,0,11],[0,14,0,15],[2,1,12,5],[2,7,12,11],[2,13,12,17],[38,1,48,5],[38,7,48,11],[38,13,48,17],[14,1,24,5],[14,7,24,11],[14,13,24,17],[26,1,36,5],[26,7,36,11],[26,13,36,17]]}
["Total de Processos DISTRIBUÍDOS na Seção Judiciária:  ",null,null,null,null,null,null,null,null,null,"no Ano de:  "]

{"sheet":"GJaMAe","index":18,"n_rows":1,"n_cols":11,"rows_kept":1,"cut":false,"hidden":true,"merged":[[38,13,48,17],[0,0,0,6],[0,10,0,11],[0,14,0,15],[2,1,12,5],[2,7,12,11],[2,13,12,17],[14,1,24,5],[14,7,24,11],[14,13,24,17],[26,1,36,5],[26,7,36,11],[26,13,36,17],[38,1,48,5],[38,7,48,11]]}
["Total de Processos JULGADOS na Seção Judiciária:  ",null,null,null,null,null,null,null,null,null,"no Ano de:  "]

{"sheet":"TA","index":19,"n_rows":94,"n_cols":13,"rows_kept":94,"cut":false,"hidden":true,"merged":[[15,9,15,10],[0,6,0,7],[15,5,15,6],[15,7,15,8],[42,1,42,2]]}
["Anos","AnosAe","Meses","Sites","Localidades","Meses Abrev","IPC Anos",null,null,null,null,null,1]
[2006,2018,"Janeiro","SJRJ","Varas","Jan","Mês Public","Ano Public",null,null,null,null,{"$f":"M1+1","v":2}]
[2007,2019,"Fevereiro","SJES","Juizados","Fev",12,2019,null,null,null,null,{"$f":"M2+1","v":3}]
[2008,null,"Março","SJRJ e SJES","Turmas Recursais","Mar","nu","TD",null,null,null,null,4]
[2009,null,"Abril",null,null,"Abr",null,null,null,null,null,null,5]
[2010,null,"Maio",null,null,"Mai",null,null,null,null,null,null,6]
[2011,null,"Junho",null,null,"Jun","A",null,null,"e",null,null,7]
[2012,null,"Julho",null,null,"Jul","TA!$A$17","TA!$C$17",null,"TA!$A$39",null,null,8]
[2013,null,"Agosto",null,null,"Ago","TA!$A$18","TA!$C$18","TA!$D$18","TA!$A$40","TA!$D$40",null,9]
[2014,null,"Setembro",null,null,"Set","TA!$A$19","TA!$C$19",null,"TA!$A$41",null,null,10]
[2015,null,"Outubro",null,null,"Out","TA!$A$20","TA!$C$20","TA!$D$20","TA!$A$42","TA!$D$42",null,11]
[2016,null,"Novembro",null,null,"Nov",null,null,null,null,null,null,12]
[2017,null,"Dezembro",null,null,"Dez",null,null,null,null,null,null,13]
[2018,null,null,null,null,null,null,null,null,null,null,null,14]
[2019,null,null,null,null,null,null,null,null,null,null,null,15]
["A",null,null,null,null,"T",null,"D",null,"J",null,null,16]
[14,null,1,null,null,"Dezembro","Novembro","Dezembro","Novembro","Dezembro","Novembro",null,17]
[{"$f":"INDEX(ListaAnos,A17)","v":2019},null,{"$f":"INDEX(ListaSites,C17)","v":"SJRJ"},{"$f":"A18&C18","v":"2019SJRJ"},"Varas",{"$f":"IF(TA!$C$17=3,SUMIF(Dados!$B$2:$L$1081,TA!$A$20&$E$2&\"Dezembro\",Dados!$L$2:$L$1081),VLOOKUP($D$20&$E$2&\"Dezembro\",Dados!$A$2:$L$1081,12,0))","v":530063},{"$f":"IF(TA!$C$17=3,SUMIF(Dados!$B$2:$L$1081,TA!$A$20&$E$2&\"Novembro\",Dados!$L$2:$L$1081),VLOOKUP($D$20&$E$2&\"Novembro\",Dados!$A$2:$L$1081,12,0))","v":558734},{"$f":"IF(TA!$C$17=3,SUMIF(Dados!$B$2:$L$1081,TA!$A$20&$E$2&\"Dezembro\",Dados!$I$2:$I$1081),VLOOKUP($D$20&$E$2&\"Dezembro\",Dados!$A$2:$L$1081,9,0))","v":620},{"$f":"IF(TA!$C$17=3,SUMIF(Dados!$B$2:$L$1081,TA!$A$20&$E$2&\"Novembro\",Dados!$I$2:$I$1081),VLOOKUP($D$20&$E$2&\"Novembro\",Dados!$A$2:$L$1081,9,0))","v":809},{"$f":"IF(TA!$C$17=3,SUMIF(Dados!$B$2:$L$1081,TA!$A$20&$E$2&\"Dezembro\",Dados!$J$2:$J$1081),VLOOKUP($D$20&$E$2&\"Dezembro\",Dados!$A$2:$L$1081,10,0))","v":5333},{"$f":"IF(TA!$C$17=3,SUMIF(Dados!$B$2:$L$1081,TA!$A$20&$E$2&\"Novembro\",Dados!$J$2:$J$1081),VLOOKUP($D$20&$E$2&\"Novembro\",Dados!$A$2:$L$1081,10,0))","v":7058},null,18]
[{"$f":"A17-1","v":13},null,{"$f":"C17","v":1},null,"Juizados",{"$f":"IF(TA!$C$17=3,SUMIF(Dados!$B$2:$L$1081,TA!$A$20&$E$3&\"Dezembro\",Dados!$L$2:$L$1081),VLOOKUP($D$20&$E$3&\"Dezembro\",Dados!$A$2:$L$1081,12,0))","v":36713},{"$f":"IF(TA!$C$17=3,SUMIF(Dados!$B$2:$L$1081,TA!$A$20&$E$3&\"Novembro\",Dados!$L$2:$L$1081),VLOOKUP($D$20&$E$3&\"Novembro\",Dados!$A$2:$L$1081,12,0))","v":41630},{"$f":"IF(TA!$C$17=3,SUMIF(Dados!$B$2:$L$1081,TA!$A$20&$E$3&\"Dezembro\",Dados!$I$2:$I$1081),VLOOKUP($D$20&$E$3&\"Dezembro\",Dados!$A$2:$L$1081,9,0))","v":2},{"$f":"IF(TA!$C$17=3,SUMIF(Dados!$B$2:$L$1081,TA!$A$20&$E$3&\"Novembro\",Dados!$I$2:$I$1081),VLOOKUP($D$20&$E$3&\"Novembro\",Dados!$A$2:$L$1081,9,0))","v":1},{"$f":"IF(TA!$C$17=3,SUMIF(Dados!$B$2:$L$1081,TA!$A$20&$E$3&\"Dezembro\",Dados!$J$2:$J$1081),VLOOKUP($D$20&$E$3&\"Dezembro\",Dados!$A$2:$L$1081,10,0))","v":2556},{"$f":"IF(TA!$C$17=3,SUMIF(Dados!$B$2:$L$1081,TA!$A$20&$E$3&\"Novembro\",Dados!$J$2:$J$1081),VLOOKUP($D$20&$E$3&\"Novembro\",Dados!$A$2:$L$1081,10,0))","v":4212},null,19]
[{"$f":"IF(A19=0,2005,IF(A18>2018,A18-1,INDEX(ListaAnos,A19)))","v":2018},null,{"$f":"IF(C19=3,\"\",INDEX(ListaSites,C19))","v":"SJRJ"},{"$f":"A20&C20","v":"2018SJRJ"},"Turmas Recursais",{"$f":"IF(TA!$C$17=3,SUMIF(Dados!$B$2:$L$1081,TA!$A$20&$E$4&\"Dezembro\",Dados!$L$2:$L$1081),VLOOKUP($D$20&$E$4&\"Dezembro\",Dados!$A$2:$L$1081,12,0))","v":50962},{"$f":"IF(TA!$C$17=3,SUMIF(Dados!$B$2:$L$1081,TA!$A$20&$E$4&\"Novembro\",Dados!$L$2:$L$1081),VLOOKUP($D$20&$E$4&\"Novembro\",Dados!$A$2:$L$1081,12,0))","v":53258},{"$f":"IF(TA!$C$17=3,SUMIF(Dados!$B$2:$L$1081,TA!$A$20&$E$4&\"Dezembro\",Dados!$I$2:$I$1081),VLOOKUP($D$20&$E$4&\"Dezembro\",Dados!$A$2:$L$1081,9,0))","v":70},{"$f":"IF(TA!$C$17=3,SUMIF(Dados!$B$2:$L$1081,TA!$A$20&$E$4&\"Novembro\",Dados!$I$2:$I$1081),VLOOKUP($D$20&$E$4&\"Novembro\",Dados!$A$2:$L$1081,9,0))","v":992},{"$f":"IF(TA!$C$17=3,SUMIF(Dados!$B$2:$L$1081,TA!$A$20&$E$4&\"Dezembro\",Dados!$J$2:$J$1081),VLOOKUP($D$20&$E$4&\"Dezembro\",Dados!$A$2:$L$1081,10,0))","v":1991},{"$f":"IF(TA!$C$17=3,SUMIF(Dados!$B$2:$L$1081,TA!$A$20&$E$4&\"Novembro\",Dados!$J$2:$J$1081),VLOOKUP($D$20&$E$4&\"Novembro\",Dados!$A$2:$L$1081,10,0))","v":2711},null,20]
[null,null,null,null,"Total",{"$f":"SUM(F18:F20)","v":617738},653622,692,1802,9880,13981,null,21]
["Aanual",null,null,null,"Acomp",null,null,null,"Ae",null,null,null,22]
[{"$f":"$C$18 & \" - Tramitação nas VARAS\"","v":"SJRJ - Tramitação nas VARAS"},null,null,null,{"$f":"$C$18 & \" - Comparativo da TRAMITAÇÃO\"","v":"SJRJ - Comparativo da TRAMITAÇÃO"},null,null,null,{"$f":"$C$18 & \" - Tramitação nas VARAS \" & $D$46","v":"SJRJ - Tramitação nas VARAS (Eproc)"},null,null,null,23]
[{"$f":"$C$18 & \" - Tramitação nos JUIZADOS ESPECIAIS\"","v":"SJRJ - Tramitação nos JUIZADOS ESPECIAIS"},null,null,null,{"$f":"$C$18 & \" - Comparativo de DISTRIBUÍDOS\"","v":"SJRJ - Comparativo de DISTRIBUÍDOS"},null,null,null,{"$f":"$C$18 & \" - Tramitação nos JUIZADOS ESPECIAIS \" & $D$46","v":"SJRJ - Tramitação nos JUIZADOS ESPECIAIS (Eproc)"},null,null,null,24]
[{"$f":"$C$18 & \" - Tramitação nas TURMAS RECURSAIS\"","v":"SJRJ - Tramitação nas TURMAS RECURSAIS"},null,null,null,{"$f":"$C$18 & \" - Comparativo de JULGADOS\"","v":"SJRJ - Comparativo de JULGADOS"},null,null,null,{"$f":"$C$18 & \" - Tramitação nas TURMAS RECURSAIS \" & $D$46","v":"SJRJ - Tramitação nas TURMAS RECURSAIS (Eproc)"},null,null,null,25]
[{"$f":"$C$18 & \" - Tramitação TOTAL no 1º Grau\"","v":"SJRJ - Tramitação TOTAL no 1º Grau"},null,null,null,null,null,null,null,{"$f":"$C$18 & \" - Tramitação TOTAL no 1º Grau \" & $D$46","v":"SJRJ - Tramitação TOTAL no 1º Grau (Eproc)"},null,null,null,26]
[null,null,null,null,null,null,null,null,null,null,null,null,27]
[{"$f":"$C$18 & \" - Distribuídos nas VARAS\"","v":"SJRJ - Distribuídos nas VARAS"},null,null,null,null,null,null,null,{"$f":"$C$18 & \" - Distribuídos nas VARAS \" & $D$46","v":"SJRJ - Distribuídos nas VARAS (Eproc)"},null,null,null,28]
[{"$f":"$C$18 & \" - Distribuídos nos JUIZADOS ESPECIAIS\"","v":"SJRJ - Distribuídos nos JUIZADOS ESPECIAIS"},null,null,null,null,null,null,null,{"$f":"$C$18 & \" - Distribuídos nos JUIZADOS ESPECIAIS \" & $D$46","v":"SJRJ - Distribuídos nos JUIZADOS ESPECIAIS (Eproc)"},null,null,null,29]
[{"$f":"$C$18 & \" - Distribuídos nas TURMAS RECURSAIS\"","v":"SJRJ - Distribuídos nas TURMAS RECURSAIS"},null,null,null,null,null,null,null,{"$f":"$C$18 & \" - Distribuídos nas TURMAS RECURSAIS \" & $D$46","v":"SJRJ - Distribuídos nas TURMAS RECURSAIS (Eproc)"},null,null,null,30]
[{"$f":"$C$18 & \" - TOTAL de Distribuídos no 1º Grau\"","v":"SJRJ - TOTAL de Distribuídos no 1º Grau"},null,null,null,null,null,null,null,{"$f":"$C$18 & \" - TOTAL de Distribuídos no 1º Grau \" & $D$46","v":"SJRJ - TOTAL de Distribuídos no 1º Grau (Eproc)"},null,null,null,31]
[null,null,null,null,null,null,null,null,null,null,null,null,32]
[{"$f":"$C$18 & \" - Julgados nas VARAS\"","v":"SJRJ - Julgados nas VARAS"},null,null,null,null,null,null,null,{"$f":"$C$18 & \" - Julgados nas VARAS \" & $D$46","v":"SJRJ - Julgados nas VARAS (Eproc)"},null,null,null,33]
[{"$f":"$C$18 & \" - Julgados nos JUIZADOS ESPECIAIS\"","v":"SJRJ - Julgados nos JUIZADOS ESPECIAIS"},null,null,null,null,null,null,null,{"$f":"$C$18 & \" - Julgados nos JUIZADOS ESPECIAIS \" & $D$46","v":"SJRJ - Julgados nos JUIZADOS ESPECIAIS (Eproc)"},null,null,null,34]
[{"$f":"$C$18 & \" - Julgados nas TURMAS RECURSAIS\"","v":"SJRJ - Julgados nas TURMAS RECURSAIS"},null,null,null,null,null,null,null,{"$f":"$C$18 & \" - Julgados nas TURMAS RECURSAIS \" & $D$46","v":"SJRJ - Julgados nas TURMAS RECURSAIS (Eproc)"},null,null,null,35]
[{"$f":"$C$18 & \" - TOTAL de Julgados no 1º Grau\"","v":"SJRJ - TOTAL de Julgados no 1º Grau"},null,null,null,null,null,null,null,{"$f":"$C$18 & \" - TOTAL de Julgados no 1º Grau \" & $D$46","v":"SJRJ - TOTAL de Julgados no 1º Grau (Eproc)"},null,null,null,36]
[null,null,null,null,null,null,null,null,{"$f":"\"      Mapa Geral Judicial do 1º Grau \" & $D$46","v":"      Mapa Geral Judicial do 1º Grau (Eproc)"},null,null,null,37]
["Ae",null,null,null,null,null,null,null,null,null,null,null,38]
[2,null,null,null,null,"Dezembro","Novembro","Dezembro","Novembro","Dezembro","Novembro","%T",39]
[{"$f":"INDEX(ListaAnosAe,A39)","v":2019},null,null,{"$f":"A40&C18","v":"2019SJRJ"},"Varas",{"$f":"IF(TA!$C$17=3,SUMIF(Dados!$B$2:$L$217,TA!$A$42&$E$2&\"Dezembro\",Dados!$L$2:$L$217),VLOOKUP($D$42&$E$2&\"Dezembro\",Dados!$A$2:$L$217,12,0))","v":530063},{"$f":"IF(TA!$C$17=3,SUMIF(Dados!$B$2:$L$217,TA!$A$42&$E$2&\"Novembro\",Dados!$L$2:$L$217),VLOOKUP($D$42&$E$2&\"Novembro\",Dados!$A$2:$L$217,12,0))","v":558734},{"$f":"IF(TA!$C$17=3,SUMIF(Dados!$B$2:$L$217,TA!$A$42&$E$2&\"Dezembro\",Dados!$I$2:$I$217),VLOOKUP($D$42&$E$2&\"Dezembro\",Dados!$A$2:$L$217,9,0))","v":620},{"$f":"IF(TA!$C$17=3,SUMIF(Dados!$B$2:$L$217,TA!$A$42&$E$2&\"Novembro\",Dados!$I$2:$I$217),VLOOKUP($D$42&$E$2&\"Novembro\",Dados!$A$2:$L$217,9,0))","v":809},{"$f":"IF(TA!$C$17=3,SUMIF(Dados!$B$2:$L$217,TA!$A$42&$E$2&\"Dezembro\",Dados!$J$2:$J$217),VLOOKUP($D$42&$E$2&\"Dezembro\",Dados!$A$2:$L$217,10,0))","v":5333},{"$f":"IF(TA!$C$17=3,SUMIF(Dados!$B$2:$L$217,TA!$A$42&$E$2&\"Novembro\",Dados!$J$2:$J$217),VLOOKUP($D$42&$E$2&\"Novembro\",Dados!$A$2:$L$217,10,0))","v":7058},{"$f":"(F40/G40)-1","v":-5.1314221078366473E-2},40]
[{"$f":"A39-1","v":1},null,null,null,"Juizados",{"$f":"IF(TA!$C$17=3,SUMIF(Dados!$B$2:$L$217,TA!$A$42&$E$3&\"Dezembro\",Dados!$L$2:$L$217),VLOOKUP($D$42&$E$3&\"Dezembro\",Dados!$A$2:$L$217,12,0))","v":36713},{"$f":"IF(TA!$C$17=3,SUMIF(Dados!$B$2:$L$217,TA!$A$42&$E$3&\"Novembro\",Dados!$L$2:$L$217),VLOOKUP($D$42&$E$3&\"Novembro\",Dados!$A$2:$L$217,12,0))","v":41630},{"$f":"IF(TA!$C$17=3,SUMIF(Dados!$B$2:$L$217,TA!$A$42&$E$3&\"Dezembro\",Dados!$I$2:$I$217),VLOOKUP($D$42&$E$3&\"Dezembro\",Dados!$A$2:$L$217,9,0))","v":2},{"$f":"IF(TA!$C$17=3,SUMIF(Dados!$B$2:$L$217,TA!$A$42&$E$3&\"Novembro\",Dados!$I$2:$I$217),VLOOKUP($D$42&$E$3&\"Novembro\",Dados!$A$2:$L$217,9,0))","v":1},{"$f":"IF(TA!$C$17=3,SUMIF(Dados!$B$2:$L$217,TA!$A$42&$E$3&\"Dezembro\",Dados!$J$2:$J$217),VLOOKUP($D$42&$E$3&\"Dezembro\",Dados!$A$2:$L$217,10,0))","v":2556},{"$f":"IF(TA!$C$17=3,SUMIF(Dados!$B$2:$L$217,TA!$A$42&$E$3&\"Novembro\",Dados!$J$2:$J$217),VLOOKUP($D$42&$E$3&\"Novembro\",Dados!$A$2:$L$217,10,0))","v":4212},{"$f":"(F41/G41)-1","v":-0.11811193850588519},41]
[{"$f":"IF(A41=0,2017,INDEX(ListaAnosAe,A41))","v":2018},null,null,{"$f":"A42&C20","v":"2018SJRJ"},"Turmas Recursais",{"$f":"IF(TA!$C$17=3,SUMIF(Dados!$B$2:$L$217,TA!$A$42&$E$4&\"Dezembro\",Dados!$L$2:$L$217),VLOOKUP($D$42&$E$4&\"Dezembro\",Dados!$A$2:$L$217,12,0))","v":50962},{"$f":"IF(TA!$C$17=3,SUMIF(Dados!$B$2:$L$217,TA!$A$42&$E$4&\"Novembro\",Dados!$L$2:$L$217),VLOOKUP($D$42&$E$4&\"Novembro\",Dados!$A$2:$L$217,12,0))","v":53258},{"$f":"IF(TA!$C$17=3,SUMIF(Dados!$B$2:$L$217,TA!$A$42&$E$4&\"Dezembro\",Dados!$I$2:$I$217),VLOOKUP($D$42&$E$4&\"Dezembro\",Dados!$A$2:$L$217,9,0))","v":70},{"$f":"IF(TA!$C$17=3,SUMIF(Dados!$B$2:$L$217,TA!$A$42&$E$4&\"Novembro\",Dados!$I$2:$I$217),VLOOKUP($D$42&$E$4&\"Novembro\",Dados!$A$2:$L$217,9,0))","v":992},{"$f":"IF(TA!$C$17=3,SUMIF(Dados!$B$2:$L$217,TA!$A$42&$E$4&\"Dezembro\",Dados!$J$2:$J$217),VLOOKUP($D$42&$E$4&\"Dezembro\",Dados!$A$2:$L$217,10,0))","v":1991},{"$f":"IF(TA!$C$17=3,SUMIF(Dados!$B$2:$L$217,TA!$A$42&$E$4&\"Novembro\",Dados!$J$2:$J$217),VLOOKUP($D$42&$E$4&\"Novembro\",Dados!$A$2:$L$217,10,0))","v":2711},{"$f":"(F42/G42)-1","v":-4.3110894137969868E-2},42]
[null,"only when PaM=2020 (2020 only Eproc)",null,"(Apolo)","Total",{"$f":"SUM(F40:F42)","v":617738},653622,692,1802,9880,13981,{"$f":"(F43/G43)-1","v":-5.4900232856299191E-2},43]
[null,"only2019EDez","for use to 2019Ae",null,null,null,null,null,null,null,null,null,44]
[null,{"$f":"IF(TA!$C$17=3,SUMIF(Dados!$B$2:$P$145,\"2019\"&$E$2&\"Dezembro\",Dados!$P$2:$P$145),VLOOKUP(\"2019\"&$C$18&$E$2&\"Dezembro\",Dados!$A$2:$P$145,16,0))","v":483805},{"$f":"F18+B45","v":1013868},"Ano PaM (?)",null,"Dezembro","Novembro","Dezembro","Novembro","Dezembro","Novembro","%T",45]
[null,{"$f":"IF(TA!$C$17=3,SUMIF(Dados!$B$2:$P$145,\"2019\"&$E$3&\"Dezembro\",Dados!$P$2:$P$145),VLOOKUP(\"2019\"&$C$18&$E$3&\"Dezembro\",Dados!$A$2:$P$145,16,0))","v":128057},{"$f":"F19+B46","v":164770},{"$f":"IF($A$18<2018,$D$43,$D$49)","v":"(Eproc)"},"Varas",{"$f":"IF(TA!$C$17=3,SUMIF(Dados!$B$2:$P$217,TA!$A$42&$E$2&\"Dezembro\",Dados!$P$2:$P$217),VLOOKUP($D$42&$E$2&\"Dezembro\",Dados!$A$2:$P$217,16,0))","v":61696},{"$f":"IF(TA!$C$17=3,SUMIF(Dados!$B$2:$P$217,TA!$A$42&$E$2&\"Novembro\",Dados!$P$2:$P$217),VLOOKUP($D$42&$E$2&\"Novembro\",Dados!$A$2:$P$217,16,0))","v":29457},{"$f":"IF(TA!$C$17=3,SUMIF(Dados!$B$2:$P$217,TA!$A$42&$E$2&\"Dezembro\",Dados!$M$2:$M$217),VLOOKUP($D$42&$E$2&\"Dezembro\",Dados!$A$2:$P$217,13,0))","v":9097},{"$f":"IF(TA!$C$17=3,SUMIF(Dados!$B$2:$P$217,TA!$A$42&$E$2&\"Novembro\",Dados!$M$2:$M$217),VLOOKUP($D$42&$E$2&\"Novembro\",Dados!$A$2:$P$217,13,0))","v":5834},{"$f":"IF(TA!$C$17=3,SUMIF(Dados!$B$2:$P$217,TA!$A$42&$E$2&\"Dezembro\",Dados!$N$2:$N$217),VLOOKUP($D$42&$E$2&\"Dezembro\",Dados!$A$2:$P$217,14,0))","v":840},{"$f":"IF(TA!$C$17=3,SUMIF(Dados!$B$2:$P$217,TA!$A$42&$E$2&\"Novembro\",Dados!$N$2:$N$217),VLOOKUP($D$42&$E$2&\"Novembro\",Dados!$A$2:$P$217,14,0))","v":744},{"$f":"(F46/G46)-1","v":1.0944427470550293},46]
[null,{"$f":"IF(TA!$C$17=3,SUMIF(Dados!$B$2:$P$145,\"2019\"&$E$4&\"Dezembro\",Dados!$P$2:$P$145),VLOOKUP(\"2019\"&$C$18&$E$4&\"Dezembro\",Dados!$A$2:$P$145,16,0))","v":19969},{"$f":"F20+B47","v":70931},{"$f":"A42&C20","v":"2018SJRJ"},"Juizados",{"$f":"IF(TA!$C$17=3,SUMIF(Dados!$B$2:$P$217,TA!$A$42&$E$3&\"Dezembro\",Dados!$P$2:$P$217),VLOOKUP($D$42&$E$3&\"Dezembro\",Dados!$A$2:$P$217,16,0))","v":80327},{"$f":"IF(TA!$C$17=3,SUMIF(Dados!$B$2:$P$217,TA!$A$42&$E$3&\"Novembro\",Dados!$P$2:$P$217),VLOOKUP($D$42&$E$3&\"Novembro\",Dados!$A$2:$P$217,16,0))","v":73534},{"$f":"IF(TA!$C$17=3,SUMIF(Dados!$B$2:$P$217,TA!$A$42&$E$3&\"Dezembro\",Dados!$M$2:$M$217),VLOOKUP($D$42&$E$3&\"Dezembro\",Dados!$A$2:$P$217,13,0))","v":8372},{"$f":"IF(TA!$C$17=3,SUMIF(Dados!$B$2:$P$217,TA!$A$42&$E$3&\"Novembro\",Dados!$M$2:$M$217),VLOOKUP($D$42&$E$3&\"Novembro\",Dados!$A$2:$P$217,13,0))","v":8901},{"$f":"IF(TA!$C$17=3,SUMIF(Dados!$B$2:$P$217,TA!$A$42&$E$3&\"Dezembro\",Dados!$N$2:$N$217),VLOOKUP($D$42&$E$3&\"Dezembro\",Dados!$A$2:$P$217,14,0))","v":5169},{"$f":"IF(TA!$C$17=3,SUMIF(Dados!$B$2:$P$217,TA!$A$42&$E$3&\"Novembro\",Dados!$N$2:$N$217),VLOOKUP($D$42&$E$3&\"Novembro\",Dados!$A$2:$P$217,14,0))","v":5680},{"$f":"(F47/G47)-1","v":9.237903554818172E-2},47]
[null,{"$f":"SUM(B45:B47)","v":631831},{"$f":"F21+B48","v":1249569},null,"Turmas Recursais",{"$f":"IF(TA!$C$17=3,SUMIF(Dados!$B$2:$P$217,TA!$A$42&$E$4&\"Dezembro\",Dados!$P$2:$P$217),VLOOKUP($D$42&$E$4&\"Dezembro\",Dados!$A$2:$P$217,16,0))","v":5497},{"$f":"IF(TA!$C$17=3,SUMIF(Dados!$B$2:$P$217,TA!$A$42&$E$4&\"Novembro\",Dados!$P$2:$P$217),VLOOKUP($D$42&$E$4&\"Novembro\",Dados!$A$2:$P$217,16,0))","v":4249},{"$f":"IF(TA!$C$17=3,SUMIF(Dados!$B$2:$P$217,TA!$A$42&$E$4&\"Dezembro\",Dados!$M$2:$M$217),VLOOKUP($D$42&$E$4&\"Dezembro\",Dados!$A$2:$P$217,13,0))","v":1424},{"$f":"IF(TA!$C$17=3,SUMIF(Dados!$B$2:$P$217,TA!$A$42&$E$4&\"Novembro\",Dados!$M$2:$M$217),VLOOKUP($D$42&$E$4&\"Novembro\",Dados!$A$2:$P$217,13,0))","v":1895},{"$f":"IF(TA!$C$17=3,SUMIF(Dados!$B$2:$P$217,TA!$A$42&$E$4&\"Dezembro\",Dados!$N$2:$N$217),VLOOKUP($D$42&$E$4&\"Dezembro\",Dados!$A$2:$P$217,14,0))","v":456},{"$f":"IF(TA!$C$17=3,SUMIF(Dados!$B$2:$P$217,TA!$A$42&$E$4&\"Novembro\",Dados!$N$2:$N$217),VLOOKUP($D$42&$E$4&\"Novembro\",Dados!$A$2:$P$217,14,0))","v":387},{"$f":"(F48/G48)-1","v":0.29371616851023763},48]
[null,null," (?) 2018 + 2049 ","(Eproc)","Total",{"$f":"SUM(F46:F48)","v":147520},{"$f":"SUM(G46:G48)","v":107240},18893,16630,{"$f":"SUM(J46:J48)","v":6465},{"$f":"SUM(K46:K48)","v":6811},{"$f":"(F49/G49)-1","v":0.37560611712047742},49]
["A1","B2","C3","D4","E5","F6","G7","H8","I9","J10","K11","L12",50]
[{"$f":"$C$18 & \" - Tramitação nas VARAS (Apolo)\"","v":"SJRJ - Tramitação nas VARAS (Apolo)"},null,null,null,{"$f":"$C$18 & \" - Tramitação nas VARAS (Eproc)\"","v":"SJRJ - Tramitação nas VARAS (Eproc)"},null,null,null,{"$f":"$C$18 & \" - Tramitação nas VARAS (TOTAL)\"","v":"SJRJ - Tramitação nas VARAS (TOTAL)"},null,null,null,51]
[{"$f":"$C$18 & \" - Tramitação nos JUIZADOS ESPECIAIS (Apolo)\"","v":"SJRJ - Tramitação nos JUIZADOS ESPECIAIS (Apolo)"},null,null,null,{"$f":"$C$18 & \" - Tramitação nos JUIZADOS ESPECIAIS (Eproc)\"","v":"SJRJ - Tramitação nos JUIZADOS ESPECIAIS (Eproc)"},null,null,null,{"$f":"$C$18 & \" - Tramitação nos JUIZADOS ESPECIAIS (TOTAL)\"","v":"SJRJ - Tramitação nos JUIZADOS ESPECIAIS (TOTAL)"},null,null,null,52]
[{"$f":"$C$18 & \" - Tramitação nas TURMAS RECURSAIS (Apolo)\"","v":"SJRJ - Tramitação nas TURMAS RECURSAIS (Apolo)"},null,null,null,{"$f":"$C$18 & \" - Tramitação nas TURMAS RECURSAIS (Eproc)\"","v":"SJRJ - Tramitação nas TURMAS RECURSAIS (Eproc)"},null,null,null,{"$f":"$C$18 & \" - Tramitação nas TURMAS RECURSAIS (TOTAL)\"","v":"SJRJ - Tramitação nas TURMAS RECURSAIS (TOTAL)"},null,null,null,53]
[{"$f":"$C$18 & \" - Tramitação TOTAL no 1º Grau (Apolo)\"","v":"SJRJ - Tramitação TOTAL no 1º Grau (Apolo)"},null,null,null,{"$f":"$C$18 & \" - Tramitação TOTAL no 1º Grau (Eproc)\"","v":"SJRJ - Tramitação TOTAL no 1º Grau (Eproc)"},null,null,null,{"$f":"$C$18 & \" - Tramitação TOTAL no 1º Grau (GERAL)\"","v":"SJRJ - Tramitação TOTAL no 1º Grau (GERAL)"},null,null,null,54]
[null,null,null,null,null,null,null,null,null,null,null,null,55]
[{"$f":"$C$18 & \" - Distribuídos nas VARAS (Apolo)\"","v":"SJRJ - Distribuídos nas VARAS (Apolo)"},null,null,null,{"$f":"$C$18 & \" - Distribuídos nas VARAS (Eproc)\"","v":"SJRJ - Distribuídos nas VARAS (Eproc)"},null,null,null,{"$f":"$C$18 & \" - Distribuídos nas VARAS (TOTAL)\"","v":"SJRJ - Distribuídos nas VARAS (TOTAL)"},null,null,null,56]
[{"$f":"$C$18 & \" - Distribuídos nos JUIZADOS ESPECIAIS (Apolo)\"","v":"SJRJ - Distribuídos nos JUIZADOS ESPECIAIS (Apolo)"},null,null,null,{"$f":"$C$18 & \" - Distribuídos nos JUIZADOS ESPECIAIS (Eproc)\"","v":"SJRJ - Distribuídos nos JUIZADOS ESPECIAIS (Eproc)"},null,null,null,{"$f":"$C$18 & \" - Distribuídos nos JUIZADOS ESPECIAIS (TOTAL)\"","v":"SJRJ - Distribuídos nos JUIZADOS ESPECIAIS (TOTAL)"},null,null,null,57]
[{"$f":"$C$18 & \" - Distribuídos nas TURMAS RECURSAIS (Apolo)\"","v":"SJRJ - Distribuídos nas TURMAS RECURSAIS (Apolo)"},null,null,null,{"$f":"$C$18 & \" - Distribuídos nas TURMAS RECURSAIS (Eproc)\"","v":"SJRJ - Distribuídos nas TURMAS RECURSAIS (Eproc)"},null,null,null,{"$f":"$C$18 & \" - Distribuídos nas TURMAS RECURSAIS (TOTAL)\"","v":"SJRJ - Distribuídos nas TURMAS RECURSAIS (TOTAL)"},null,null,null,58]
[{"$f":"$C$18 & \" - TOTAL de Distribuídos no 1º Grau (Apolo)\"","v":"SJRJ - TOTAL de Distribuídos no 1º Grau (Apolo)"},null,null,null,{"$f":"$C$18 & \" - TOTAL de Distribuídos no 1º Grau (Eproc)\"","v":"SJRJ - TOTAL de Distribuídos no 1º Grau (Eproc)"},null,null,null,{"$f":"$C$18 & \" - TOTAL de Distribuídos no 1º Grau (GERAL)\"","v":"SJRJ - TOTAL de Distribuídos no 1º Grau (GERAL)"},null,null,null,59]
[null,null,null,null,null,null,null,null,null,null,null,null,60]
[{"$f":"$C$18 & \" - Julgados nas VARAS (Apolo)\"","v":"SJRJ - Julgados nas VARAS (Apolo)"},null,null,null,{"$f":"$C$18 & \" - Julgados nas VARAS (Eproc)\"","v":"SJRJ - Julgados nas VARAS (Eproc)"},null,null,null,{"$f":"$C$18 & \" - Julgados nas VARAS (TOTAL)\"","v":"SJRJ - Julgados nas VARAS (TOTAL)"},null,null,null,61]
[{"$f":"$C$18 & \" - Julgados nos JUIZADOS ESPECIAIS (Apolo)\"","v":"SJRJ - Julgados nos JUIZADOS ESPECIAIS (Apolo)"},null,null,null,{"$f":"$C$18 & \" - Julgados nos JUIZADOS ESPECIAIS (Eproc)\"","v":"SJRJ - Julgados nos JUIZADOS ESPECIAIS (Eproc)"},null,null,null,{"$f":"$C$18 & \" - Julgados nos JUIZADOS ESPECIAIS (TOTAL)\"","v":"SJRJ - Julgados nos JUIZADOS ESPECIAIS (TOTAL)"},null,null,null,62]
[{"$f":"$C$18 & \" - Julgados nas TURMAS RECURSAIS (Apolo)\"","v":"SJRJ - Julgados nas TURMAS RECURSAIS (Apolo)"},null,null,null,{"$f":"$C$18 & \" - Julgados nas TURMAS RECURSAIS (Eproc)\"","v":"SJRJ - Julgados nas TURMAS RECURSAIS (Eproc)"},null,null,null,{"$f":"$C$18 & \" - Julgados nas TURMAS RECURSAIS (TOTAL)\"","v":"SJRJ - Julgados nas TURMAS RECURSAIS (TOTAL)"},null,null,null,63]
[{"$f":"$C$18 & \" - TOTAL de Julgados no 1º Grau (Apolo)\"","v":"SJRJ - TOTAL de Julgados no 1º Grau (Apolo)"},null,null,null,{"$f":"$C$18 & \" - TOTAL de Julgados no 1º Grau (Eproc)\"","v":"SJRJ - TOTAL de Julgados no 1º Grau (Eproc)"},null,null,null,{"$f":"$C$18 & \" - TOTAL de Julgados no 1º Grau (GERAL)\"","v":"SJRJ - TOTAL de Julgados no 1º Grau (GERAL)"},null,null,null,64]
[null,null,null,null,null,null,null,null,null,null,null,null,65]
[null,null,null,null,null,null,null,null,null,null,null,null,66]
[null,null,null,null,null,null,null,null,null,null,null,null,{"$f":"M66+1","v":67}]
["PaM","NOT USED"," <= used by Sub PaMAe_PaM() for the return of PvAAe",null,null,null,null,null,null,null,null,null,68]
["GDaMAe","destiny"," <=used by Sub ig_AnoG() when any G??M=2018e2019 (Initiate for G??M)",null,null,null,null,null,null,null,null,null,69]
[null,null,null,null,null,null,null,null,null,null,null,null,70]
[null,null,null,null,null,null,null,null,null,null,null,null,71]
[null,null,null,null,null,null,null,null,null,null,null,null,72]
["A1","B2","C3","D4","E5","F6","G7","H8","I9","J10","K11","L12","M"]
[]
[]
[]
[]
[]
[]
["Histórico de Alterações:"]
["2015-01-29",null,"Alterado a forma de contabilizar os Distribuídos, all 2014 agora contabiliza somente os DISTRIBUÍDOS,"]
[null,null,"de 2013 pra trás, contabilizava os DISTRIBUÍDOS JUNTO com os REDISTRIBUÍDOS."]
[null,null,"Houve tb alterações nos Julgados, provavelmente por lançamentos retroativos."]
[]
["2018-05-04",null,"Início da adaptação para o eProc"]
["2018-09-17",null," - PvA -PCA"]
["2018-12-05",null," 2018Ae início ok"]
["2018-12-06",null," - PvAdesat"," 2018Ae ok"]
["2018-12-13",null," 2019Ae início ok"]
["2018-12-20",null,"2019Ae ok"]
[null,"A","Ae"]
[2019,"a2l73","a2p73"]
[2018,"a74l145","a74p145"]
[2017,"a146l217"]

{"sheet":"Dados","index":20,"n_rows":1094,"n_cols":72,"rows_kept":1094,"cut":false,"hidden":true,"merged":[[0,52,0,55],[0,56,0,59],[0,21,0,24],[0,17,0,19],[0,25,0,28],[0,48,0,50]]}
["ColAux1","ColAux2","ColAux3","ColAux4","Ano","Seção Judiciária","Tipo de Juízo","Mês","Dist","Julg","Remetidos TRF/TR","Tram R","Dist_E","Julg_E","Remetidos TRF/TR_E","Tram R_E",null,"J A ",null,null,null,"S A",null,null,null,"Conf A",null,null,null,null,"1#D","1#J","1#R","1#T","2#J","3#D","3#J","3#R","3#T","4#J","5#J","6#J","7#J","8#J","9#J","10#J","11#J",null,"J e",null,null,null,"S e",null,null,null,"Conf e",null,null,null,null,"1#J","2#J","3#J","4#J","5#J","6#J","7#J","8#J","9#J","10#J","11#J"]
[{"$f":"E2&F2&G2&H2","v":"2019SJESVarasJaneiro"},{"$f":"E2&G2&H2","v":"2019VarasJaneiro"},{"$f":"E2&F2&G2","v":"2019SJESVaras"},{"$f":"E2&G2","v":"2019Varas"},2019,"SJES","Varas","Janeiro",188,631,144,93508,1347,285,354,33235]
["2019SJESJuizadosJaneiro","2019JuizadosJaneiro","2019SJESJuizados","2019Juizados",2019,"SJES","Juizados","Janeiro",0,630,104,10002,1623,1252,88,21795]
["2019SJESTurmas RecursaisJaneiro","2019Turmas RecursaisJaneiro","2019SJESTurmas Recursais","2019Turmas Recursais",2019,"SJES","Turmas Recursais","Janeiro",103,822,0,13487,286,190,0,1458]
["2019SJESVarasFevereiro","2019VarasFevereiro","2019SJESVaras","2019Varas",2019,"SJES","Varas","Fevereiro",189,840,231,90396,1506,634,529,36336]
["2019SJESJuizadosFevereiro","2019JuizadosFevereiro","2019SJESJuizados","2019Juizados",2019,"SJES","Juizados","Fevereiro",1,459,210,9128,2115,1773,231,22358]
["2019SJESTurmas RecursaisFevereiro","2019Turmas RecursaisFevereiro","2019SJESTurmas Recursais","2019Turmas Recursais",2019,"SJES","Turmas Recursais","Fevereiro",206,1593,0,12990,536,155,0,1931]
["2019SJESVarasMarço","2019VarasMarço","2019SJESVaras","2019Varas",2019,"SJES","Varas","Março",435,749,169,88137,1383,627,451,38713]
["2019SJESJuizadosMarço","2019JuizadosMarço","2019SJESJuizados","2019Juizados",2019,"SJES","Juizados","Março",2,382,221,8434,1988,1861,151,23019]
["2019SJESTurmas RecursaisMarço","2019Turmas RecursaisMarço","2019SJESTurmas Recursais","2019Turmas Recursais",2019,"SJES","Turmas Recursais","Março",208,836,0,12592,432,99,0,2251]
["2019SJESVarasAbril","2019VarasAbril","2019SJESVaras","2019Varas",2019,"SJES","Varas","Abril",112,814,243,84572,1420,843,675,41798]
["2019SJESJuizadosAbril","2019JuizadosAbril","2019SJESJuizados","2019Juizados",2019,"SJES","Juizados","Abril",3,388,186,7103,2197,1811,239,24607]
["2019SJESTurmas RecursaisAbril","2019Turmas RecursaisAbril","2019SJESTurmas Recursais","2019Turmas Recursais",2019,"SJES","Turmas Recursais","Abril",102,1349,0,11906,641,308,0,2812]
["2019SJESVarasMaio","2019VarasMaio","2019SJESVaras","2019Varas",2019,"SJES","Varas","Maio",524,981,201,82488,1751,1124,754,43714]
["2019SJESJuizadosMaio","2019JuizadosMaio","2019SJESJuizados","2019Juizados",2019,"SJES","Juizados","Maio",2,479,111,5742,2520,2348,323,26621]
["2019SJESTurmas RecursaisMaio","2019Turmas RecursaisMaio","2019SJESTurmas Recursais","2019Turmas Recursais",2019,"SJES","Turmas Recursais","Maio",112,1447,0,11045,823,273,0,3488]
["2019SJESVarasJunho","2019VarasJunho","2019SJESVaras","2019Varas",2019,"SJES","Varas","Junho",156,853,92,79541,2173,981,624,47106]
["2019SJESJuizadosJunho","2019JuizadosJunho","2019SJESJuizados","2019Juizados",2019,"SJES","Juizados","Junho",1,179,57,5364,1856,2029,437,26877]
["2019SJESTurmas RecursaisJunho","2019Turmas RecursaisJunho","2019SJESTurmas Recursais","2019Turmas Recursais",2019,"SJES","Turmas Recursais","Junho",60,1123,0,10129,874,492,0,4096]
["2019SJESVarasJulho","2019VarasJulho","2019SJESVaras","2019Varas",2019,"SJES","Varas","Julho",118,764,141,77441,2311,1345,862,49279]
["2019SJESJuizadosJulho","2019JuizadosJulho","2019SJESJuizados","2019Juizados",2019,"SJES","Juizados","Julho",1,165,66,5522,2635,2267,572,27705]
["2019SJESTurmas RecursaisJulho","2019Turmas RecursaisJulho","2019SJESTurmas Recursais","2019Turmas Recursais",2019,"SJES","Turmas Recursais","Julho",54,1070,0,9091,1076,670,0,4699]
["2019SJESVarasAgosto","2019VarasAgosto","2019SJESVaras","2019Varas",2019,"SJES","Varas","Agosto",57,665,88,63102,1929,1817,755,63204]
["2019SJESJuizadosAgosto","2019JuizadosAgosto","2019SJESJuizados","2019Juizados",2019,"SJES","Juizados","Agosto",0,93,24,4882,2512,2462,424,28600]
["2019SJESTurmas RecursaisAgosto","2019Turmas RecursaisAgosto","2019SJESTurmas Recursais","2019Turmas Recursais",2019,"SJES","Turmas Recursais","Agosto",26,1680,0,8570,887,886,0,5176]
["2019SJESVarasSetembro","2019VarasSetembro","2019SJESVaras","2019Varas",2019,"SJES","Varas","Setembro",65,518,123,32269,1765,1688,761,93354]
["2019SJESJuizadosSetembro","2019JuizadosSetembro","2019SJESJuizados","2019Juizados",2019,"SJES","Juizados","Setembro",0,62,701,4531,2479,2611,457,28941]
["2019SJESTurmas RecursaisSetembro","2019Turmas RecursaisSetembro","2019SJESTurmas Recursais","2019Turmas Recursais",2019,"SJES","Turmas Recursais","Setembro",17,1046,0,7804,870,900,0,5523]
["2019SJESVarasOutubro","2019VarasOutubro","2019SJESVaras","2019Varas",2019,"SJES","Varas","Outubro",41,287,96,21334,2068,1701,774,105883]
["2019SJESJuizadosOutubro","2019JuizadosOutubro","2019SJESJuizados","2019Juizados",2019,"SJES","Juizados","Outubro",1,85,16,4263,3350,2488,526,30209]
["2019SJESTurmas RecursaisOutubro","2019Turmas RecursaisOutubro","2019SJESTurmas Recursais","2019Turmas Recursais",2019,"SJES","Turmas Recursais","Outubro",15,698,0,7093,899,943,0,5647]
["2019SJESVarasNovembro","2019VarasNovembro","2019SJESVaras","2019Varas",2019,"SJES","Varas","Novembro",28,240,54,14539,2713,1535,833,111359]
["2019SJESJuizadosNovembro","2019JuizadosNovembro","2019SJESJuizados","2019Juizados",2019,"SJES","Juizados","Novembro",1,47,11,4299,6375,2471,496,34975]
["2019SJESTurmas RecursaisNovembro","2019Turmas RecursaisNovembro","2019SJESTurmas Recursais","2019Turmas Recursais",2019,"SJES","Turmas Recursais","Novembro",6,280,0,6558,935,945,0,5829]
["2019SJESVarasDezembro","2019VarasDezembro","2019SJESVaras","2019Varas",2019,"SJES","Varas","Dezembro",47,155,51,13705,2359,1343,563,112998]
["2019SJESJuizadosDezembro","2019JuizadosDezembro","2019SJESJuizados","2019Juizados",2019,"SJES","Juizados","Dezembro",1,47,9,4559,2366,1484,341,36203]
["2019SJESTurmas RecursaisDezembro","2019Turmas RecursaisDezembro","2019SJESTurmas Recursais","2019Turmas Recursais",2019,"SJES","Turmas Recursais","Dezembro",12,425,0,5943,596,608,0,5414]
[{"$f":"E38&F38&G38&H38","v":"2019SJRJVarasJaneiro"},"2019VarasJaneiro","2019SJRJVaras","2019Varas",2019,"SJRJ","Varas","Janeiro",827,4735,1009,513561,4840,1134,1446,75081]
[{"$f":"E39&F39&G39&H39","v":"2019SJRJJuizadosJaneiro"},"2019JuizadosJaneiro","2019SJRJJuizados","2019Juizados",2019,"SJRJ","Juizados","Janeiro",6,2186,592,33022,6950,6294,369,84475]
["2019SJRJTurmas RecursaisJaneiro","2019Turmas RecursaisJaneiro","2019SJRJTurmas Recursais","2019Turmas Recursais",2019,"SJRJ","Turmas Recursais","Janeiro",1034,1316,0,50625,1536,664,0,6924]
["2019SJRJVarasFevereiro","2019VarasFevereiro","2019SJRJVaras","2019Varas",2019,"SJRJ","Varas","Fevereiro",816,5988,1030,481199,6355,2828,3027,106459]
["2019SJRJJuizadosFevereiro","2019JuizadosFevereiro","2019SJRJJuizados","2019Juizados",2019,"SJRJ","Juizados","Fevereiro",3,1415,632,24520,9717,9600,765,89246]
["2019SJRJTurmas RecursaisFevereiro","2019Turmas RecursaisFevereiro","2019SJRJTurmas Recursais","2019Turmas Recursais",2019,"SJRJ","Turmas Recursais","Fevereiro",265,2355,0,48799,3118,860,0,9296]
["2019SJRJVarasMarço","2019VarasMarço","2019SJRJVaras","2019Varas",2019,"SJRJ","Varas","Março",616,4023,797,460944,11446,2814,2545,132396]
["2019SJRJJuizadosMarço","2019JuizadosMarço","2019SJRJJuizados","2019Juizados",2019,"SJRJ","Juizados","Março",1,867,331,21189,8355,8220,568,91926]
["2019SJRJTurmas RecursaisMarço","2019Turmas RecursaisMarço","2019SJRJTurmas Recursais","2019Turmas Recursais",2019,"SJRJ","Turmas Recursais","Março",492,2338,0,47420,2419,1860,0,10848]
["2019SJRJVarasAbril","2019VarasAbril","2019SJRJVaras","2019Varas",2019,"SJRJ","Varas","Abril",641,4226,771,436204,6743,3283,2746,156924]
["2019SJRJJuizadosAbril","2019JuizadosAbril","2019SJRJJuizados","2019Juizados",2019,"SJRJ","Juizados","Abril",2,597,267,18944,9609,8286,573,94920]
["2019SJRJTurmas RecursaisAbril","2019Turmas RecursaisAbril","2019SJRJTurmas Recursais","2019Turmas Recursais",2019,"SJRJ","Turmas Recursais","Abril",473,2011,0,46210,2404,1308,0,12228]
["2019SJRJVarasMaio","2019VarasMaio","2019SJRJVaras","2019Varas",2019,"SJRJ","Varas","Maio",821,5621,1045,401153,7485,4718,3540,240346]
["2019SJRJJuizadosMaio","2019JuizadosMaio","2019SJRJJuizados","2019Juizados",2019,"SJRJ","Juizados","Maio",3,776,273,16638,11209,11093,734,98227]
["2019SJRJTurmas RecursaisMaio","2019Turmas RecursaisMaio","2019SJRJTurmas Recursais","2019Turmas Recursais",2019,"SJRJ","Turmas Recursais","Maio",277,13070,0,45393,2815,2246,0,14078]
["2019SJRJVarasJunho","2019VarasJunho","2019SJRJVaras","2019Varas",2019,"SJRJ","Varas","Junho",551,3266,680,268732,5970,4656,3278,320014]
["2019SJRJJuizadosJunho","2019JuizadosJunho","2019SJRJJuizados","2019Juizados",2019,"SJRJ","Juizados","Junho",5,538,162,18370,9276,9850,754,100045]
["2019SJRJTurmas RecursaisJunho","2019Turmas RecursaisJunho","2019SJRJTurmas Recursais","2019Turmas Recursais",2019,"SJRJ","Turmas Recursais","Junho",164,2398,0,39786,2683,1834,0,14875]
["2019SJRJVarasJulho","2019VarasJulho","2019SJRJVaras","2019Varas",2019,"SJRJ","Varas","Julho",760,3973,659,258410,8257,6676,4527,327480]
["2019SJRJJuizadosJulho","2019JuizadosJulho","2019SJRJJuizados","2019Juizados",2019,"SJRJ","Juizados","Julho",2,983,174,20586,11862,11845,1042,102569]
["2019SJRJTurmas RecursaisJulho","2019Turmas RecursaisJulho","2019SJRJTurmas Recursais","2019Turmas Recursais",2019,"SJRJ","Turmas Recursais","Julho",142,1747,0,33433,3571,1943,0,16257]
["2019SJRJVarasAgosto","2019VarasAgosto","2019SJRJVaras","2019Varas",2019,"SJRJ","Varas","Agosto",640,4279,542,154374,7965,8359,4559,428772]
["2019SJRJJuizadosAgosto","2019JuizadosAgosto","2019SJRJJuizados","2019Juizados",2019,"SJRJ","Juizados","Agosto",9,913,151,19869,11077,12639,1044,103180]
["2019SJRJTurmas RecursaisAgosto","2019Turmas RecursaisAgosto","2019SJRJTurmas Recursais","2019Turmas Recursais",2019,"SJRJ","Turmas Recursais","Agosto",124,1300,0,29722,3460,2603,0,18107]
["2019SJRJVarasSetembro","2019VarasSetembro","2019SJRJVaras","2019Varas",2019,"SJRJ","Varas","Setembro",673,2512,397,132698,7127,8264,4561,447088]
["2019SJRJJuizadosSetembro","2019JuizadosSetembro","2019SJRJJuizados","2019Juizados",2019,"SJRJ","Juizados","Setembro",4,1043,142,21248,10457,10656,1034,104121]
["2019SJRJTurmas RecursaisSetembro","2019Turmas RecursaisSetembro","2019SJRJTurmas Recursais","2019Turmas Recursais",2019,"SJRJ","Turmas Recursais","Setembro",91,916,0,26449,3445,3625,0,19884]
["2019SJRJVarasOutubro","2019VarasOutubro","2019SJRJVaras","2019Varas",2019,"SJRJ","Varas","Outubro",567,2358,442,118947,8176,7642,4497,457423]
["2019SJRJJuizadosOutubro",{"$f":"E66&G66&H66","v":"2019JuizadosOutubro"},{"$f":"E66&F66&G66","v":"2019SJRJJuizados"},{"$f":"E66&G66","v":"2019Juizados"},2019,"SJRJ","Juizados","Outubro",5,1369,144,18345,13300,11175,1019,107979]
["2019SJRJTurmas RecursaisOutubro","2019Turmas RecursaisOutubro","2019SJRJTurmas Recursais","2019Turmas Recursais",2019,"SJRJ","Turmas Recursais","Outubro",132,806,0,25098,3260,3515,0,19449]
["2019SJRJVarasNovembro","2019VarasNovembro","2019SJRJVaras","2019Varas",2019,"SJRJ","Varas","Novembro",562,1323,243,109315,11226,6652,3494,469916]
["2019SJRJJuizadosNovembro","2019JuizadosNovembro","2019SJRJJuizados","2019Juizados",2019,"SJRJ","Juizados","Novembro",2,480,85,16675,24928,10091,776,125479]
["2019SJRJTurmas RecursaisNovembro","2019Turmas RecursaisNovembro","2019SJRJTurmas Recursais","2019Turmas Recursais",2019,"SJRJ","Turmas Recursais","Novembro",100,721,0,24537,2503,2594,0,19654]
["2019SJRJVarasDezembro","2019VarasDezembro","2019SJRJVaras","2019Varas",2019,"SJRJ","Varas","Dezembro",485,1067,191,100231,10708,5657,2740,483805]
["2019SJRJJuizadosDezembro","2019JuizadosDezembro","2019SJRJJuizados","2019Juizados",2019,"SJRJ","Juizados","Dezembro",3,319,153,15130,9355,8027,567,128057]
["2019SJRJTurmas RecursaisDezembro","2019Turmas RecursaisDezembro","2019SJRJTurmas Recursais","2019Turmas Recursais",2019,"SJRJ","Turmas Recursais","Dezembro",63,533,0,24048,2057,2816,0,19969]
[{"$f":"E74&F74&G74&H74","v":"2018SJESVarasJaneiro"},{"$f":"E74&G74&H74","v":"2018VarasJaneiro"},{"$f":"E74&F74&G74","v":"2018SJESVaras"},{"$f":"E74&G74","v":"2018Varas"},2018,"SJES","Varas","Janeiro",2530,1271,292,126813,0,0,0,0,null,"01Ant","01Atu",null,null,2530,1271,292,126813,{"$f":"IF(I74=V74,\"Ok\",I74-V74)","v":"Ok"},{"$f":"IF(J74=W74,\"Ok\",J74-W74)","v":"Ok"},{"$f":"IF(K74=X74,\"Ok\",K74-X74)","v":"Ok"},{"$f":"IF(L74=Y74,\"Ok\",L74-Y74)","v":"Ok"},null,null,"Ok",null,null,"Ok",null,"Ok",null,null,"Ok","Ok","Ok","Ok","Ok","Ok","Ok","Ok",null,"01Ant","01Atu",null,null,0,0,0,0,{"$f":"IF(M74=BA74,\"Ok\",M74-BA74)","v":"Ok"},{"$f":"IF(N74=BB74,\"Ok\",N74-BB74)","v":"Ok"},{"$f":"IF(O74=BC74,\"Ok\",O74-BC74)","v":"Ok"},{"$f":"IF(P74=BD74,\"Ok\",P74-BD74)","v":"Ok"},null,"Ok","Ok","Ok","Ok","Ok","Ok","Ok","Ok","Ok","Ok","Ok"]
["2018SJESJuizadosJaneiro","2018JuizadosJaneiro","2018SJESJuizados","2018Juizados",2018,"SJES","Juizados","Janeiro",1669,1401,431,43396,0,0,0,0,null,2920,2938,{"$f":"S75-R75","v":18},null,1669,1401,431,43396,{"$f":"IF(I75=V75,\"Ok\",I75-V75)","v":"Ok"},{"$f":"IF(J75=W75,\"Ok\",J75-W75)","v":"Ok"},{"$f":"IF(K75=X75,\"Ok\",K75-X75)","v":"Ok"},{"$f":"IF(L75=Y75,\"Ok\",L75-Y75)","v":"Ok"},null,null,"Ok",null,null,"Ok",null,"Ok",null,null,"Ok","Ok","Ok","Ok","Ok","Ok","Ok","Ok",null,0,0,{"$f":"AX75-AW75","v":0},null,0,0,0,0,{"$f":"IF(M75=BA75,\"Ok\",M75-BA75)","v":"Ok"},{"$f":"IF(N75=BB75,\"Ok\",N75-BB75)","v":"Ok"},{"$f":"IF(O75=BC75,\"Ok\",O75-BC75)","v":"Ok"},{"$f":"IF(P75=BD75,\"Ok\",P75-BD75)","v":"Ok"},null,"Ok","Ok","Ok","Ok","Ok","Ok","Ok","Ok","Ok","Ok","Ok"]
["2018SJESTurmas RecursaisJaneiro","2018Turmas RecursaisJaneiro","2018SJESTurmas Recursais","2018Turmas Recursais",2018,"SJES","Turmas Recursais","Janeiro",445,266,0,18156,0,0,0,0,null,null,null,null,null,445,266,0,18156,"Ok",{"$f":"IF(J76=W76,\"Ok\",J76-W76)","v":"Ok"},{"$f":"IF(K76=X76,\"Ok\",K76-X76)","v":"Ok"},"Ok",null,null,"Ok",null,null,14,null,"Ok",null,null,2,"Ok","Ok","Ok","Ok","Ok",2,"Ok",null,null,null,null,null,0,0,0,0,"Ok","Ok","Ok","Ok",null,"Ok","Ok","Ok","Ok","Ok","Ok","Ok","Ok","Ok","Ok","Ok"]
["2018SJESVarasFevereiro","2018VarasFevereiro","2018SJESVaras","2018Varas",2018,"SJES","Varas","Fevereiro",1475,1759,285,126791,0,0,0,0,null,"02Ant","02Atu",null,null,1475,1759,285,126791,"Ok","Ok","Ok",{"$f":"IF(L77=Y77,\"Ok\",L77-Y77)","v":"Ok"},null,null,null,null,null,null,null,"Ok",null,null,"Ok","Ok","Ok","Ok","Ok","Ok","Ok","Ok",null,"02Ant","02Atu",null,null,0,0,0,0,"Ok","Ok","Ok","Ok",null,null,null,"Ok","Ok","Ok","Ok","Ok","Ok","Ok","Ok","Ok"]
["2018SJESJuizadosFevereiro","2018JuizadosFevereiro","2018SJESJuizados","2018Juizados",2018,"SJES","Juizados","Fevereiro",1370,1999,632,42617,134,1,0,0,null,5199,5224,{"$f":"S78-R78","v":25},null,1370,1999,632,42617,"Ok","Ok","Ok","Ok",null,null,null,null,null,null,null,"Ok",null,null,"Ok","Ok","Ok","Ok","Ok","Ok","Ok","Ok",null,1,1,{"$f":"AX78-AW78","v":0},null,134,1,0,0,"Ok","Ok","Ok","Ok",null,null,null,"Ok","Ok","Ok","Ok","Ok","Ok","Ok","Ok","Ok"]
["2018SJESTurmas RecursaisFevereiro","2018Turmas RecursaisFevereiro","2018SJESTurmas Recursais","2018Turmas Recursais",2018,"SJES","Turmas Recursais","Fevereiro",508,1466,0,17748,0,0,0,0,null,null,null,null,null,508,1466,0,17748,"Ok","Ok","Ok","Ok",null,null,null,null,null,null,null,"Ok",null,null,21,1,"Ok",2,"Ok",1,"Ok","Ok",null,null,null,null,null,0,0,0,0,"Ok","Ok","Ok","Ok",null,null,null,"Ok","Ok","Ok","Ok","Ok","Ok","Ok","Ok","Ok"]
["2018SJESVarasMarço","2018VarasMarço","2018SJESVaras","2018Varas",2018,"SJES","Varas","Março",1586,2209,337,126287,0,0,0,0,null,"03Ant","03Atu",null,null,1586,2209,337,126287,"Ok","Ok","Ok","Ok",null,null,null,null,null,null,null,null,null,null,"Ok","Ok","Ok","Ok","Ok","Ok","Ok","Ok",null,"03Ant","03Atu",null,null,0,0,0,0,"Ok","Ok","Ok","Ok",null,null,null,null,"Ok","Ok","Ok","Ok","Ok","Ok","Ok","Ok"]
["2018SJESJuizadosMarço","2018JuizadosMarço","2018SJESJuizados","2018Juizados",2018,"SJES","Juizados","Março",983,2033,559,41321,967,29,0,0,null,5826,5838,{"$f":"S81-R81","v":12},null,983,2033,559,41321,"Ok","Ok","Ok","Ok",null,null,null,null,null,null,null,null,null,null,"Ok","Ok","Ok","Ok","Ok","Ok","Ok","Ok",null,29,29,{"$f":"AX81-AW81","v":0},null,967,29,0,0,"Ok","Ok","Ok","Ok",null,null,null,null,"Ok","Ok","Ok","Ok","Ok","Ok","Ok","Ok"]
["2018SJESTurmas RecursaisMarço","2018Turmas RecursaisMarço","2018SJESTurmas Recursais","2018Turmas Recursais",2018,"SJES","Turmas Recursais","Março",552,1596,0,17689,0,0,0,0,null,null,null,null,null,552,1596,0,17689,"Ok","Ok","Ok","Ok",null,null,null,null,null,null,null,null,null,null,"Ok",7,"Ok",1,1,1,1,1,null,null,null,null,null,0,0,0,0,"Ok","Ok","Ok","Ok",null,null,null,null,"Ok","Ok","Ok","Ok","Ok","Ok","Ok","Ok"]
["2018SJESVarasAbril","2018VarasAbril","2018SJESVaras","2018Varas",2018,"SJES","Varas","Abril",2178,1377,327,126689,11,0,0,5,null,"04Ant","04Atu",null,null,2178,1377,327,126689,"Ok","Ok","Ok","Ok",null,null,null,null,null,null,null,null,null,null,null,"Ok","Ok","Ok","Ok","Ok","Ok","Ok",null,"04Ant","04Atu",null,null,11,0,0,5,"Ok","Ok","Ok","Ok",null,null,null,null,null,"Ok","Ok","Ok","Ok","Ok","Ok","Ok"]
["2018SJESJuizadosAbril","2018JuizadosAbril","2018SJESJuizados","2018Juizados",2018,"SJES","Juizados","Abril",660,1280,623,40287,1511,52,0,2523,null,3753,3784,{"$f":"S84-R84","v":31},null,660,1280,623,40287,"Ok","Ok","Ok","Ok",null,null,null,null,null,null,null,null,null,null,null,"Ok","Ok","Ok","Ok","Ok","Ok","Ok",null,52,52,{"$f":"AX84-AW84","v":0},null,1511,52,0,2523,"Ok","Ok","Ok","Ok",null,null,null,null,null,"Ok","Ok","Ok","Ok","Ok","Ok","Ok"]
["2018SJESTurmas RecursaisAbril","2018Turmas RecursaisAbril","2018SJESTurmas Recursais","2018Turmas Recursais",2018,"SJES","Turmas Recursais","Abril",722,1127,0,17544,0,0,0,0,null,null,null,null,null,722,1127,0,17544,"Ok","Ok","Ok","Ok",null,null,null,null,null,null,null,null,null,null,null,15,2,4,1,4,4,1,null,null,null,null,null,0,0,0,0,"Ok","Ok","Ok","Ok",null,null,null,null,null,"Ok","Ok","Ok","Ok","Ok","Ok","Ok"]
["2018SJESVarasMaio","2018VarasMaio","2018SJESVaras","2018Varas",2018,"SJES","Varas","Maio",1632,2116,355,126457,250,3,0,226,null,"05Ant","05Atu",null,null,1632,2116,355,126457,"Ok","Ok","Ok","Ok",null,null,null,null,null,null,null,null,null,null,null,null,"Ok","Ok","Ok","Ok","Ok","Ok",null,"05Ant","05Atu",null,null,250,3,0,226,"Ok","Ok","Ok","Ok",null,null,null,null,null,null,"Ok","Ok","Ok","Ok","Ok","Ok"]
["2018SJESJuizadosMaio","2018JuizadosMaio","2018SJESJuizados","2018Juizados",2018,"SJES","Juizados","Maio",8,2509,573,38694,2218,114,5,4447,null,6051,6079,{"$f":"S87-R87","v":28},null,8,2509,573,38694,"Ok","Ok","Ok","Ok",null,null,null,null,null,null,null,null,null,null,null,null,"Ok","Ok","Ok","Ok","Ok","Ok",null,117,117,{"$f":"AX87-AW87","v":0},null,2218,114,5,4447,"Ok","Ok","Ok","Ok",null,null,null,null,null,null,"Ok","Ok","Ok","Ok","Ok","Ok"]
["2018SJESTurmas RecursaisMaio","2018Turmas RecursaisMaio","2018SJESTurmas Recursais","2018Turmas Recursais",2018,"SJES","Turmas Recursais","Maio",581,1454,0,17083,7,0,0,7,null,null,null,null,null,581,1454,0,17083,"Ok","Ok","Ok","Ok",null,null,null,null,null,null,null,null,null,null,null,null,10,7,4,6,1,"Ok",null,null,null,null,null,7,0,0,7,"Ok","Ok","Ok","Ok",null,null,null,null,null,null,"Ok","Ok","Ok","Ok","Ok","Ok"]
["2018SJESVarasJunho","2018VarasJunho","2018SJESVaras","2018Varas",2018,"SJES","Varas","Junho",993,2216,396,125574,649,4,0,891,null,"06Ant","06Atu",null,null,993,2216,396,125574,"Ok","Ok","Ok","Ok",null,null,null,null,null,null,null,null,null,null,null,null,null,"Ok","Ok","Ok","Ok","Ok",null,"06Ant","06Atu",null,null,649,4,0,891,"Ok","Ok","Ok","Ok",null,null,null,null,null,null,null,"Ok","Ok","Ok","Ok","Ok"]
["2018SJESJuizadosJunho","2018JuizadosJunho","2018SJESJuizados","2018Juizados",2018,"SJES","Juizados","Junho",3,8237,860,35376,2134,186,16,6794,null,11734,11777,{"$f":"S90-R90","v":43},null,3,8237,860,35376,"Ok","Ok","Ok","Ok",null,null,null,null,null,null,null,null,null,null,null,null,null,"Ok","Ok","Ok","Ok","Ok",null,190,190,{"$f":"AX90-AW90","v":0},null,2134,186,16,6794,"Ok","Ok","Ok","Ok",null,null,null,null,null,null,null,"Ok","Ok","Ok","Ok","Ok"]
["2018SJESTurmas RecursaisJunho","2018Turmas RecursaisJunho","2018SJESTurmas Recursais","2018Turmas Recursais",2018,"SJES","Turmas Recursais","Junho",581,1324,0,16623,19,0,0,26,null,null,null,null,null,581,1324,0,16623,"Ok","Ok","Ok","Ok",null,null,null,null,null,null,null,null,null,null,null,null,null,20,9,5,8,1,null,null,null,null,null,19,0,0,26,"Ok","Ok","Ok","Ok",null,null,null,null,null,null,null,"Ok","Ok","Ok","Ok","Ok"]
["2018SJESVarasJulho","2018VarasJulho","2018SJESVaras","2018Varas",2018,"SJES","Varas","Julho",262,1578,477,123714,1340,39,0,2106,null,"07Ant","07Atu",null,null,262,1578,477,123714,"Ok","Ok","Ok","Ok",null,null,null,null,null,null,null,null,null,null,null,null,null,null,"Ok","Ok","Ok","Ok",null,"07Ant","07Atu",null,null,1340,39,0,2106,"Ok","Ok",{"$f":"IF(O92=BC92,\"Ok\",O92-BC92)","v":"Ok"},"Ok",null,null,null,null,null,null,null,null,"Ok","Ok","Ok","Ok"]
["2018SJESJuizadosJulho","2018JuizadosJulho","2018SJESJuizados","2018Juizados",2018,"SJES","Juizados","Julho",4,3934,1587,31179,2261,372,49,8771,null,7355,7390,{"$f":"S93-R93","v":35},null,4,3934,1587,31179,"Ok","Ok","Ok","Ok",null,null,null,null,null,null,null,null,null,null,null,null,null,null,"Ok","Ok","Ok","Ok",null,415,415,{"$f":"AX93-AW93","v":0},null,2261,372,49,8771,"Ok","Ok","Ok","Ok",null,null,null,null,null,null,null,null,"Ok","Ok","Ok","Ok"]
["2018SJESTurmas RecursaisJulho","2018Turmas RecursaisJulho","2018SJESTurmas Recursais","2018Turmas Recursais",2018,"SJES","Turmas Recursais","Julho",1820,1878,0,17362,52,4,0,78,null,null,null,null,null,1820,1878,0,17362,"Ok","Ok","Ok","Ok",null,null,null,null,null,null,null,null,null,null,null,null,null,null,24,7,2,2,null,null,null,null,null,52,4,0,78,"Ok","Ok","Ok","Ok",null,null,null,null,null,null,null,null,"Ok","Ok","Ok","Ok"]
["2018SJESVarasAgosto","2018VarasAgosto","2018SJESVaras","2018Varas",2018,"SJES","Varas","Agosto",334,2049,571,121440,1391,46,1,3338,null,"08Ant","08Atu",null,null,334,2049,571,121440,"Ok","Ok","Ok","Ok",null,null,null,null,null,null,null,null,null,null,null,null,null,null,null,"Ok","Ok","Ok",null,"08Ant","08Atu",null,null,1391,46,1,3338,"Ok","Ok","Ok","Ok",null,null,null,null,null,null,null,null,null,"Ok","Ok","Ok"]
["2018SJESJuizadosAgosto","2018JuizadosAgosto","2018SJESJuizados","2018Juizados",2018,"SJES","Juizados","Agosto",6,6605,1031,25106,2514,625,29,12029,null,10867,10882,{"$f":"S96-R96","v":15},null,6,6605,1031,25106,"Ok","Ok","Ok","Ok",null,null,null,null,null,null,null,null,null,null,null,null,null,null,null,"Ok","Ok","Ok",null,676,676,{"$f":"AX96-AW96","v":0},null,2514,625,29,12029,"Ok","Ok","Ok","Ok",null,null,null,null,null,null,null,null,null,"Ok","Ok","Ok"]
["2018SJESTurmas RecursaisAgosto","2018Turmas RecursaisAgosto","2018SJESTurmas Recursais","2018Turmas Recursais",2018,"SJES","Turmas Recursais","Agosto",874,2228,0,17043,37,5,0,105,null,null,null,null,null,874,2228,0,17043,"Ok","Ok","Ok","Ok",null,null,null,null,null,null,null,null,null,null,null,null,null,null,null,9,4,2,null,null,null,null,null,37,5,0,105,"Ok","Ok","Ok","Ok",null,null,null,null,null,null,null,null,null,"Ok","Ok","Ok"]
["2018SJESVarasSetembro","2018VarasSetembro","2018SJESVaras","2018Varas",2018,"SJES","Varas","Setembro",248,1969,336,119772,1575,66,3,4802,null,"09Ant","09Atu",null,null,248,1969,336,119772,"Ok","Ok","Ok","Ok",null,null,null,null,null,null,null,null,null,null,null,null,null,null,null,null,"Ok","Ok",null,"09Ant","09Atu",null,null,1575,66,3,4802,"Ok","Ok","Ok","Ok",null,null,null,null,null,null,null,null,null,null,"Ok","Ok"]
["2018SJESJuizadosSetembro","2018JuizadosSetembro","2018SJESJuizados","2018Juizados",2018,"SJES","Juizados","Setembro",3,1117,911,19042,2029,726,123,15205,null,5636,5654,{"$f":"S99-R99","v":18},null,3,1117,911,19042,"Ok","Ok","Ok","Ok",null,null,null,null,null,null,null,null,null,null,null,null,null,null,null,null,"Ok","Ok",null,817,817,{"$f":"AX99-AW99","v":0},null,2029,726,123,15205,"Ok","Ok","Ok","Ok",null,null,null,null,null,null,null,null,null,null,"Ok","Ok"]
["2018SJESTurmas RecursaisSetembro","2018Turmas RecursaisSetembro","2018SJESTurmas Recursais","2018Turmas Recursais",2018,"SJES","Turmas Recursais","Setembro",1049,2568,0,16645,133,25,0,238,null,null,null,null,null,1049,2568,0,16645,"Ok","Ok","Ok","Ok",null,null,null,null,null,null,null,null,null,null,null,null,null,null,null,null,19,-1,null,null,null,null,null,133,25,0,238,"Ok","Ok","Ok","Ok",null,null,null,null,null,null,null,null,null,null,"Ok","Ok"]
["2018SJESVarasOutubro","2018VarasOutubro","2018SJESVaras","2018Varas",2018,"SJES","Varas","Outubro",276,1483,503,117913,2634,331,10,7063,null,"10Ant","10Atu",null,null,276,1483,503,117913,"Ok","Ok","Ok","Ok",null,null,null,null,null,null,null,null,null,null,null,null,null,null,null,null,null,"Ok",null,"10Ant","10Atu",null,null,2634,331,10,7063,"Ok","Ok","Ok","Ok",null,null,null,null,null,null,null,null,null,null,null,"Ok"]
["2018SJESJuizadosOutubro","2018JuizadosOutubro","2018SJESJuizados","2018Juizados",2018,"SJES","Juizados","Outubro",6,1542,266,14813,2418,1228,313,17262,null,5045,5061,{"$f":"S102-R102","v":16},null,6,1542,266,14813,"Ok","Ok","Ok","Ok",null,null,null,null,null,null,null,null,null,null,null,null,null,null,null,null,null,"Ok",null,1593,1593,{"$f":"AX102-AW102","v":0},null,2418,1228,313,17262,"Ok","Ok","Ok","Ok",null,null,null,null,null,null,null,null,null,null,null,"Ok"]
[{"$f":"E103&F103&G103&H103","v":"2018SJESTurmas RecursaisOutubro"},"2018Turmas RecursaisOutubro","2018SJESTurmas Recursais","2018Turmas Recursais",2018,"SJES","Turmas Recursais","Outubro",249,2036,0,14897,319,34,0,535,null,null,null,null,null,249,2036,0,14897,"Ok","Ok","Ok","Ok",null,null,null,null,null,null,null,null,null,null,null,null,null,null,null,null,null,16,null,null,null,null,null,319,34,0,535,"Ok","Ok","Ok","Ok",null,null,null,null,null,null,null,null,null,null,null,"Ok"]
["2018SJESVarasNovembro","2018VarasNovembro","2018SJESVaras","2018Varas",2018,"SJES","Varas","Novembro",358,1548,354,116782,1727,439,15,8702,null,"11Ant","11Atu",null,null,358,1548,354,116782,{"$f":"IF(I104=V104,\"Ok\",I104-V104)","v":"Ok"},"Ok","Ok","Ok",null,null,null,null,null,null,null,null,null,null,null,null,null,null,null,null,null,null,null,"11Ant","11Atu",null,null,1727,439,15,8702,"Ok","Ok","Ok","Ok"]
["2018SJESJuizadosNovembro","2018JuizadosNovembro","2018SJESJuizados","2018Juizados",2018,"SJES","Juizados","Novembro",3,1876,308,13476,1982,1466,443,18587,null,4697,4715,{"$f":"S105-R105","v":18},null,3,1876,308,13476,"Ok","Ok","Ok","Ok",null,null,null,null,null,null,null,null,null,null,null,null,null,null,null,null,null,null,null,1964,1964,{"$f":"AX105-AW105","v":0},null,1982,1466,443,18587,"Ok","Ok","Ok","Ok"]
["2018SJESTurmas RecursaisNovembro","2018Turmas RecursaisNovembro","2018SJESTurmas Recursais","2018Turmas Recursais",2018,"SJES","Turmas Recursais","Novembro",299,1291,0,14560,446,59,0,957,null,null,null,null,null,299,1291,0,14560,"Ok","Ok","Ok","Ok",null,null,null,null,null,null,null,null,null,null,null,null,null,null,null,null,null,null,null,null,null,null,null,446,59,0,957,"Ok","Ok","Ok","Ok"]
["2018SJESVarasDezembro","2018VarasDezembro","2018SJESVaras","2018Varas",2018,"SJES","Varas","Dezembro",265,831,213,95889,2280,269,36,30388,null,"12Ant","12Atu",null,null,265,831,213,95889,null,null,null,null,null,null,null,null,null,null,null,null,null,null,null,null,null,null,null,null,null,null,null,"12Ant","12Atu",null,null,2280,269,36,30388]
["2018SJESJuizadosDezembro","2018JuizadosDezembro","2018SJESJuizados","2018Juizados",2018,"SJES","Juizados","Dezembro",3,477,251,11569,2015,782,277,21075,null,2255,2255,{"$f":"S108-R108","v":0},null,3,477,251,11569,null,null,null,null,null,null,null,null,null,null,null,null,null,null,null,null,null,null,null,null,null,null,null,1163,1163,{"$f":"AX108-AW108","v":0},null,2015,782,277,21075]
["2018SJESTurmas RecursaisDezembro","2018Turmas RecursaisDezembro","2018SJESTurmas Recursais","2018Turmas Recursais",2018,"SJES","Turmas Recursais","Dezembro",233,947,0,13698,281,112,0,1182,null,null,null,null,null,233,947,0,13698,null,null,null,null,null,null,null,null,null,null,null,null,null,null,null,null,null,null,null,null,null,null,null,null,null,null,null,281,112,0,1182]
[{"$f":"E110&F110&G110&H110","v":"2018SJRJVarasJaneiro"},"2018VarasJaneiro","2018SJRJVaras","2018Varas",2018,"SJRJ","Varas","Janeiro",9338,8260,1356,622019,0,0,0,0,null,"01Ant","01Atu",null,null,9338,8260,1356,622019,"Ok","Ok","Ok","Ok",null,null,"Ok",null,null,"Ok",null,"Ok",null,null,"Ok","Ok","Ok","Ok","Ok","Ok","Ok","Ok",null,"01Ant","01Atu",null,null,0,0,0,0,"Ok","Ok","Ok","Ok",null,"Ok","Ok","Ok","Ok","Ok","Ok","Ok","Ok","Ok","Ok","Ok"]
["2018SJRJJuizadosJaneiro","2018JuizadosJaneiro","2018SJRJJuizados","2018Juizados",2018,"SJRJ","Juizados","Janeiro",8591,6660,1973,141802,0,0,0,0,null,16849,17137,{"$f":"S111-R111","v":288},null,8591,6660,1973,141802,"Ok","Ok","Ok","Ok",null,null,"Ok",null,null,"Ok",null,"Ok",null,null,"Ok","Ok","Ok","Ok","Ok","Ok","Ok","Ok",null,0,0,{"$f":"AX111-AW111","v":0},null,0,0,0,0,"Ok","Ok","Ok","Ok",null,"Ok","Ok","Ok","Ok","Ok","Ok","Ok","Ok","Ok","Ok","Ok"]
["2018SJRJTurmas RecursaisJaneiro","2018Turmas RecursaisJaneiro","2018SJRJTurmas Recursais","2018Turmas Recursais",2018,"SJRJ","Turmas Recursais","Janeiro",1958,2217,0,57812,0,0,0,0,null,null,null,null,null,1958,2217,0,57812,"Ok","Ok","Ok","Ok",null,null,"Ok",null,null,193,null,"Ok",null,null,82,3,2,1,5,"Ok",1,1,null,null,null,null,null,0,0,0,0,"Ok","Ok","Ok","Ok",null,"Ok","Ok","Ok","Ok","Ok","Ok","Ok","Ok","Ok","Ok","Ok"]
["2018SJRJVarasFevereiro","2018VarasFevereiro","2018SJRJVaras","2018Varas",2018,"SJRJ","Varas","Fevereiro",6065,7432,1349,613659,0,0,0,0,null,"02Ant","02Atu",null,null,6065,7432,1349,613659,"Ok","Ok","Ok","Ok",null,null,null,null,null,null,null,"Ok",null,null,"Ok","Ok","Ok","Ok","Ok","Ok","Ok","Ok",null,"02Ant","02Atu",null,null,0,0,0,0,"Ok","Ok","Ok","Ok",null,null,null,"Ok","Ok","Ok","Ok","Ok","Ok","Ok","Ok","Ok"]
["2018SJRJJuizadosFevereiro","2018JuizadosFevereiro","2018SJRJJuizados","2018Juizados",2018,"SJRJ","Juizados","Fevereiro",7287,8778,2506,141269,0,0,0,0,null,19502,19679,{"$f":"S114-R114","v":177},null,7287,8778,2506,141269,"Ok","Ok","Ok","Ok",null,null,null,null,null,null,null,"Ok",null,null,"Ok","Ok","Ok","Ok","Ok","Ok","Ok","Ok",null,0,0,{"$f":"AX114-AW114","v":0},null,0,0,0,0,"Ok","Ok","Ok","Ok",null,null,null,"Ok","Ok","Ok","Ok","Ok","Ok","Ok","Ok","Ok"]
["2018SJRJTurmas RecursaisFevereiro","2018Turmas RecursaisFevereiro","2018SJRJTurmas Recursais","2018Turmas Recursais",2018,"SJRJ","Turmas Recursais","Fevereiro",2644,3469,0,57441,0,0,0,0,null,null,null,null,null,2644,3469,0,57441,"Ok","Ok","Ok","Ok",null,null,null,null,null,null,null,"Ok",null,null,166,5,-1,1,1,"Ok","Ok",5,null,null,null,null,null,0,0,0,0,"Ok","Ok","Ok","Ok",null,null,null,"Ok","Ok","Ok","Ok","Ok","Ok","Ok","Ok","Ok"]
["2018SJRJVarasMarço","2018VarasMarço","2018SJRJVaras","2018Varas",2018,"SJRJ","Varas","Março",6598,9747,1740,608484,0,0,0,0,null,"03Ant","03Atu",null,null,6598,9747,1740,608484,"Ok","Ok","Ok","Ok",null,null,null,null,null,null,null,null,null,null,"Ok","Ok","Ok","Ok","Ok","Ok","Ok","Ok",null,"03Ant","03Atu",null,null,0,0,0,0,"Ok","Ok","Ok","Ok",null,null,null,null,"Ok","Ok","Ok","Ok","Ok","Ok","Ok","Ok"]
["2018SJRJJuizadosMarço","2018JuizadosMarço","2018SJRJJuizados","2018Juizados",2018,"SJRJ","Juizados","Março",8985,10344,2635,142338,342,5,0,0,null,23796,23856,{"$f":"S117-R117","v":60},null,8985,10344,2635,142338,"Ok","Ok","Ok","Ok",null,null,null,null,null,null,null,null,null,null,"Ok","Ok","Ok","Ok","Ok","Ok","Ok","Ok",null,5,5,{"$f":"AX117-AW117","v":0},null,342,5,0,0,"Ok","Ok","Ok","Ok",null,null,null,null,"Ok","Ok","Ok","Ok","Ok","Ok","Ok","Ok"]
["2018SJRJTurmas RecursaisMarço","2018Turmas RecursaisMarço","2018SJRJTurmas Recursais","2018Turmas Recursais",2018,"SJRJ","Turmas Recursais","Março",2590,3765,0,56872,0,0,0,0,null,null,null,null,null,2590,3765,0,56872,"Ok","Ok","Ok","Ok",null,null,null,null,null,null,null,null,null,null,"Ok",43,5,4,1,"Ok",2,5,null,null,null,null,null,0,0,0,0,"Ok","Ok","Ok","Ok",null,null,null,null,"Ok","Ok","Ok","Ok","Ok","Ok","Ok","Ok"]
["2018SJRJVarasAbril","2018VarasAbril","2018SJRJVaras","2018Varas",2018,"SJRJ","Varas","Abril",15884,10595,1717,613541,14,0,0,0,null,"04Ant","04Atu",null,null,15884,10595,1717,613541,"Ok","Ok","Ok","Ok",null,null,null,null,null,null,null,null,null,null,null,"Ok","Ok","Ok","Ok","Ok","Ok","Ok",null,"04Ant","04Atu",null,null,14,0,0,0,"Ok","Ok","Ok","Ok",null,null,null,null,null,"Ok","Ok","Ok","Ok","Ok","Ok","Ok"]
["2018SJRJJuizadosAbril","2018JuizadosAbril","2018SJRJJuizados","2018Juizados",2018,"SJRJ","Juizados","Abril",5855,10336,3193,140316,3492,125,1,3648,null,24204,24454,{"$f":"S120-R120","v":250},null,5855,10336,3193,140316,"Ok","Ok","Ok","Ok",null,null,null,null,null,null,null,null,null,null,null,"Ok","Ok","Ok","Ok","Ok","Ok","Ok",null,125,125,{"$f":"AX120-AW120","v":0},null,3492,125,1,3648,"Ok","Ok","Ok","Ok",null,null,null,null,null,"Ok","Ok","Ok","Ok","Ok","Ok","Ok"]
["2018SJRJTurmas RecursaisAbril","2018Turmas RecursaisAbril","2018SJRJTurmas Recursais","2018Turmas Recursais",2018,"SJRJ","Turmas Recursais","Abril",3177,3523,0,56110,2,0,0,2,null,null,null,null,null,3177,3523,0,56110,"Ok","Ok","Ok","Ok",null,null,null,null,null,null,null,null,null,null,null,191,35,16,2,-1,4,3,null,null,null,null,null,2,0,0,2,"Ok","Ok","Ok","Ok",null,null,null,null,null,"Ok","Ok","Ok","Ok","Ok","Ok","Ok"]
["2018SJRJVarasMaio","2018VarasMaio","2018SJRJVaras","2018Varas",2018,"SJRJ","Varas","Maio",8077,12527,2252,610014,997,30,0,916,null,"05Ant","05Atu",null,null,8077,12527,2252,610014,"Ok","Ok","Ok","Ok",null,null,null,null,null,null,null,null,null,null,null,null,"Ok","Ok","Ok","Ok","Ok","Ok",null,"05Ant","05Atu",null,null,997,30,0,916,"Ok","Ok","Ok","Ok",null,null,null,null,null,null,"Ok","Ok","Ok","Ok","Ok","Ok"]
["2018SJRJJuizadosMaio","2018JuizadosMaio","2018SJRJJuizados","2018Juizados",2018,"SJRJ","Juizados","Maio",3452,19064,2956,134356,7712,443,1,10975,null,35520,35961,{"$f":"S123-R123","v":441},null,3452,19064,2956,134356,"Ok","Ok","Ok","Ok",null,null,null,null,null,null,null,null,null,null,null,null,"Ok","Ok","Ok","Ok","Ok","Ok",null,475,475,{"$f":"AX123-AW123","v":0},null,7712,443,1,10975,"Ok","Ok","Ok","Ok",null,null,null,null,null,null,"Ok","Ok","Ok","Ok","Ok","Ok"]
["2018SJRJTurmas RecursaisMaio","2018Turmas RecursaisMaio","2018SJRJTurmas Recursais","2018Turmas Recursais",2018,"SJRJ","Turmas Recursais","Maio",2890,4370,0,56361,21,2,0,23,null,null,null,null,null,2890,4370,0,56361,"Ok","Ok","Ok","Ok",null,null,null,null,null,null,null,null,null,null,null,null,206,88,34,94,9,10,null,null,null,null,null,21,2,0,23,"Ok","Ok","Ok","Ok",null,null,null,null,null,null,"Ok","Ok","Ok","Ok","Ok","Ok"]
["2018SJRJVarasJunho","2018VarasJunho","2018SJRJVaras","2018Varas",2018,"SJRJ","Varas","Junho",6180,10491,2141,606727,1487,68,7,2317,null,"06Ant","06Atu",null,null,6180,10491,2141,606727,"Ok","Ok","Ok","Ok",null,null,null,null,null,null,null,null,null,null,null,null,null,"Ok","Ok","Ok","Ok","Ok",null,"06Ant","06Atu",null,null,1487,68,7,2317,"Ok","Ok","Ok","Ok",null,null,null,null,null,null,null,"Ok","Ok","Ok","Ok","Ok"]
["2018SJRJJuizadosJunho","2018JuizadosJunho","2018SJRJJuizados","2018Juizados",2018,"SJRJ","Juizados","Junho",889,23419,4433,114265,8427,1117,44,19446,null,39500,39882,{"$f":"S126-R126","v":382},null,889,23419,4433,114265,"Ok","Ok","Ok","Ok",null,null,null,null,null,null,null,null,null,null,null,null,null,"Ok","Ok","Ok","Ok","Ok",null,1186,1186,{"$f":"AX126-AW126","v":0},null,8427,1117,44,19446,"Ok","Ok","Ok","Ok",null,null,null,null,null,null,null,"Ok","Ok","Ok","Ok","Ok"]
["2018SJRJTurmas RecursaisJunho","2018Turmas RecursaisJunho","2018SJRJTurmas Recursais","2018Turmas Recursais",2018,"SJRJ","Turmas Recursais","Junho",4361,5972,0,57838,69,1,0,91,null,null,null,null,null,4361,5972,0,57838,"Ok","Ok","Ok","Ok",null,null,null,null,null,null,null,null,null,null,null,null,null,321,44,10,2,5,null,null,null,null,null,69,1,0,91,"Ok","Ok","Ok","Ok",null,null,null,null,null,null,null,"Ok","Ok","Ok","Ok","Ok"]
["2018SJRJVarasJulho","2018VarasJulho","2018SJRJVaras","2018Varas",2018,"SJRJ","Varas","Julho",1516,7879,2893,597546,5601,142,6,7334,null,"07Ant","07Atu",null,null,1516,7879,2893,597546,"Ok","Ok","Ok","Ok",null,null,null,null,null,null,null,null,null,null,null,null,null,null,"Ok","Ok","Ok","Ok",null,"07Ant","07Atu",null,null,5601,142,6,7334,"Ok","Ok","Ok","Ok",null,null,null,null,null,null,null,null,"Ok","Ok","Ok","Ok"]
["2018SJRJJuizadosJulho","2018JuizadosJulho","2018SJRJJuizados","2018Juizados",2018,"SJRJ","Juizados","Julho",20,12310,5438,98178,9933,2026,148,28126,null,24774,25670,{"$f":"S129-R129","v":896},null,20,12310,5438,98178,"Ok","Ok","Ok","Ok",null,null,null,null,null,null,null,null,null,null,null,null,null,null,"Ok","Ok","Ok","Ok",null,2172,2172,{"$f":"AX129-AW129","v":0},null,9933,2026,148,28126,"Ok","Ok","Ok","Ok",null,null,null,null,null,null,null,null,"Ok","Ok","Ok","Ok"]
["2018SJRJTurmas RecursaisJulho",{"$f":"E130&G130&H130","v":"2018Turmas RecursaisJulho"},{"$f":"E130&F130&G130","v":"2018SJRJTurmas Recursais"},{"$f":"E130&G130","v":"2018Turmas Recursais"},2018,"SJRJ","Turmas Recursais","Julho",4912,5481,0,58101,173,4,0,261,null,null,null,null,null,4912,5481,0,58101,"Ok","Ok","Ok","Ok",null,null,null,null,null,null,null,null,null,null,null,null,null,null,828,41,14,13,null,null,null,null,null,173,4,0,261,"Ok","Ok","Ok","Ok",null,null,null,null,null,null,null,null,"Ok","Ok","Ok","Ok"]
["2018SJRJVarasAgosto","2018VarasAgosto","2018SJRJVaras","2018Varas",2018,"SJRJ","Varas","Agosto",1514,11873,2777,585316,7772,383,23,14301,null,"08Ant","08Atu",null,null,1514,11873,2777,585316,"Ok","Ok","Ok","Ok",null,null,null,null,null,null,null,null,null,null,null,null,null,null,null,"Ok","Ok","Ok",null,"08Ant","08Atu",null,null,7772,383,23,14301,"Ok","Ok","Ok","Ok",null,null,null,null,null,null,null,null,null,"Ok","Ok","Ok"]
["2018SJRJJuizadosAgosto","2018JuizadosAgosto","2018SJRJJuizados","2018Juizados",2018,"SJRJ","Juizados","Agosto",10,12558,3708,83467,10846,3549,285,37369,null,30274,30362,{"$f":"S132-R132","v":88},null,10,12558,3708,83467,"Ok","Ok","Ok","Ok",null,null,null,null,null,null,null,null,null,null,null,null,null,null,null,"Ok","Ok","Ok",null,3946,3946,{"$f":"AX132-AW132","v":0},null,10846,3549,285,37369,"Ok","Ok","Ok","Ok",null,null,null,null,null,null,null,null,null,"Ok","Ok","Ok"]
["2018SJRJTurmas RecursaisAgosto","2018Turmas RecursaisAgosto","2018SJRJTurmas Recursais","2018Turmas Recursais",2018,"SJRJ","Turmas Recursais","Agosto",4171,5931,0,59073,338,14,0,596,null,null,null,null,null,4171,5931,0,59073,"Ok","Ok","Ok","Ok",null,null,null,null,null,null,null,null,null,null,null,null,null,null,null,73,7,8,null,null,null,null,null,338,14,0,596,"Ok","Ok","Ok","Ok",null,null,null,null,null,null,null,null,null,"Ok","Ok","Ok"]
["2018SJRJVarasSetembro","2018VarasSetembro","2018SJRJVaras","2018Varas",2018,"SJRJ","Varas","Setembro",1229,8888,2231,576834,5731,517,44,19107,null,"09Ant","09Atu",null,null,1229,8888,2231,576834,"Ok","Ok","Ok","Ok",null,null,null,null,null,null,null,null,null,null,null,null,null,null,null,null,"Ok","Ok",null,"09Ant","09Atu",null,null,5731,517,44,19107,"Ok","Ok","Ok","Ok",null,null,null,null,null,null,null,null,null,null,"Ok","Ok"]
["2018SJRJJuizadosSetembro","2018JuizadosSetembro","2018SJRJJuizados","2018Juizados",2018,"SJRJ","Juizados","Setembro",8,10413,2984,70234,9447,3964,515,45387,null,23972,24268,{"$f":"S135-R135","v":296},null,8,10413,2984,70234,"Ok","Ok","Ok","Ok",null,null,null,null,null,null,null,null,null,null,null,null,null,null,null,null,"Ok","Ok",null,4501,4501,{"$f":"AX135-AW135","v":0},null,9447,3964,515,45387,"Ok","Ok","Ok","Ok",null,null,null,null,null,null,null,null,null,null,"Ok","Ok"]
["2018SJRJTurmas RecursaisSetembro","2018Turmas RecursaisSetembro","2018SJRJTurmas Recursais","2018Turmas Recursais",2018,"SJRJ","Turmas Recursais","Setembro",2965,4967,0,58083,564,20,0,1156,null,null,null,null,null,2965,4967,0,58083,"Ok","Ok","Ok","Ok",null,null,null,null,null,null,null,null,null,null,null,null,null,null,null,null,280,16,null,null,null,null,null,564,20,0,1156,"Ok","Ok","Ok","Ok",null,null,null,null,null,null,null,null,null,null,"Ok","Ok"]
["2018SJRJVarasOutubro","2018VarasOutubro","2018SJRJVaras","2018Varas",2018,"SJRJ","Varas","Outubro",1290,9729,2858,565794,7260,806,129,24620,null,"10Ant","10Atu",null,null,1290,9729,2858,565794,"Ok","Ok","Ok","Ok",null,null,null,null,null,null,null,null,null,null,null,null,null,null,null,null,null,"Ok",null,"10Ant","10Atu",null,null,7260,806,129,24620,"Ok","Ok","Ok","Ok",null,null,null,null,null,null,null,null,null,null,null,"Ok"]
["2018SJRJJuizadosOutubro","2018JuizadosOutubro","2018SJRJJuizados","2018Juizados",2018,"SJRJ","Juizados","Outubro",8,7724,2181,51846,10742,6399,1196,62845,null,21873,21932,{"$f":"S138-R138","v":59},null,8,7724,2181,51846,"Ok","Ok","Ok","Ok",null,null,null,null,null,null,null,null,null,null,null,null,null,null,null,null,null,"Ok",null,7507,7507,{"$f":"AX138-AW138","v":0},null,10742,6399,1196,62845,"Ok","Ok","Ok","Ok",null,null,null,null,null,null,null,null,null,null,null,"Ok"]
["2018SJRJTurmas RecursaisOutubro","2018Turmas RecursaisOutubro","2018SJRJTurmas Recursais","2018Turmas Recursais",2018,"SJRJ","Turmas Recursais","Outubro",2122,4479,0,55392,1262,302,0,2398,null,null,null,null,null,2122,4479,0,55392,{"$f":"IF(I139=V139,\"Ok\",I139-V139)","v":"Ok"},{"$f":"IF(J139=W139,\"Ok\",J139-W139)","v":"Ok"},{"$f":"IF(K139=X139,\"Ok\",K139-X139)","v":"Ok"},{"$f":"IF(L139=Y139,\"Ok\",L139-Y139)","v":"Ok"},null,null,null,null,null,null,null,null,null,null,null,null,null,null,null,null,null,59,null,null,null,null,null,1262,302,0,2398,{"$f":"IF(M139=BA139,\"Ok\",M139-BA139)","v":"Ok"},{"$f":"IF(N139=BB139,\"Ok\",N139-BB139)","v":"Ok"},{"$f":"IF(O139=BC139,\"Ok\",O139-BC139)","v":"Ok"},{"$f":"IF(P139=BD139,\"Ok\",P139-BD139)","v":"Ok"},null,null,null,null,null,null,null,null,null,null,null,"Ok"]
["2018SJRJVarasNovembro","2018VarasNovembro","2018SJRJVaras","2018Varas",2018,"SJRJ","Varas","Novembro",809,7058,1697,558734,5834,744,105,29457,null,"11Ant","11Atu",null,null,809,7058,1697,558734,{"$f":"IF(I140=V140,\"Ok\",I140-V140)","v":"Ok"},"Ok","Ok","Ok",null,null,null,null,null,null,null,null,null,null,null,null,null,null,null,null,null,null,null,"11Ant","11Atu",null,null,5834,744,105,29457,"Ok","Ok","Ok","Ok"]
["2018SJRJJuizadosNovembro","2018JuizadosNovembro","2018SJRJJuizados","2018Juizados",2018,"SJRJ","Juizados","Novembro",1,4212,991,41630,8901,5680,1851,73534,null,13893,13981,{"$f":"S141-R141","v":88},null,1,4212,991,41630,"Ok","Ok","Ok","Ok",null,null,null,null,null,null,null,null,null,null,null,null,null,null,null,null,null,null,null,6811,6811,{"$f":"AX141-AW141","v":0},null,8901,5680,1851,73534,"Ok","Ok","Ok","Ok"]
["2018SJRJTurmas RecursaisNovembro","2018Turmas RecursaisNovembro","2018SJRJTurmas Recursais","2018Turmas Recursais",2018,"SJRJ","Turmas Recursais","Novembro",992,2711,0,53258,1895,387,0,4249,null,null,null,null,null,992,2711,0,53258,"Ok","Ok","Ok","Ok",null,null,null,null,null,null,null,null,null,null,null,null,null,null,null,null,null,null,null,null,null,null,null,1895,387,0,4249,{"$f":"IF(M142=BA142,\"Ok\",M142-BA142)","v":"Ok"},{"$f":"IF(N142=BB142,\"Ok\",N142-BB142)","v":"Ok"},{"$f":"IF(O142=BC142,\"Ok\",O142-BC142)","v":"Ok"},{"$f":"IF(P142=BD142,\"Ok\",P142-BD142)","v":"Ok"}]
["2018SJRJVarasDezembro","2018VarasDezembro","2018SJRJVaras","2018Varas",2018,"SJRJ","Varas","Dezembro",620,5333,1127,530063,9097,840,157,61696,null,"12Ant","12Atu",null,null,620,5333,1127,530063,null,null,null,null,null,null,null,null,null,null,null,null,null,null,null,null,null,null,null,null,null,null,null,"12Ant","12Atu",null,null,9097,840,157,61696]
["2018SJRJJuizadosDezembro","2018JuizadosDezembro","2018SJRJJuizados","2018Juizados",2018,"SJRJ","Juizados","Dezembro",2,2556,580,36713,8372,5169,1389,80327,null,9880,9880,{"$f":"S144-R144","v":0},null,2,2556,580,36713,null,null,null,null,null,null,null,null,null,null,null,null,null,null,null,null,null,null,null,null,null,null,null,6465,6465,{"$f":"AX144-AW144","v":0},null,8372,5169,1389,80327]
["2018SJRJTurmas RecursaisDezembro","2018Turmas RecursaisDezembro","2018SJRJTurmas Recursais","2018Turmas Recursais",2018,"SJRJ","Turmas Recursais","Dezembro",70,1991,0,50962,1424,456,0,5497,null,null,null,null,null,70,1991,0,50962,null,null,null,null,null,null,null,null,null,null,null,null,null,null,null,null,null,null,null,null,null,null,null,null,null,null,null,1424,456,0,5497]
["2017SJESVarasJaneiro","2017VarasJaneiro","2017SJESVaras","2017Varas",2017,"SJES","Varas","Janeiro",2955,792,233,124525,null,null,null,null,null,"01Ant","01Atu",null,null,2955,792,233,124525,"Ok","Ok","Ok","Ok",null,1,"Ok","Ok",1,"Ok",1,"Ok","Ok",1,"Ok","Ok","Ok","Ok","Ok","Ok","Ok","Ok"]
["2017SJESJuizadosJaneiro","2017JuizadosJaneiro","2017SJESJuizados","2017Juizados",2017,"SJES","Juizados","Janeiro",1543,1182,415,40309,null,null,null,null,null,2037,2047,{"$f":"S147-R147","v":10},null,1543,1182,415,40309,"Ok","Ok","Ok","Ok",null,"Ok","Ok","Ok","Ok","Ok","Ok","Ok","Ok","Ok","Ok","Ok","Ok","Ok","Ok","Ok","Ok","Ok"]
["2017SJESTurmas RecursaisJaneiro","2017Turmas RecursaisJaneiro","2017SJESTurmas Recursais","2017Turmas Recursais",2017,"SJES","Turmas Recursais","Janeiro",397,73,0,18895,null,null,null,null,null,null,null,null,null,397,73,0,18895,"Ok","Ok","Ok","Ok",null,-1,-10,"Ok",-1,"Ok",-1,"Ok","Ok",-1,"Ok","Ok","Ok","Ok","Ok","Ok","Ok","Ok"]
["2017SJESVarasFevereiro","2017VarasFevereiro","2017SJESVaras","2017Varas",2017,"SJES","Varas","Fevereiro",1011,906,367,124801,null,null,null,null,null,"02Ant","02Atu",null,null,1011,906,367,124801,"Ok","Ok","Ok","Ok",null,null,null,null,null,"Ok",-454,-651,-303,6884,"Ok","Ok","Ok","Ok","Ok","Ok","Ok","Ok"]
["2017SJESJuizadosFevereiro","2017JuizadosFevereiro","2017SJESJuizados","2017Juizados",2017,"SJES","Juizados","Fevereiro",1278,1020,364,40810,null,null,null,null,null,4031,3104,{"$f":"S150-R150","v":-927},null,1278,1020,364,40810,"Ok","Ok","Ok","Ok",null,null,null,null,null,"Ok",-172,-475,-296,5563,"Ok","Ok","Ok","Ok","Ok","Ok","Ok","Ok"]
["2017SJESTurmas RecursaisFevereiro","2017Turmas RecursaisFevereiro","2017SJESTurmas Recursais","2017Turmas Recursais",2017,"SJES","Turmas Recursais","Fevereiro",374,1178,0,18432,null,null,null,null,null,null,null,null,null,374,1178,0,18432,"Ok","Ok","Ok","Ok",null,null,null,null,null,"Ok",-272,198,"Ok",374,"Ok",1,"Ok","Ok","Ok","Ok","Ok","Ok"]
["2017SJESVarasMarço","2017VarasMarço","2017SJESVaras","2017Varas",2017,"SJES","Varas","Março",2692,1481,380,125458,null,null,null,null,null,"03Ant","03Atu",null,null,2692,1481,380,125458,"Ok","Ok","Ok","Ok",null,null,null,null,null,null,1345,-289,-134,7776,"Ok","Ok","Ok","Ok","Ok","Ok","Ok","Ok"]
["2017SJESJuizadosMarço","2017JuizadosMarço","2017SJESJuizados","2017Juizados",2017,"SJES","Juizados","Março",2157,1970,790,40884,null,null,null,null,null,4467,4276,{"$f":"S153-R153","v":-191},null,2157,1970,790,40884,"Ok","Ok","Ok","Ok",null,null,null,null,null,null,360,415,232,5247,"Ok","Ok","Ok","Ok","Ok","Ok","Ok","Ok"]
["2017SJESTurmas RecursaisMarço","2017Turmas RecursaisMarço","2017SJESTurmas Recursais","2017Turmas Recursais",2017,"SJES","Turmas Recursais","Março",748,825,0,18612,null,null,null,null,null,null,null,null,null,748,825,0,18612,"Ok","Ok","Ok","Ok",null,null,null,null,null,null,365,-322,"Ok",774,4,"Ok",1,"Ok","Ok","Ok","Ok","Ok"]
["2017SJESVarasAbril","2017VarasAbril","2017SJESVaras","2017Varas",2017,"SJES","Varas","Abril",1515,1015,257,125696,null,null,null,null,null,"04Ant","04Atu",null,null,1515,1015,257,125696,"Ok","Ok","Ok","Ok",null,null,null,null,null,null,null,null,null,null,"Ok","Ok","Ok","Ok","Ok","Ok","Ok","Ok"]
["2017SJESJuizadosAbril","2017JuizadosAbril","2017SJESJuizados","2017Juizados",2017,"SJES","Juizados","Abril",1667,1031,432,41501,null,null,null,null,null,2529,2545,{"$f":"S156-R156","v":16},null,1667,1031,432,41501,"Ok","Ok","Ok","Ok",null,null,null,null,null,null,null,null,null,null,"Ok","Ok","Ok","Ok","Ok","Ok","Ok","Ok"]
["2017SJESTurmas RecursaisAbril","2017Turmas RecursaisAbril","2017SJESTurmas Recursais","2017Turmas Recursais",2017,"SJES","Turmas Recursais","Abril",385,499,0,18392,null,null,null,null,null,null,null,null,null,385,499,0,18392,"Ok","Ok","Ok","Ok",null,null,null,null,null,null,null,null,null,null,8,8,"Ok","Ok","Ok","Ok","Ok","Ok"]
["2017SJESVarasMaio","2017VarasMaio","2017SJESVaras","2017Varas",2017,"SJES","Varas","Maio",1392,1954,431,125499,null,null,null,null,null,"05Ant","05Atu",null,null,1392,1954,431,125499,"Ok","Ok","Ok","Ok",null,null,null,null,null,null,null,null,null,null,null,"Ok","Ok","Ok","Ok","Ok","Ok","Ok"]
["2017SJESJuizadosMaio","2017JuizadosMaio","2017SJESJuizados","2017Juizados",2017,"SJES","Juizados","Maio",2217,1930,485,42410,null,null,null,null,null,5638,5680,{"$f":"S159-R159","v":42},null,2217,1930,485,42410,"Ok","Ok","Ok","Ok",null,null,null,null,null,null,null,null,null,null,null,"Ok","Ok","Ok","Ok","Ok","Ok","Ok"]
["2017SJESTurmas RecursaisMaio","2017Turmas RecursaisMaio","2017SJESTurmas Recursais","2017Turmas Recursais",2017,"SJES","Turmas Recursais","Maio",522,1796,0,18424,null,null,null,null,null,null,null,null,null,522,1796,0,18424,"Ok","Ok","Ok","Ok",null,null,null,null,null,null,null,null,null,null,null,42,"Ok","Ok","Ok","Ok","Ok","Ok"]
["2017SJESVarasJunho","2017VarasJunho","2017SJESVaras","2017Varas",2017,"SJES","Varas","Junho",1535,1789,294,125442,null,null,null,null,null,"06Ant","06Atu",null,null,1535,1789,294,125442,"Ok","Ok","Ok","Ok",null,null,null,null,null,null,null,null,null,null,null,null,"Ok","Ok","Ok","Ok","Ok","Ok"]
["2017SJESJuizadosJunho","2017JuizadosJunho","2017SJESJuizados","2017Juizados",2017,"SJES","Juizados","Junho",2080,2014,512,43073,null,null,null,null,null,4893,4896,{"$f":"S162-R162","v":3},null,2080,2014,512,43073,"Ok","Ok","Ok","Ok",null,null,null,null,null,null,null,null,null,null,null,null,"Ok","Ok","Ok","Ok","Ok","Ok"]
["2017SJESTurmas RecursaisJunho","2017Turmas RecursaisJunho","2017SJESTurmas Recursais","2017Turmas Recursais",2017,"SJES","Turmas Recursais","Junho",443,1093,0,18303,null,null,null,null,null,null,null,null,null,443,1093,0,18303,"Ok","Ok","Ok","Ok",null,null,null,null,null,null,null,null,null,null,null,null,2,"Ok",1,"Ok","Ok","Ok"]
["2017SJESVarasJulho","2017VarasJulho","2017SJESVaras","2017Varas",2017,"SJES","Varas","Julho",1971,1675,341,125609,null,null,null,null,null,"07Ant","07Atu",null,null,1971,1675,341,125609,"Ok","Ok","Ok","Ok",null,null,null,null,null,null,null,null,null,null,null,null,null,"Ok","Ok","Ok","Ok","Ok"]
["2017SJESJuizadosJulho","2017JuizadosJulho","2017SJESJuizados","2017Juizados",2017,"SJES","Juizados","Julho",2131,1737,633,43285,null,null,null,null,null,3849,3853,{"$f":"S165-R165","v":4},null,2131,1737,633,43285,"Ok","Ok","Ok","Ok",null,null,null,null,null,null,null,null,null,null,null,null,null,"Ok","Ok","Ok","Ok","Ok"]
["2017SJESTurmas RecursaisJulho","2017Turmas RecursaisJulho","2017SJESTurmas Recursais","2017Turmas Recursais",2017,"SJES","Turmas Recursais","Julho",653,441,0,17960,null,null,null,null,null,null,null,null,null,653,441,0,17960,"Ok","Ok","Ok","Ok",null,null,null,null,null,null,null,null,null,null,null,null,null,3,1,"Ok","Ok","Ok"]
[{"$f":"E167&F167&G167&H167","v":"2017SJESVarasAgosto"},"2017VarasAgosto","2017SJESVaras","2017Varas",2017,"SJES","Varas","Agosto",1805,2815,490,124658,null,null,null,null,null,"08Ant","08Atu",null,null,1805,2815,490,124658,"Ok","Ok","Ok","Ok",null,null,null,null,null,null,null,null,null,null,null,null,null,null,"Ok","Ok","Ok","Ok"]
["2017SJESJuizadosAgosto","2017JuizadosAgosto","2017SJESJuizados","2017Juizados",2017,"SJES","Juizados","Agosto",2071,1976,638,43265,null,null,null,null,null,5955,5957,{"$f":"S168-R168","v":2},null,2071,1976,638,43265,"Ok","Ok","Ok","Ok",null,null,null,null,null,null,null,null,null,null,null,null,null,null,"Ok","Ok","Ok","Ok"]
["2017SJESTurmas RecursaisAgosto","2017Turmas RecursaisAgosto","2017SJESTurmas Recursais","2017Turmas Recursais",2017,"SJES","Turmas Recursais","Agosto",640,1166,0,18050,null,null,null,null,null,null,null,null,null,640,1166,0,18050,"Ok","Ok","Ok","Ok",null,null,null,null,null,null,null,null,null,null,null,null,null,null,2,"Ok","Ok","Ok"]
["2017SJESVarasSetembro","2017VarasSetembro","2017SJESVaras","2017Varas",2017,"SJES","Varas","Setembro",2062,1467,413,124994,null,null,null,null,null,"09Ant","09Atu",null,null,2062,1467,413,124994,"Ok","Ok","Ok","Ok",null,null,null,null,null,null,null,null,null,null,null,null,null,null,null,"Ok","Ok","Ok"]
["2017SJESJuizadosSetembro","2017JuizadosSetembro","2017SJESJuizados","2017Juizados",2017,"SJES","Juizados","Setembro",1801,1927,480,43511,null,null,null,null,null,4431,4486,{"$f":"S171-R171","v":55},null,1801,1927,480,43511,"Ok","Ok","Ok","Ok",null,null,null,null,null,null,null,null,null,null,null,null,null,null,null,"Ok","Ok","Ok"]
["2017SJESTurmas RecursaisSetembro","2017Turmas RecursaisSetembro","2017SJESTurmas Recursais","2017Turmas Recursais",2017,"SJES","Turmas Recursais","Setembro",460,1092,0,18132,null,null,null,null,null,null,null,null,null,460,1092,0,18132,"Ok","Ok","Ok","Ok",null,null,null,null,null,null,null,null,null,null,null,null,null,null,null,31,24,"Ok"]
["2017SJESVarasOutubro","2017VarasOutubro","2017SJESVaras","2017Varas",2017,"SJES","Varas","Outubro",2158,2256,634,124691,null,null,null,null,null,"10Ant","10Atu",null,null,2158,2256,634,124691,"Ok","Ok","Ok","Ok",null,null,null,null,null,null,null,null,null,null,null,null,null,null,null,null,"Ok","Ok"]
["2017SJESJuizadosOutubro","2017JuizadosOutubro","2017SJESJuizados","2017Juizados",2017,"SJES","Juizados","Outubro",2033,2346,819,43016,null,null,null,null,null,5597,5614,{"$f":"S174-R174","v":17},null,2033,2346,819,43016,"Ok","Ok","Ok","Ok",null,null,null,null,null,null,null,null,null,null,null,null,null,null,null,null,"Ok","Ok"]
["2017SJESTurmas RecursaisOutubro","2017Turmas RecursaisOutubro","2017SJESTurmas Recursais",{"$f":"E175&G175","v":"2017Turmas Recursais"},2017,"SJES","Turmas Recursais","Outubro",833,1012,0,18338,null,null,null,null,null,null,null,null,null,833,1012,0,18338,"Ok","Ok","Ok","Ok",null,null,null,null,null,null,null,null,null,null,null,null,null,null,null,null,16,1]
["2017SJESVarasNovembro","2017VarasNovembro","2017SJESVaras","2017Varas",2017,"SJES","Varas","Novembro",2005,1514,384,124728,null,null,null,null,null,"11Ant","11Atu",null,null,2005,1514,384,124728,"Ok","Ok","Ok","Ok",null,null,null,null,null,null,null,null,null,null,null,null,null,null,null,null,null,"Ok"]
["2017SJESJuizadosNovembro","2017JuizadosNovembro","2017SJESJuizados","2017Juizados",2017,"SJES","Juizados","Novembro",1746,1998,596,42917,null,null,null,null,null,5008,5009,{"$f":"S177-R177","v":1},null,1746,1998,596,42917,"Ok","Ok","Ok","Ok",null,null,null,null,null,null,null,null,null,null,null,null,null,null,null,null,null,"Ok"]
["2017SJESTurmas RecursaisNovembro","2017Turmas RecursaisNovembro","2017SJESTurmas Recursais","2017Turmas Recursais",2017,"SJES","Turmas Recursais","Novembro",560,1497,0,18253,null,null,null,null,null,null,null,null,null,560,1497,0,18253,"Ok","Ok","Ok","Ok",null,null,null,null,null,null,null,null,null,null,null,null,null,null,null,null,null,1]
["2017SJESVarasDezembro","2017VarasDezembro","2017SJESVaras","2017Varas",2017,"SJES","Varas","Dezembro",1747,1180,265,125316,null,null,null,null,null,"12Ant","12Atu",null,null,1747,1180,265,125316,"Ok","Ok","Ok","Ok"]
["2017SJESJuizadosDezembro","2017JuizadosDezembro","2017SJESJuizados","2017Juizados",2017,"SJES","Juizados","Dezembro",1398,1576,566,42922,null,null,null,null,null,3907,null,{"$f":"S180-R180","v":-3907},null,1398,1576,566,42922,"Ok","Ok","Ok","Ok"]
["2017SJESTurmas RecursaisDezembro","2017Turmas RecursaisDezembro","2017SJESTurmas Recursais","2017Turmas Recursais",2017,"SJES","Turmas Recursais","Dezembro",587,1151,0,18600,null,null,null,null,null,null,null,null,null,587,1151,0,18600,"Ok","Ok","Ok","Ok"]
["2017SJRJVarasJaneiro","2017VarasJaneiro","2017SJRJVaras","2017Varas",2017,"SJRJ","Varas","Janeiro",7097,3922,1486,595930,null,null,null,null,null,"01Ant","01Atu",null,null,7097,3922,1486,595930,"Ok","Ok","Ok","Ok",null,"Ok","Ok","Ok","Ok","Ok","Ok","Ok","Ok","Ok","Ok","Ok","Ok","Ok","Ok","Ok","Ok","Ok"]
["2017SJRJJuizadosJaneiro","2017JuizadosJaneiro","2017SJRJJuizados","2017Juizados",2017,"SJRJ","Juizados","Janeiro",7710,5798,1546,124454,null,null,null,null,null,11210,11436,{"$f":"S183-R183","v":226},null,7710,5798,1546,124454,"Ok","Ok","Ok","Ok",null,"Ok","Ok","Ok","Ok","Ok","Ok","Ok","Ok","Ok","Ok","Ok","Ok","Ok","Ok","Ok","Ok","Ok"]
["2017SJRJTurmas RecursaisJaneiro","2017Turmas RecursaisJaneiro","2017SJRJTurmas Recursais","2017Turmas Recursais",2017,"SJRJ","Turmas Recursais","Janeiro",1542,1716,0,83276,null,null,null,null,null,null,null,null,null,1542,1716,0,83276,"Ok","Ok","Ok","Ok",null,"Ok",-196,"Ok","Ok",-7,"Ok",13,"Ok","Ok",1,8,"Ok","Ok",1,"Ok","Ok","Ok"]
["2017SJRJVarasFevereiro","2017VarasFevereiro","2017SJRJVaras","2017Varas",2017,"SJRJ","Varas","Fevereiro",6880,6369,1794,596685,null,null,null,null,null,"02Ant","02Atu",null,null,6880,6369,1794,596685,"Ok","Ok","Ok","Ok",null,null,null,null,null,"Ok",-2175,326,-273,21759,"Ok","Ok","Ok","Ok","Ok","Ok","Ok","Ok"]
["2017SJRJJuizadosFevereiro","2017JuizadosFevereiro","2017SJRJJuizados","2017Juizados",2017,"SJRJ","Juizados","Fevereiro",7601,8561,2648,124108,null,null,null,null,null,17997,20734,{"$f":"S186-R186","v":2737},null,7601,8561,2648,124108,"Ok","Ok","Ok","Ok",null,null,null,null,null,"Ok",1096,-111,-9,23652,"Ok","Ok","Ok","Ok","Ok","Ok","Ok","Ok"]
["2017SJRJTurmas RecursaisFevereiro","2017Turmas RecursaisFevereiro","2017SJRJTurmas Recursais","2017Turmas Recursais",2017,"SJRJ","Turmas Recursais","Fevereiro",2502,5804,0,83042,null,null,null,null,null,null,null,null,null,2502,5804,0,83042,"Ok","Ok","Ok","Ok",null,null,null,null,null,"Ok",-141,2516,"Ok",-2279,-2,7,1,"Ok","Ok","Ok","Ok","Ok"]
["2017SJRJVarasMarço","2017VarasMarço","2017SJRJVaras","2017Varas",2017,"SJRJ","Varas","Março",17346,7022,2478,605160,null,null,null,null,null,"03Ant","03Atu",null,null,17346,7022,2478,605160,"Ok","Ok","Ok","Ok",null,null,null,null,null,null,6408,-521,162,26138,"Ok","Ok","Ok","Ok","Ok","Ok","Ok","Ok"]
["2017SJRJJuizadosMarço","2017JuizadosMarço","2017SJRJJuizados","2017Juizados",2017,"SJRJ","Juizados","Março",10016,10950,2982,124466,null,null,null,null,null,20288,25799,{"$f":"S189-R189","v":5511},null,10016,10950,2982,124466,"Ok","Ok","Ok","Ok",null,null,null,null,null,null,602,2310,-212,23905,"Ok","Ok","Ok","Ok","Ok","Ok","Ok","Ok"]
["2017SJRJTurmas RecursaisMarço","2017Turmas RecursaisMarço","2017SJRJTurmas Recursais","2017Turmas Recursais",2017,"SJRJ","Turmas Recursais","Março",3034,7827,0,79908,null,null,null,null,null,null,null,null,null,3034,7827,0,79908,"Ok","Ok","Ok","Ok",null,null,null,null,null,null,-94,3667,"Ok",-6129,"Ok",47,6,"Ok",1,1,"Ok","Ok"]
["2017SJRJVarasAbril","2017VarasAbril","2017SJRJVaras","2017Varas",2017,"SJRJ","Varas","Abril",23013,4601,1748,623119,null,null,null,null,null,"04Ant","04Atu",null,null,23013,4601,1748,623119,"Ok","Ok","Ok","Ok",null,null,null,null,null,null,null,null,null,null,"Ok","Ok","Ok","Ok","Ok","Ok","Ok","Ok"]
["2017SJRJJuizadosAbril","2017JuizadosAbril","2017SJRJJuizados","2017Juizados",2017,"SJRJ","Juizados","Abril",8448,7373,2406,126346,null,null,null,null,null,14909,15086,{"$f":"S192-R192","v":177},null,8448,7373,2406,126346,"Ok","Ok","Ok","Ok",null,null,null,null,null,null,null,null,null,null,"Ok","Ok","Ok","Ok","Ok","Ok","Ok","Ok"]
["2017SJRJTurmas RecursaisAbril","2017Turmas RecursaisAbril","2017SJRJTurmas Recursais","2017Turmas Recursais",2017,"SJRJ","Turmas Recursais","Abril",2484,3112,0,74658,null,null,null,null,null,null,null,null,null,2484,3112,0,74658,"Ok","Ok","Ok","Ok",null,null,null,null,null,null,null,null,null,null,93,70,12,1,1,"Ok","Ok","Ok"]
["2017SJRJVarasMaio",{"$f":"E194&G194&H194","v":"2017VarasMaio"},{"$f":"E194&F194&G194","v":"2017SJRJVaras"},{"$f":"E194&G194","v":"2017Varas"},2017,"SJRJ","Varas","Maio",19364,11089,2277,635489,null,null,null,null,null,"05Ant","05Atu",null,null,19364,11089,2277,635489,"Ok","Ok","Ok","Ok",null,null,null,null,null,null,null,null,null,null,null,"Ok","Ok","Ok","Ok","Ok","Ok","Ok"]
["2017SJRJJuizadosMaio","2017JuizadosMaio","2017SJRJJuizados","2017Juizados",2017,"SJRJ","Juizados","Maio",11286,10834,3364,128603,null,null,null,null,null,24494,25007,{"$f":"S195-R195","v":513},null,11286,10834,3364,128603,"Ok","Ok","Ok","Ok",null,null,null,null,null,null,null,null,null,null,null,"Ok","Ok","Ok","Ok","Ok","Ok","Ok"]
["2017SJRJTurmas RecursaisMaio","2017Turmas RecursaisMaio","2017SJRJTurmas Recursais","2017Turmas Recursais",2017,"SJRJ","Turmas Recursais","Maio",3359,3084,0,63441,null,null,null,null,null,null,null,null,null,3359,3084,0,63441,"Ok","Ok","Ok","Ok",null,null,null,null,null,null,null,null,null,null,null,439,28,32,-1,14,1,"Ok"]
["2017SJRJVarasJunho","2017VarasJunho","2017SJRJVaras","2017Varas",2017,"SJRJ","Varas","Junho",8654,16163,1988,635109,null,null,null,null,null,"06Ant","06Atu",null,null,8654,16163,1988,635109,"Ok","Ok","Ok","Ok",null,null,null,null,null,null,null,null,null,null,null,null,"Ok","Ok","Ok","Ok","Ok","Ok"]
["2017SJRJJuizadosJunho","2017JuizadosJunho","2017SJRJJuizados","2017Juizados",2017,"SJRJ","Juizados","Junho",10965,9130,3220,129334,null,null,null,null,null,30104,30212,{"$f":"S198-R198","v":108},null,10965,9130,3220,129334,"Ok","Ok","Ok","Ok",null,null,null,null,null,null,null,null,null,null,null,null,"Ok","Ok","Ok","Ok","Ok","Ok"]
["2017SJRJTurmas RecursaisJunho","2017Turmas RecursaisJunho","2017SJRJTurmas Recursais","2017Turmas Recursais",2017,"SJRJ","Turmas Recursais","Junho",3194,4919,0,62574,null,null,null,null,null,null,null,null,null,3194,4919,0,62574,"Ok","Ok","Ok","Ok",null,null,null,null,null,null,null,null,null,null,null,null,42,53,-1,13,1,"Ok"]
["2017SJRJVarasJulho","2017VarasJulho","2017SJRJVaras","2017Varas",2017,"SJRJ","Varas","Julho",9931,14107,2204,632666,null,null,null,null,null,"07Ant","07Atu",null,null,9931,14107,2204,632666,"Ok","Ok","Ok","Ok",null,null,null,null,null,null,null,null,null,null,null,null,null,"Ok","Ok","Ok","Ok","Ok"]
["2017SJRJJuizadosJulho","2017JuizadosJulho","2017SJRJJuizados","2017Juizados",2017,"SJRJ","Juizados","Julho",10972,9399,2973,131792,null,null,null,null,null,26914,27409,{"$f":"S201-R201","v":495},null,10972,9399,2973,131792,"Ok","Ok","Ok","Ok",null,null,null,null,null,null,null,null,null,null,null,null,null,"Ok","Ok","Ok","Ok","Ok"]
["2017SJRJTurmas RecursaisJulho","2017Turmas RecursaisJulho","2017SJRJTurmas Recursais","2017Turmas Recursais",2017,"SJRJ","Turmas Recursais","Julho",2947,3903,0,59015,null,null,null,null,null,null,null,null,null,2947,3903,0,59015,"Ok","Ok","Ok","Ok",null,null,null,null,null,null,null,null,null,null,null,null,null,388,74,29,4,"Ok"]
["2017SJRJVarasAgosto","2017VarasAgosto","2017SJRJVaras","2017Varas",2017,"SJRJ","Varas","Agosto",12957,15945,2322,629532,null,null,null,null,null,"08Ant","08Atu",null,null,12957,15945,2322,629532,{"$f":"IF(I203=V203,\"Ok\",I203-V203)","v":"Ok"},{"$f":"IF(J203=W203,\"Ok\",J203-W203)","v":"Ok"},{"$f":"IF(K203=X203,\"Ok\",K203-X203)","v":"Ok"},{"$f":"IF(L203=Y203,\"Ok\",L203-Y203)","v":"Ok"},null,null,null,null,null,null,null,null,null,null,null,null,null,null,"Ok","Ok","Ok","Ok"]
["2017SJRJJuizadosAgosto","2017JuizadosAgosto","2017SJRJJuizados","2017Juizados",2017,"SJRJ","Juizados","Agosto",11516,10710,3059,133075,null,null,null,null,null,30569,30814,{"$f":"S204-R204","v":245},null,11516,10710,3059,133075,"Ok","Ok","Ok","Ok",null,null,null,null,null,null,null,null,null,null,null,null,null,null,"Ok","Ok","Ok","Ok"]
["2017SJRJTurmas RecursaisAgosto","2017Turmas RecursaisAgosto","2017SJRJTurmas Recursais","2017Turmas Recursais",2017,"SJRJ","Turmas Recursais","Agosto",3100,4159,0,59739,null,null,null,null,null,null,null,null,null,3100,4159,0,59739,"Ok","Ok","Ok","Ok",null,null,null,null,null,null,null,null,null,null,null,null,null,null,145,71,28,1]
["2017SJRJVarasSetembro","2017VarasSetembro","2017SJRJVaras","2017Varas",2017,"SJRJ","Varas","Setembro",19368,17492,2286,634440,null,null,null,null,null,"09Ant","09Atu",null,null,19368,17492,2286,634440,"Ok","Ok","Ok","Ok",null,null,null,null,null,null,null,null,null,null,null,null,null,null,null,"Ok","Ok","Ok"]
["2017SJRJJuizadosSetembro","2017JuizadosSetembro","2017SJRJJuizados","2017Juizados",2017,"SJRJ","Juizados","Setembro",9906,9753,3029,133633,null,null,null,null,null,30163,30685,{"$f":"S207-R207","v":522},null,9906,9753,3029,133633,"Ok","Ok","Ok","Ok",null,null,null,null,null,null,null,null,null,null,null,null,null,null,null,"Ok","Ok","Ok"]
["2017SJRJTurmas RecursaisSetembro","2017Turmas RecursaisSetembro","2017SJRJTurmas Recursais","2017Turmas Recursais",2017,"SJRJ","Turmas Recursais","Setembro",3033,3440,0,58677,null,null,null,null,null,null,null,null,null,3033,3440,0,58677,"Ok","Ok","Ok","Ok",null,null,null,null,null,null,null,null,null,null,null,null,null,null,null,391,130,1]
["2017SJRJVarasOutubro","2017VarasOutubro","2017SJRJVaras","2017Varas",2017,"SJRJ","Varas","Outubro",13795,18365,2944,631446,null,null,null,null,null,"10Ant","10Atu",null,null,13795,18365,2944,631446,"Ok","Ok","Ok","Ok",null,null,null,null,null,null,null,null,null,null,null,null,null,null,null,null,"Ok","Ok"]
["2017SJRJJuizadosOutubro","2017JuizadosOutubro","2017SJRJJuizados","2017Juizados",2017,"SJRJ","Juizados","Outubro",10031,9698,2996,135603,null,null,null,null,null,31904,32208,{"$f":"S210-R210","v":304},null,10031,9698,2996,135603,"Ok","Ok","Ok","Ok",null,null,null,null,null,null,null,null,null,null,null,null,null,null,null,null,"Ok","Ok"]
["2017SJRJTurmas RecursaisOutubro","2017Turmas RecursaisOutubro","2017SJRJTurmas Recursais","2017Turmas Recursais",2017,"SJRJ","Turmas Recursais","Outubro",2967,4145,0,56876,null,null,null,null,null,null,null,null,null,2967,4145,0,56876,"Ok","Ok","Ok","Ok",null,null,null,null,null,null,null,null,null,null,null,null,null,null,null,null,304,"Ok"]
["2017SJRJVarasNovembro","2017VarasNovembro","2017SJRJVaras","2017Varas",2017,"SJRJ","Varas","Novembro",6712,17012,1763,622704,null,null,null,null,null,"11Ant","11Atu",null,null,6712,17012,1763,622704,"Ok","Ok","Ok","Ok",null,null,null,null,null,null,null,null,null,null,null,null,null,null,null,null,null,"Ok"]
["2017SJRJJuizadosNovembro","2017JuizadosNovembro","2017SJRJJuizados","2017Juizados",2017,"SJRJ","Juizados","Novembro",9450,9217,2324,137720,null,null,null,null,null,29205,29210,{"$f":"S213-R213","v":5},null,9450,9217,2324,137720,"Ok","Ok","Ok","Ok",null,null,null,null,null,null,null,null,null,null,null,null,null,null,null,null,null,"Ok"]
["2017SJRJTurmas RecursaisNovembro","2017Turmas RecursaisNovembro","2017SJRJTurmas Recursais","2017Turmas Recursais",2017,"SJRJ","Turmas Recursais","Novembro",2248,2981,0,57166,null,null,null,null,null,null,null,null,null,2248,2981,0,57166,"Ok","Ok","Ok","Ok",null,null,null,null,null,null,null,null,null,null,null,null,null,null,null,null,null,5]
["2017SJRJVarasDezembro","2017VarasDezembro","2017SJRJVaras","2017Varas",2017,"SJRJ","Varas","Dezembro",6347,7275,1226,621087,null,null,null,null,null,"12Ant","12Atu",null,null,6347,7275,1226,621087,"Ok","Ok","Ok","Ok"]
["2017SJRJJuizadosDezembro","2017JuizadosDezembro","2017SJRJJuizados","2017Juizados",2017,"SJRJ","Juizados","Dezembro",6917,6605,1877,139350,null,null,null,null,null,15760,null,{"$f":"S216-R216","v":-15760},null,6917,6605,1877,139350,"Ok","Ok","Ok","Ok"]
["2017SJRJTurmas RecursaisDezembro","2017Turmas RecursaisDezembro",{"$f":"E217&F217&G217","v":"2017SJRJTurmas Recursais"},{"$f":"E217&G217","v":"2017Turmas Recursais"},2017,"SJRJ","Turmas Recursais","Dezembro",1837,1880,0,56454,null,null,null,null,null,null,null,null,null,1837,1880,0,56454,"Ok","Ok","Ok","Ok"]
["2016SJESVarasJaneiro","2016VarasJaneiro",{"$f":"E218&F218&G218","v":"2016SJESVaras"},{"$f":"E218&G218","v":"2016Varas"},2016,"SJES","Varas","Janeiro",1401,1100,301,118504,null,null,null,null,null,null,null,null,null,1401,1100,301,118504,"Ok","Ok","Ok","Ok",null,"Ok",null,null,null,"Ok","Ok",null,null,null,"Ok","Ok","Ok"]
["2016SJESJuizadosJaneiro","2016JuizadosJaneiro",{"$f":"E219&F219&G219","v":"2016SJESJuizados"},{"$f":"E219&G219","v":"2016Juizados"},2016,"SJES","Juizados","Janeiro",1519,979,381,34790,null,null,null,null,null,null,null,null,null,1519,979,381,34790,"Ok","Ok","Ok","Ok",null,"Ok",null,null,null,"Ok","Ok",null,null,null,"Ok","Ok","Ok"]
["2016SJESTurmas RecursaisJaneiro","2016Turmas RecursaisJaneiro","2016SJESTurmas Recursais","2016Turmas Recursais",2016,"SJES","Turmas Recursais","Janeiro",375,636,0,18065,null,null,null,null,null,null,null,null,null,375,636,0,18065,"Ok","Ok","Ok","Ok",null,"Ok",null,null,null,-1,"Ok",null,null,null,"Ok","Ok","Ok"]
["2016SJESVarasFevereiro","2016VarasFevereiro","2016SJESVaras","2016Varas",2016,"SJES","Varas","Fevereiro",1465,1557,670,117917,null,null,null,null,null,null,null,null,null,1465,1557,670,117917,"Ok","Ok","Ok","Ok",null,"Ok",null,null,null,"Ok","Ok",null,null,null,"Ok","Ok","Ok"]
["2016SJESJuizadosFevereiro","2016JuizadosFevereiro","2016SJESJuizados","2016Juizados",2016,"SJES","Juizados","Fevereiro",1450,1495,660,35247,null,null,null,null,null,null,null,null,null,1450,1495,660,35247,"Ok","Ok","Ok","Ok",null,"Ok",null,null,null,"Ok","Ok",null,null,null,"Ok","Ok","Ok"]
["2016SJESTurmas RecursaisFevereiro","2016Turmas RecursaisFevereiro","2016SJESTurmas Recursais","2016Turmas Recursais",2016,"SJES","Turmas Recursais","Fevereiro",646,979,0,18058,null,null,null,null,null,null,null,null,null,646,979,0,18058,"Ok","Ok","Ok","Ok",null,"Ok",null,null,null,"Ok","Ok",null,null,null,"Ok","Ok","Ok"]
["2016SJESVarasMarço","2016VarasMarço","2016SJESVaras","2016Varas",2016,"SJES","Varas","Março",1347,1770,514,117682,null,null,null,null,null,null,null,null,null,1347,1770,514,117682,"Ok","Ok","Ok","Ok",null,"Ok",null,null,null,"Ok","Ok",null,null,null,"Ok","Ok","Ok"]
["2016SJESJuizadosMarço","2016JuizadosMarço","2016SJESJuizados","2016Juizados",2016,"SJES","Juizados","Março",1797,1555,558,35637,null,null,null,null,null,null,null,null,null,1797,1555,558,35637,"Ok","Ok","Ok","Ok",null,"Ok",null,null,null,"Ok","Ok",null,null,null,"Ok","Ok","Ok"]
["2016SJESTurmas RecursaisMarço","2016Turmas RecursaisMarço","2016SJESTurmas Recursais","2016Turmas Recursais",2016,"SJES","Turmas Recursais","Março",383,1142,0,17838,null,null,null,null,null,null,"+ 1",null,null,383,1142,0,17838,"Ok","Ok","Ok","Ok",null,"Ok",null,null,null,"Ok","Ok",null,null,null,"Ok","Ok","Ok"]
["2016SJESVarasAbril","2016VarasAbril","2016SJESVaras","2016Varas",2016,"SJES","Varas","Abril",2029,1165,587,117539,null,null,null,null,null,"04Ant","04Atu",null,null,2029,1165,587,117539,"Ok","Ok","Ok","Ok",null,"Ok",null,null,null,"Ok","Ok",null,null,null,"Ok","Ok","Ok"]
["2016SJESJuizadosAbril","2016JuizadosAbril","2016SJESJuizados","2016Juizados",2016,"SJES","Juizados","Abril",1650,1521,642,35840,null,null,null,null,null,14766,14772,{"$f":"S228-R228","v":6},null,1650,1521,642,35840,"Ok","Ok","Ok","Ok",null,"Ok",null,null,null,"Ok","Ok",null,null,null,"Ok","Ok","Ok"]
["2016SJESTurmas RecursaisAbril","2016Turmas RecursaisAbril","2016SJESTurmas Recursais","2016Turmas Recursais",2016,"SJES","Turmas Recursais","Abril",810,877,0,18411,null,null,null,null,null,null,null,null,null,810,877,0,18411,"Ok","Ok","Ok","Ok",null,"Ok",null,null,null,"Ok","Ok",null,null,null,-3,"Ok","Ok"]
["2016SJESVarasMaio","2016VarasMaio","2016SJESVaras","2016Varas",2016,"SJES","Varas","Maio",1314,1323,383,117002,null,null,null,null,null,"05Ant","05Atu",null,null,1314,1323,383,117002,"Ok","Ok","Ok","Ok",null,"Ok",null,null,null,"Ok","Ok",null,null,null,"Ok","Ok","Ok"]
[{"$f":"E231&F231&G231&H231","v":"2016SJESJuizadosMaio"},"2016JuizadosMaio","2016SJESJuizados","2016Juizados",2016,"SJES","Juizados","Maio",1898,1506,705,36654,null,null,null,null,null,18065,18067,{"$f":"S231-R231","v":2},null,1898,1506,705,36654,"Ok","Ok","Ok","Ok",null,"Ok",null,null,null,"Ok","Ok",null,null,null,"Ok","Ok","Ok"]
["2016SJESTurmas RecursaisMaio","2016Turmas RecursaisMaio","2016SJESTurmas Recursais","2016Turmas Recursais",2016,"SJES","Turmas Recursais","Maio",697,467,0,18265,null,null,null,null,null,null,null,null,null,697,467,0,18265,"Ok","Ok","Ok","Ok",null,"Ok",null,null,null,"Ok","Ok",null,null,null,"Ok",-1,"Ok"]
["2016SJESVarasJunho","2016VarasJunho","2016SJESVaras","2016Varas",2016,"SJES","Varas","Junho",2822,1860,523,117680,null,null,null,null,null,"06Ant","06Atu",null,null,2822,1860,523,117680,"Ok","Ok","Ok","Ok",null,"Ok",null,null,null,"Ok","Ok",null,null,null,"Ok","Ok","Ok"]
["2016SJESJuizadosJunho","2016JuizadosJunho","2016SJESJuizados","2016Juizados",2016,"SJES","Juizados","Junho",2198,1699,706,37177,null,null,null,null,null,23008,23015,{"$f":"S234-R234","v":7},null,2198,1699,706,37177,"Ok","Ok","Ok","Ok",null,"Ok",null,null,null,"Ok","Ok",null,null,null,"Ok","Ok","Ok"]
["2016SJESTurmas RecursaisJunho","2016Turmas RecursaisJunho","2016SJESTurmas Recursais","2016Turmas Recursais",2016,"SJES","Turmas Recursais","Junho",645,1390,0,18497,null,null,null,null,null,null,null,null,null,645,1390,0,18497,"Ok","Ok","Ok","Ok",null,7,null,null,null,-1,"Ok",null,null,null,"Ok","Ok","Ok"]
["2016SJESVarasJulho","2016VarasJulho","2016SJESVaras","2016Varas",2016,"SJES","Varas","Julho",1469,1147,410,117442,null,null,null,null,null,"07Ant","07Atu",null,null,1469,1147,410,117442,"Ok","Ok","Ok","Ok",null,"Ok",null,null,null,"Ok","Ok",null,null,null,"Ok","Ok","Ok"]
["2016SJESJuizadosJulho","2016JuizadosJulho","2016SJESJuizados","2016Juizados",2016,"SJES","Juizados","Julho",1928,1422,664,37644,null,null,null,null,null,26633,26644,{"$f":"S237-R237","v":11},null,1928,1422,664,37644,"Ok","Ok","Ok","Ok",null,"Ok",null,null,null,"Ok","Ok",null,null,null,"Ok","Ok","Ok"]
["2016SJESTurmas RecursaisJulho","2016Turmas RecursaisJulho","2016SJESTurmas Recursais","2016Turmas Recursais",2016,"SJES","Turmas Recursais","Julho",693,1083,0,18585,null,null,null,null,null,null,null,null,null,693,1083,0,18585,"Ok","Ok","Ok","Ok",null,"Ok",null,null,null,-9,-1,null,null,null,-20,-4,"Ok"]
["2016SJESVarasAgosto","2016VarasAgosto","2016SJESVaras","2016Varas",2016,"SJES","Varas","Agosto",2836,1494,410,118467,null,null,null,null,null,"08Ant","08Atu",null,null,2836,1494,410,118467,"Ok","Ok","Ok","Ok",null,null,null,null,null,null,"Ok",null,null,null,"Ok","Ok","Ok"]
["2016SJESJuizadosAgosto","2016JuizadosAgosto","2016SJESJuizados","2016Juizados",2016,"SJES","Juizados","Agosto",2197,1709,878,37663,null,null,null,null,null,30931,30939,{"$f":"S240-R240","v":8},null,2197,1709,878,37663,"Ok","Ok","Ok","Ok",null,null,null,null,null,null,"Ok",null,null,null,"Ok","Ok","Ok"]
["2016SJESTurmas RecursaisAgosto","2016Turmas RecursaisAgosto","2016SJESTurmas Recursais","2016Turmas Recursais",2016,"SJES","Turmas Recursais","Agosto",870,1097,0,18811,null,null,null,null,null,null,null,null,null,870,1097,0,18811,"Ok","Ok","Ok","Ok",null,null,null,null,null,null,-7,null,null,null,-6,"Ok","Ok"]
["2016SJESVarasSetembro","2016VarasSetembro","2016SJESVaras","2016Varas",2016,"SJES","Varas","Setembro",2041,1237,399,118913,null,null,null,null,null,"09Ant","09Atu",null,null,2041,1237,399,118913,"Ok","Ok","Ok","Ok",null,null,null,null,null,null,null,null,null,null,"Ok","Ok","Ok"]
["2016SJESJuizadosSetembro","2016JuizadosSetembro","2016SJESJuizados","2016Juizados",2016,"SJES","Juizados","Setembro",1897,1567,687,38187,null,null,null,null,null,34814,34845,{"$f":"S243-R243","v":31},null,1897,1567,687,38187,"Ok","Ok","Ok","Ok",null,null,null,null,null,null,null,null,null,null,"Ok","Ok","Ok"]
["2016SJESTurmas RecursaisSetembro","2016Turmas RecursaisSetembro","2016SJESTurmas Recursais","2016Turmas Recursais",2016,"SJES","Turmas Recursais","Setembro",675,1073,0,18860,null,null,null,null,null,null,null,null,null,675,1073,0,18860,"Ok","Ok","Ok","Ok",null,null,null,null,null,null,null,null,null,null,-2,"Ok","Ok"]
["2016SJESVarasOutubro","2016VarasOutubro","2016SJESVaras","2016Varas",2016,"SJES","Varas","Outubro",2289,1193,349,119687,null,null,null,null,null,"10Ant","10Atu",null,null,2289,1193,349,119687,"Ok","Ok","Ok","Ok",null,null,null,null,null,null,null,null,null,null,null,"Ok","Ok"]
["2016SJESJuizadosOutubro","2016JuizadosOutubro","2016SJESJuizados","2016Juizados",2016,"SJES","Juizados","Outubro",1924,1192,555,38670,null,null,null,null,null,38150,38156,{"$f":"S246-R246","v":6},null,1924,1192,555,38670,"Ok","Ok","Ok","Ok",null,null,null,null,null,null,null,null,null,null,null,"Ok","Ok"]
["2016SJESTurmas RecursaisOutubro","2016Turmas RecursaisOutubro","2016SJESTurmas Recursais","2016Turmas Recursais",2016,"SJES","Turmas Recursais","Outubro",532,921,0,18847,null,null,null,null,null,null,null,null,null,532,921,0,18847,"Ok","Ok","Ok","Ok",null,null,null,null,null,null,null,null,null,null,null,-1,"Ok"]
["2016SJESVarasNovembro","2016VarasNovembro","2016SJESVaras","2016Varas",2016,"SJES","Varas","Novembro",2502,1430,374,120623,null,null,null,null,null,"11Ant","11Atu",null,null,2502,1430,374,120623,"Ok","Ok","Ok","Ok",null,null,null,null,null,null,null,null,null,null,null,null,"Ok"]
["2016SJESJuizadosNovembro","2016JuizadosNovembro","2016SJESJuizados","2016Juizados",2016,"SJES","Juizados","Novembro",1886,1710,639,39420,null,null,null,null,null,42348,42350,{"$f":"S249-R249","v":2},null,1886,1710,639,39420,"Ok","Ok","Ok","Ok",null,null,null,null,null,null,null,null,null,null,null,null,"Ok"]
["2016SJESTurmas RecursaisNovembro","2016Turmas RecursaisNovembro","2016SJESTurmas Recursais","2016Turmas Recursais",2016,"SJES","Turmas Recursais","Novembro",631,1054,0,18772,null,null,null,null,null,null,null,null,null,631,1054,0,18772,"Ok","Ok","Ok","Ok",null,null,null,null,null,null,null,null,null,null,null,null,-2]
["2016SJESVarasDezembro","2016VarasDezembro","2016SJESVaras","2016Varas",2016,"SJES","Varas","Dezembro",2383,958,229,122374,null,null,null,null,null,null,null,null,null,"NovAnt"]
["2016SJESJuizadosDezembro","2016JuizadosDezembro","2016SJESJuizados","2016Juizados",2016,"SJES","Juizados","Dezembro",1178,1139,288,39831]
["2016SJESTurmas RecursaisDezembro","2016Turmas RecursaisDezembro","2016SJESTurmas Recursais","2016Turmas Recursais",2016,"SJES","Turmas Recursais","Dezembro",283,945,0,18856]
["2016SJRJVarasJaneiro","2016VarasJaneiro","2016SJRJVaras","2016Varas",2016,"SJRJ","Varas","Janeiro",7233,4808,1588,573754,null,null,null,null,null,null,null,null,null,7233,4808,1588,573754,"Ok","Ok","Ok","Ok",null,"Ok",null,null,null,"Ok","Ok",null,null,null,"Ok","Ok","Ok"]
["2016SJRJJuizadosJaneiro","2016JuizadosJaneiro","2016SJRJJuizados","2016Juizados",2016,"SJRJ","Juizados","Janeiro",6767,6869,2725,102990,null,null,null,null,null,null,null,null,null,6767,6869,2725,102990,"Ok","Ok","Ok","Ok",null,"Ok",null,null,null,"Ok","Ok",null,null,null,"Ok","Ok","Ok"]
["2016SJRJTurmas RecursaisJaneiro","2016Turmas RecursaisJaneiro","2016SJRJTurmas Recursais","2016Turmas Recursais",2016,"SJRJ","Turmas Recursais","Janeiro",2765,2209,0,84068,null,null,null,null,null,null,null,null,null,2765,2209,0,84068,"Ok","Ok","Ok","Ok",null,"Ok",null,null,null,"Ok","Ok",null,null,null,"Ok","Ok","Ok"]
["2016SJRJVarasFevereiro","2016VarasFevereiro","2016SJRJVaras","2016Varas",2016,"SJRJ","Varas","Fevereiro",9055,6043,2067,574926,null,null,null,null,null,null,null,null,null,9055,6043,2067,574926,"Ok","Ok","Ok","Ok",null,"Ok",null,null,null,"Ok","Ok",null,null,null,"Ok","Ok","Ok"]
["2016SJRJJuizadosFevereiro",{"$f":"E258&G258&H258","v":"2016JuizadosFevereiro"},"2016SJRJJuizados","2016Juizados",2016,"SJRJ","Juizados","Fevereiro",6505,8672,2657,100456,null,null,null,null,null,null,null,null,null,6505,8672,2657,100456,"Ok","Ok","Ok","Ok",null,"Ok",null,null,null,"Ok","Ok",null,null,null,"Ok","Ok","Ok"]
["2016SJRJTurmas RecursaisFevereiro","2016Turmas RecursaisFevereiro","2016SJRJTurmas Recursais","2016Turmas Recursais",2016,"SJRJ","Turmas Recursais","Fevereiro",2643,3282,0,85321,null,null,null,null,null,null,null,null,null,2643,3282,0,85321,"Ok","Ok","Ok","Ok",null,10,null,null,null,-2,"Ok",null,null,null,"Ok","Ok","Ok"]
["2016SJRJVarasMarço","2016VarasMarço","2016SJRJVaras","2016Varas",2016,"SJRJ","Varas","Março",10938,7543,2316,579022,null,null,null,null,null,null,null,null,null,10938,7543,2316,579022,"Ok","Ok","Ok","Ok",null,"Ok",null,null,null,"Ok","Ok",null,null,null,"Ok","Ok","Ok"]
["2016SJRJJuizadosMarço","2016JuizadosMarço","2016SJRJJuizados","2016Juizados",2016,"SJRJ","Juizados","Março",9414,8640,3194,100561,null,null,null,null,null,null,null,null,null,9414,8640,3194,100561,"Ok","Ok","Ok","Ok",null,"Ok",null,null,null,"Ok","Ok",null,null,null,"Ok","Ok","Ok"]
["2016SJRJTurmas RecursaisMarço","2016Turmas RecursaisMarço","2016SJRJTurmas Recursais","2016Turmas Recursais",2016,"SJRJ","Turmas Recursais","Março",3128,4101,0,86037,null,null,null,null,null,null,"+ 1",null,null,3128,4101,0,86037,"Ok","Ok","Ok","Ok",null,10,null,null,null,-8,1,null,null,null,"Ok","Ok","Ok"]
["2016SJRJVarasAbril","2016VarasAbril","2016SJRJVaras","2016Varas",2016,"SJRJ","Varas","Abril",10029,6630,2135,581060,null,null,null,null,null,"04Ant","04Atu",null,null,10029,6630,2135,581060,"Ok","Ok","Ok","Ok",null,"Ok",null,null,null,"Ok","Ok",null,null,null,"Ok","Ok","Ok"]
["2016SJRJJuizadosAbril","2016JuizadosAbril","2016SJRJJuizados","2016Juizados",2016,"SJRJ","Juizados","Abril",8878,7894,2760,101347,null,null,null,null,null,70174,70228,{"$f":"S264-R264","v":54},null,8878,7894,2760,101347,"Ok","Ok","Ok","Ok",null,"Ok",null,null,null,"Ok","Ok",null,null,null,"Ok","Ok","Ok"]
["2016SJRJTurmas RecursaisAbril","2016Turmas RecursaisAbril","2016SJRJTurmas Recursais","2016Turmas Recursais",2016,"SJRJ","Turmas Recursais","Abril",2720,3611,0,86370,null,null,null,null,null,null,null,null,null,2720,3611,0,86370,"Ok","Ok","Ok","Ok",null,3,null,null,null,-9,"Ok",null,null,null,-4,"Ok","Ok"]
["2016SJRJVarasMaio","2016VarasMaio","2016SJRJVaras","2016Varas",2016,"SJRJ","Varas","Maio",9735,7158,2312,583430,null,null,null,null,null,"05Ant","05Atu",null,null,9735,7158,2312,583430,"Ok","Ok","Ok","Ok",null,"Ok",null,null,null,"Ok","Ok",null,null,null,"Ok","Ok","Ok"]
["2016SJRJJuizadosMaio","2016JuizadosMaio","2016SJRJJuizados","2016Juizados",2016,"SJRJ","Juizados","Maio",10026,8497,2737,103928,null,null,null,null,null,88905,89167,{"$f":"S267-R267","v":262},null,10026,8497,2737,103928,{"$f":"IF(I267=V267,\"Ok\",I267-V267)","v":"Ok"},{"$f":"IF(J267=W267,\"Ok\",J267-W267)","v":"Ok"},{"$f":"IF(K267=X267,\"Ok\",K267-X267)","v":"Ok"},{"$f":"IF(L267=Y267,\"Ok\",L267-Y267)","v":"Ok"},null,"Ok",null,null,null,"Ok","Ok",null,null,null,"Ok","Ok","Ok"]
["2016SJRJTurmas RecursaisMaio","2016Turmas RecursaisMaio","2016SJRJTurmas Recursais","2016Turmas Recursais",2016,"SJRJ","Turmas Recursais","Maio",2741,3305,0,85496,null,null,null,null,null,null,null,null,null,2741,3305,0,85496,"Ok","Ok","Ok","Ok",null,35,null,null,null,-5,1,null,null,null,-1,-10,"Ok"]
["2016SJRJVarasJunho","2016VarasJunho","2016SJRJVaras","2016Varas",2016,"SJRJ","Varas","Junho",10311,7780,2481,585465,null,null,null,null,null,"06Ant","06Atu",null,null,10311,7780,2481,585465,"Ok","Ok","Ok","Ok",null,"Ok",null,null,null,"Ok","Ok",null,null,null,"Ok","Ok","Ok"]
["2016SJRJJuizadosJunho","2016JuizadosJunho","2016SJRJJuizados","2016Juizados",2016,"SJRJ","Juizados","Junho",10528,9272,2852,105494,null,null,null,null,null,110917,111163,{"$f":"S270-R270","v":246},null,10528,9272,2852,105494,"Ok","Ok","Ok","Ok",null,"Ok",null,null,null,"Ok","Ok",null,null,null,"Ok","Ok","Ok"]
["2016SJRJTurmas RecursaisJunho","2016Turmas RecursaisJunho","2016SJRJTurmas Recursais","2016Turmas Recursais",2016,"SJRJ","Turmas Recursais","Junho",2964,4950,0,85272,null,null,null,null,null,null,null,null,null,2964,4950,0,85272,"Ok","Ok","Ok","Ok",null,188,null,null,null,-23,"Ok",null,null,null,-35,-6,"Ok"]
["2016SJRJVarasJulho","2016VarasJulho","2016SJRJVaras","2016Varas",2016,"SJRJ","Varas","Julho",6628,6760,2223,584915,null,null,null,null,null,"07Ant","07Atu",null,null,6628,6760,2223,584915,"Ok","Ok","Ok","Ok",null,"Ok",null,null,null,"Ok","Ok",null,null,null,"Ok","Ok","Ok"]
["2016SJRJJuizadosJulho","2016JuizadosJulho","2016SJRJJuizados","2016Juizados",2016,"SJRJ","Juizados","Julho",11006,8547,2821,109526,null,null,null,null,null,130898,131175,{"$f":"S273-R273","v":277},null,11006,8547,2821,109526,"Ok","Ok","Ok","Ok",null,"Ok",null,null,null,"Ok","Ok",null,null,null,"Ok","Ok","Ok"]
["2016SJRJTurmas RecursaisJulho","2016Turmas RecursaisJulho","2016SJRJTurmas Recursais","2016Turmas Recursais",2016,"SJRJ","Turmas Recursais","Julho",2837,4846,0,84325,null,null,null,null,null,null,null,null,null,2837,4846,0,84325,"Ok","Ok","Ok","Ok",null,"Ok",null,null,null,-230,-63,null,null,null,-111,-14,"Ok"]
["2016SJRJVarasAgosto","2016VarasAgosto","2016SJRJVaras","2016Varas",2016,"SJRJ","Varas","Agosto",7693,5318,1786,587530,null,null,null,null,null,"08Ant","08Atu",null,null,7693,5318,1786,587530,"Ok","Ok","Ok","Ok",null,null,null,null,null,null,"Ok",null,null,null,"Ok","Ok","Ok"]
["2016SJRJJuizadosAgosto","2016JuizadosAgosto","2016SJRJJuizados","2016Juizados",2016,"SJRJ","Juizados","Agosto",9506,7594,2262,112804,null,null,null,null,null,146968,147141,{"$f":"S276-R276","v":173},null,9506,7594,2262,112804,"Ok","Ok","Ok","Ok",null,null,null,null,null,null,"Ok",null,null,null,"Ok","Ok","Ok"]
["2016SJRJTurmas RecursaisAgosto","2016Turmas RecursaisAgosto","2016SJRJTurmas Recursais","2016Turmas Recursais",2016,"SJRJ","Turmas Recursais","Agosto",2288,3389,0,83847,null,null,null,null,null,null,null,null,null,2288,3389,0,83847,"Ok","Ok","Ok","Ok",null,null,null,null,null,null,-112,null,null,null,-361,-35,"Ok"]
["2016SJRJVarasSetembro","2016VarasSetembro","2016SJRJVaras","2016Varas",2016,"SJRJ","Varas","Setembro",7383,6740,2404,587800,null,null,null,null,null,"09Ant","09Atu",null,null,7383,6740,2404,587800,"Ok","Ok","Ok","Ok",null,null,null,null,null,null,null,null,null,null,"Ok","Ok","Ok"]
["2016SJRJJuizadosSetembro","2016JuizadosSetembro","2016SJRJJuizados","2016Juizados",2016,"SJRJ","Juizados","Setembro",11067,10129,3082,115472,null,null,null,null,null,166661,168067,{"$f":"S279-R279","v":1406},null,11067,10129,3082,115472,"Ok","Ok","Ok","Ok",null,null,null,null,null,null,null,null,null,null,"Ok","Ok","Ok"]
["2016SJRJTurmas RecursaisSetembro","2016Turmas RecursaisSetembro","2016SJRJTurmas Recursais","2016Turmas Recursais",2016,"SJRJ","Turmas Recursais","Setembro",3073,3653,0,83159,null,null,null,null,null,null,null,null,null,3073,3653,0,83159,"Ok","Ok","Ok","Ok",null,null,null,null,null,null,null,null,null,null,-894,-107,-1]
["2016SJRJVarasOutubro","2016VarasOutubro","2016SJRJVaras","2016Varas",2016,"SJRJ","Varas","Outubro",8487,6517,2120,589927,null,null,null,null,null,"10Ant","10Atu",null,null,8487,6517,2120,589927,"Ok","Ok","Ok","Ok",null,null,null,null,null,null,null,null,null,null,null,"Ok","Ok"]
["2016SJRJJuizadosOutubro","2016JuizadosOutubro","2016SJRJJuizados","2016Juizados",2016,"SJRJ","Juizados","Outubro",9793,9175,2874,117638,null,null,null,null,null,187828,188207,{"$f":"S282-R282","v":379},null,9793,9175,2874,117638,"Ok","Ok","Ok","Ok",null,null,null,null,null,null,null,null,null,null,null,"Ok","Ok"]
["2016SJRJTurmas RecursaisOutubro","2016Turmas RecursaisOutubro",{"$f":"E283&F283&G283","v":"2016SJRJTurmas Recursais"},{"$f":"E283&G283","v":"2016Turmas Recursais"},2016,"SJRJ","Turmas Recursais","Outubro",2854,4276,0,83468,null,null,null,null,null,null,null,null,null,2854,4276,0,83468,"Ok","Ok","Ok","Ok",null,null,null,null,null,null,null,null,null,null,null,-207,"Ok"]
["2016SJRJVarasNovembro","2016VarasNovembro","2016SJRJVaras","2016Varas",2016,"SJRJ","Varas","Novembro",7320,7191,2182,589706,null,null,null,null,null,"11Ant","11Atu",null,null,7320,7191,2182,589706,"Ok","Ok","Ok","Ok",null,null,null,null,null,null,null,null,null,null,null,null,"Ok"]
["2016SJRJJuizadosNovembro","2016JuizadosNovembro","2016SJRJJuizados","2016Juizados",2016,"SJRJ","Juizados","Novembro",10021,9428,2926,118826,null,null,null,null,null,209131,209133,{"$f":"S285-R285","v":2},null,10021,9428,2926,118826,"Ok","Ok","Ok","Ok",null,null,null,null,null,null,null,null,null,null,null,null,"Ok"]
["2016SJRJTurmas RecursaisNovembro","2016Turmas RecursaisNovembro","2016SJRJTurmas Recursais","2016Turmas Recursais",2016,"SJRJ","Turmas Recursais","Novembro",2951,4306,0,84661,null,null,null,null,null,null,null,null,null,2951,4306,0,84661,{"$f":"IF(I286=V286,\"Ok\",I286-V286)","v":"Ok"},{"$f":"IF(J286=W286,\"Ok\",J286-W286)","v":"Ok"},{"$f":"IF(K286=X286,\"Ok\",K286-X286)","v":"Ok"},{"$f":"IF(L286=Y286,\"Ok\",L286-Y286)","v":"Ok"},null,null,null,null,null,null,null,null,null,null,null,null,-1]
["2016SJRJVarasDezembro","2016VarasDezembro","2016SJRJVaras","2016Varas",2016,"SJRJ","Varas","Dezembro",6997,4272,1308,592525,null,null,null,null,null,null,null,null,null,"NovAnt"]
["2016SJRJJuizadosDezembro","2016JuizadosDezembro","2016SJRJJuizados","2016Juizados",2016,"SJRJ","Juizados","Dezembro",6837,5920,1718,120229]
["2016SJRJTurmas RecursaisDezembro","2016Turmas RecursaisDezembro","2016SJRJTurmas Recursais","2016Turmas Recursais",2016,"SJRJ","Turmas Recursais","Dezembro",1768,1874,0,83901]
["2015SJESVarasJaneiro","2015VarasJaneiro",{"$f":"E290&F290&G290","v":"2015SJESVaras"},{"$f":"E290&G290","v":"2015Varas"},2015,"SJES","Varas","Janeiro",1688,878,287,112752]
["2015SJESJuizadosJaneiro","2015JuizadosJaneiro",{"$f":"E291&F291&G291","v":"2015SJESJuizados"},{"$f":"E291&G291","v":"2015Juizados"},2015,"SJES","Juizados","Janeiro",1181,1272,389,30229]
["2015SJESTurmas RecursaisJaneiro","2015Turmas RecursaisJaneiro","2015SJESTurmas Recursais","2015Turmas Recursais",2015,"SJES","Turmas Recursais","Janeiro",384,606,0,17394]
["2015SJESVarasFevereiro","2015VarasFevereiro","2015SJESVaras","2015Varas",2015,"SJES","Varas","Fevereiro",1652,1634,240,113096]
["2015SJESJuizadosFevereiro","2015JuizadosFevereiro","2015SJESJuizados","2015Juizados",2015,"SJES","Juizados","Fevereiro",1238,1357,311,30342]
[{"$f":"E295&F295&G295&H295","v":"2015SJESTurmas RecursaisFevereiro"},"2015Turmas RecursaisFevereiro","2015SJESTurmas Recursais","2015Turmas Recursais",2015,"SJES","Turmas Recursais","Fevereiro",326,553,0,17249]
["2015SJESVarasMarço","2015VarasMarço","2015SJESVaras","2015Varas",2015,"SJES","Varas","Março",1506,1452,368,112614]
["2015SJESJuizadosMarço","2015JuizadosMarço","2015SJESJuizados","2015Juizados",2015,"SJES","Juizados","Março",1993,1740,525,30602]
["2015SJESTurmas RecursaisMarço","2015Turmas RecursaisMarço","2015SJESTurmas Recursais","2015Turmas Recursais",2015,"SJES","Turmas Recursais","Março",525,842,0,17331]
["2015SJESVarasAbril","2015VarasAbril","2015SJESVaras","2015Varas",2015,"SJES","Varas","Abril",1097,1299,458,112423]
["2015SJESJuizadosAbril","2015JuizadosAbril","2015SJESJuizados","2015Juizados",2015,"SJES","Juizados","Abril",1624,1210,457,30859]
["2015SJESTurmas RecursaisAbril","2015Turmas RecursaisAbril","2015SJESTurmas Recursais","2015Turmas Recursais",2015,"SJES","Turmas Recursais","Abril",394,689,0,17495]
["2015SJESVarasMaio","2015VarasMaio","2015SJESVaras","2015Varas",2015,"SJES","Varas","Maio",1598,1363,457,112471]
["2015SJESJuizadosMaio","2015JuizadosMaio","2015SJESJuizados","2015Juizados",2015,"SJES","Juizados","Maio",1647,1849,581,30739]
["2015SJESTurmas RecursaisMaio","2015Turmas RecursaisMaio","2015SJESTurmas Recursais","2015Turmas Recursais",2015,"SJES","Turmas Recursais","Maio",621,577,0,17783]
["2015SJESVarasJunho","2015VarasJunho","2015SJESVaras","2015Varas",2015,"SJES","Varas","Junho",1907,1556,441,112687]
["2015SJESJuizadosJunho","2015JuizadosJunho","2015SJESJuizados","2015Juizados",2015,"SJES","Juizados","Junho",1994,1539,596,31647]
["2015SJESTurmas RecursaisJunho","2015Turmas RecursaisJunho","2015SJESTurmas Recursais","2015Turmas Recursais",2015,"SJES","Turmas Recursais","Junho",560,811,0,17696]
["2015SJESVarasJulho","2015VarasJulho","2015SJESVaras","2015Varas",2015,"SJES","Varas","Julho",2816,1216,392,114014]
["2015SJESJuizadosJulho","2015JuizadosJulho","2015SJESJuizados","2015Juizados",2015,"SJES","Juizados","Julho",2130,1490,509,32377]
["2015SJESTurmas RecursaisJulho","2015Turmas RecursaisJulho","2015SJESTurmas Recursais","2015Turmas Recursais",2015,"SJES","Turmas Recursais","Julho",383,840,0,17928]
["2015SJESVarasAgosto","2015VarasAgosto","2015SJESVaras","2015Varas",2015,"SJES","Varas","Agosto",1548,1571,204,114909]
["2015SJESJuizadosAgosto","2015JuizadosAgosto","2015SJESJuizados","2015Juizados",2015,"SJES","Juizados","Agosto",1731,1127,615,32558]
["2015SJESTurmas RecursaisAgosto","2015Turmas RecursaisAgosto","2015SJESTurmas Recursais","2015Turmas Recursais",2015,"SJES","Turmas Recursais","Agosto",283,632,0,18204]
["2015SJESVarasSetembro","2015VarasSetembro","2015SJESVaras","2015Varas",2015,"SJES","Varas","Setembro",3965,1858,422,117180]
["2015SJESJuizadosSetembro","2015JuizadosSetembro","2015SJESJuizados","2015Juizados",2015,"SJES","Juizados","Setembro",1459,1644,478,32907]
["2015SJESTurmas RecursaisSetembro","2015Turmas RecursaisSetembro","2015SJESTurmas Recursais","2015Turmas Recursais",2015,"SJES","Turmas Recursais","Setembro",923,1158,0,18574]
["2015SJESVarasOutubro","2015VarasOutubro","2015SJESVaras","2015Varas",2015,"SJES","Varas","Outubro",2620,1802,446,117811]
["2015SJESJuizadosOutubro","2015JuizadosOutubro","2015SJESJuizados","2015Juizados",2015,"SJES","Juizados","Outubro",1560,1672,461,33343]
["2015SJESTurmas RecursaisOutubro","2015Turmas RecursaisOutubro","2015SJESTurmas Recursais","2015Turmas Recursais",2015,"SJES","Turmas Recursais","Outubro",474,920,0,18318]
["2015SJESVarasNovembro","2015VarasNovembro","2015SJESVaras","2015Varas",2015,"SJES","Varas","Novembro",1968,1753,462,118096]
["2015SJESJuizadosNovembro","2015JuizadosNovembro","2015SJESJuizados","2015Juizados",2015,"SJES","Juizados","Novembro",1583,1492,728,33827]
["2015SJESTurmas RecursaisNovembro",{"$f":"E322&G322&H322","v":"2015Turmas RecursaisNovembro"},"2015SJESTurmas Recursais","2015Turmas Recursais",2015,"SJES","Turmas Recursais","Novembro",701,802,0,18008]
["2015SJESVarasDezembro","2015VarasDezembro","2015SJESVaras","2015Varas",2015,"SJES","Varas","Dezembro",1987,1396,256,118569]
["2015SJESJuizadosDezembro","2015JuizadosDezembro","2015SJESJuizados","2015Juizados",2015,"SJES","Juizados","Dezembro",1242,965,393,34381]
["2015SJESTurmas RecursaisDezembro","2015Turmas RecursaisDezembro","2015SJESTurmas Recursais","2015Turmas Recursais",2015,"SJES","Turmas Recursais","Dezembro",412,491,0,17796]
["2015SJRJVarasJaneiro","2015VarasJaneiro","2015SJRJVaras","2015Varas",2015,"SJRJ","Varas","Janeiro",6285,6974,2493,570184]
["2015SJRJJuizadosJaneiro","2015JuizadosJaneiro","2015SJRJJuizados","2015Juizados",2015,"SJRJ","Juizados","Janeiro",7393,6909,3015,103513]
["2015SJRJTurmas RecursaisJaneiro","2015Turmas RecursaisJaneiro","2015SJRJTurmas Recursais","2015Turmas Recursais",2015,"SJRJ","Turmas Recursais","Janeiro",3109,2924,0,83076]
["2015SJRJVarasFevereiro","2015VarasFevereiro","2015SJRJVaras","2015Varas",2015,"SJRJ","Varas","Fevereiro",5785,10568,2859,565229]
["2015SJRJJuizadosFevereiro","2015JuizadosFevereiro","2015SJRJJuizados","2015Juizados",2015,"SJRJ","Juizados","Fevereiro",5733,8157,2570,101064]
["2015SJRJTurmas RecursaisFevereiro","2015Turmas RecursaisFevereiro","2015SJRJTurmas Recursais","2015Turmas Recursais",2015,"SJRJ","Turmas Recursais","Fevereiro",2552,2932,0,83593]
["2015SJRJVarasMarço","2015VarasMarço","2015SJRJVaras","2015Varas",2015,"SJRJ","Varas","Março",10276,11662,3889,563741]
["2015SJRJJuizadosMarço","2015JuizadosMarço","2015SJRJJuizados","2015Juizados",2015,"SJRJ","Juizados","Março",9430,9476,3617,100696]
["2015SJRJTurmas RecursaisMarço","2015Turmas RecursaisMarço","2015SJRJTurmas Recursais","2015Turmas Recursais",2015,"SJRJ","Turmas Recursais","Março",3689,5705,0,84786]
["2015SJRJVarasAbril","2015VarasAbril","2015SJRJVaras","2015Varas",2015,"SJRJ","Varas","Abril",11936,8857,3288,563009]
["2015SJRJJuizadosAbril","2015JuizadosAbril","2015SJRJJuizados","2015Juizados",2015,"SJRJ","Juizados","Abril",8270,7319,3083,101918]
["2015SJRJTurmas RecursaisAbril","2015Turmas RecursaisAbril","2015SJRJTurmas Recursais","2015Turmas Recursais",2015,"SJRJ","Turmas Recursais","Abril",3002,3927,0,84585]
["2015SJRJVarasMaio","2015VarasMaio","2015SJRJVaras","2015Varas",2015,"SJRJ","Varas","Maio",13640,9092,3204,564757]
["2015SJRJJuizadosMaio","2015JuizadosMaio","2015SJRJJuizados","2015Juizados",2015,"SJRJ","Juizados","Maio",9146,9233,3058,102805]
["2015SJRJTurmas RecursaisMaio","2015Turmas RecursaisMaio","2015SJRJTurmas Recursais","2015Turmas Recursais",2015,"SJRJ","Turmas Recursais","Maio",3140,4482,0,83420]
["2015SJRJVarasJunho","2015VarasJunho","2015SJRJVaras","2015Varas",2015,"SJRJ","Varas","Junho",6874,8440,2974,562467]
["2015SJRJJuizadosJunho","2015JuizadosJunho","2015SJRJJuizados","2015Juizados",2015,"SJRJ","Juizados","Junho",9193,8549,3257,103065]
["2015SJRJTurmas RecursaisJunho","2015Turmas RecursaisJunho","2015SJRJTurmas Recursais","2015Turmas Recursais",2015,"SJRJ","Turmas Recursais","Junho",3185,4522,0,83474]
["2015SJRJVarasJulho","2015VarasJulho","2015SJRJVaras","2015Varas",2015,"SJRJ","Varas","Julho",6622,8003,2796,560682]
["2015SJRJJuizadosJulho","2015JuizadosJulho","2015SJRJJuizados","2015Juizados",2015,"SJRJ","Juizados","Julho",10580,9771,3128,105482]
["2015SJRJTurmas RecursaisJulho","2015Turmas RecursaisJulho","2015SJRJTurmas Recursais","2015Turmas Recursais",2015,"SJRJ","Turmas Recursais","Julho",3203,4626,0,82262]
["2015SJRJVarasAgosto","2015VarasAgosto","2015SJRJVaras","2015Varas",2015,"SJRJ","Varas","Agosto",10292,7068,2189,563433]
["2015SJRJJuizadosAgosto","2015JuizadosAgosto","2015SJRJJuizados","2015Juizados",2015,"SJRJ","Juizados","Agosto",8517,8861,3275,105332]
["2015SJRJTurmas RecursaisAgosto","2015Turmas RecursaisAgosto","2015SJRJTurmas Recursais","2015Turmas Recursais",2015,"SJRJ","Turmas Recursais","Agosto",3139,4027,0,82693]
["2015SJRJVarasSetembro","2015VarasSetembro","2015SJRJVaras","2015Varas",2015,"SJRJ","Varas","Setembro",12666,7041,2638,567285]
["2015SJRJJuizadosSetembro","2015JuizadosSetembro","2015SJRJJuizados","2015Juizados",2015,"SJRJ","Juizados","Setembro",8496,8919,3339,104897]
["2015SJRJTurmas RecursaisSetembro","2015Turmas RecursaisSetembro","2015SJRJTurmas Recursais","2015Turmas Recursais",2015,"SJRJ","Turmas Recursais","Setembro",3438,4021,0,82609]
["2015SJRJVarasOutubro","2015VarasOutubro","2015SJRJVaras","2015Varas",2015,"SJRJ","Varas","Outubro",10132,7391,2432,569378]
["2015SJRJJuizadosOutubro","2015JuizadosOutubro","2015SJRJJuizados","2015Juizados",2015,"SJRJ","Juizados","Outubro",7626,9349,3262,103032]
["2015SJRJTurmas RecursaisOutubro","2015Turmas RecursaisOutubro",{"$f":"E355&F355&G355","v":"2015SJRJTurmas Recursais"},{"$f":"E355&G355","v":"2015Turmas Recursais"},2015,"SJRJ","Turmas Recursais","Outubro",3163,3703,0,83712]
["2015SJRJVarasNovembro","2015VarasNovembro","2015SJRJVaras","2015Varas",2015,"SJRJ","Varas","Novembro",7368,7108,2410,570049]
["2015SJRJJuizadosNovembro","2015JuizadosNovembro","2015SJRJJuizados","2015Juizados",2015,"SJRJ","Juizados","Novembro",7585,9002,3231,101770]
["2015SJRJTurmas RecursaisNovembro","2015Turmas RecursaisNovembro","2015SJRJTurmas Recursais","2015Turmas Recursais",2015,"SJRJ","Turmas Recursais","Novembro",3201,4248,0,83721]
[{"$f":"E359&F359&G359&H359","v":"2015SJRJVarasDezembro"},"2015VarasDezembro","2015SJRJVaras","2015Varas",2015,"SJRJ","Varas","Dezembro",7035,5475,1434,571789]
["2015SJRJJuizadosDezembro","2015JuizadosDezembro","2015SJRJJuizados","2015Juizados",2015,"SJRJ","Juizados","Dezembro",6435,6996,2011,102983]
["2015SJRJTurmas RecursaisDezembro","2015Turmas RecursaisDezembro","2015SJRJTurmas Recursais","2015Turmas Recursais",2015,"SJRJ","Turmas Recursais","Dezembro",2089,2227,0,83891]
["2014SJESVarasJaneiro","2014VarasJaneiro",{"$f":"E362&F362&G362","v":"2014SJESVaras"},{"$f":"E362&G362","v":"2014Varas"},2014,"SJES","Varas","Janeiro",1344,1565,458,113372]
["2014SJESJuizadosJaneiro","2014JuizadosJaneiro",{"$f":"E363&F363&G363","v":"2014SJESJuizados"},{"$f":"E363&G363","v":"2014Juizados"},2014,"SJES","Juizados","Janeiro",1114,1461,578,24478]
["2014SJESTurmas RecursaisJaneiro","2014Turmas RecursaisJaneiro","2014SJESTurmas Recursais","2014Turmas Recursais",2014,"SJES","Turmas Recursais","Janeiro",579,172,0,16870]
["2014SJESVarasFevereiro","2014VarasFevereiro","2014SJESVaras","2014Varas",2014,"SJES","Varas","Fevereiro",1501,1777,392,112645]
["2014SJESJuizadosFevereiro","2014JuizadosFevereiro","2014SJESJuizados","2014Juizados",2014,"SJES","Juizados","Fevereiro",1655,2232,590,23827]
["2014SJESTurmas RecursaisFevereiro","2014Turmas RecursaisFevereiro","2014SJESTurmas Recursais","2014Turmas Recursais",2014,"SJES","Turmas Recursais","Fevereiro",585,497,0,17142]
["2014SJESVarasMarço","2014VarasMarço","2014SJESVaras","2014Varas",2014,"SJES","Varas","Março",1655,1475,366,112774]
["2014SJESJuizadosMarço","2014JuizadosMarço","2014SJESJuizados","2014Juizados",2014,"SJES","Juizados","Março",2110,1562,576,23897]
["2014SJESTurmas RecursaisMarço","2014Turmas RecursaisMarço","2014SJESTurmas Recursais","2014Turmas Recursais",2014,"SJES","Turmas Recursais","Março",567,992,0,17605]
["2014SJESVarasAbril","2014VarasAbril","2014SJESVaras","2014Varas",2014,"SJES","Varas","Abril",1401,1073,504,112244]
["2014SJESJuizadosAbril","2014JuizadosAbril","2014SJESJuizados","2014Juizados",2014,"SJES","Juizados","Abril",1996,1354,560,24913]
["2014SJESTurmas RecursaisAbril","2014Turmas RecursaisAbril","2014SJESTurmas Recursais","2014Turmas Recursais",2014,"SJES","Turmas Recursais","Abril",564,1167,0,17401]
["2014SJESVarasMaio","2014VarasMaio","2014SJESVaras","2014Varas",2014,"SJES","Varas","Maio",1657,1498,334,111522]
["2014SJESJuizadosMaio","2014JuizadosMaio","2014SJESJuizados","2014Juizados",2014,"SJES","Juizados","Maio",2439,1609,535,25517]
["2014SJESTurmas RecursaisMaio","2014Turmas RecursaisMaio","2014SJESTurmas Recursais","2014Turmas Recursais",2014,"SJES","Turmas Recursais","Maio",501,487,0,17488]
["2014SJESVarasJunho","2014VarasJunho","2014SJESVaras","2014Varas",2014,"SJES","Varas","Junho",1281,1113,510,110544]
["2014SJESJuizadosJunho","2014JuizadosJunho","2014SJESJuizados","2014Juizados",2014,"SJES","Juizados","Junho",2232,1199,497,26680]
["2014SJESTurmas RecursaisJunho","2014Turmas RecursaisJunho","2014SJESTurmas Recursais","2014Turmas Recursais",2014,"SJES","Turmas Recursais","Junho",482,710,0,17280]
["2014SJESVarasJulho","2014VarasJulho","2014SJESVaras","2014Varas",2014,"SJES","Varas","Julho",1181,1399,656,109741]
["2014SJESJuizadosJulho","2014JuizadosJulho","2014SJESJuizados","2014Juizados",2014,"SJES","Juizados","Julho",1996,1484,515,27110]
["2014SJESTurmas RecursaisJulho","2014Turmas RecursaisJulho","2014SJESTurmas Recursais","2014Turmas Recursais",2014,"SJES","Turmas Recursais","Julho",563,486,0,17418]
["2014SJESVarasAgosto","2014VarasAgosto","2014SJESVaras","2014Varas",2014,"SJES","Varas","Agosto",1703,1341,352,109400]
["2014SJESJuizadosAgosto","2014JuizadosAgosto","2014SJESJuizados","2014Juizados",2014,"SJES","Juizados","Agosto",1765,1344,514,27567]
["2014SJESTurmas RecursaisAgosto","2014Turmas RecursaisAgosto","2014SJESTurmas Recursais","2014Turmas Recursais",2014,"SJES","Turmas Recursais","Agosto",508,797,0,17696]
["2014SJESVarasSetembro",{"$f":"E386&G386&H386","v":"2014VarasSetembro"},"2014SJESVaras","2014Varas",2014,"SJES","Varas","Setembro",1531,1333,355,109089]
["2014SJESJuizadosSetembro","2014JuizadosSetembro","2014SJESJuizados","2014Juizados",2014,"SJES","Juizados","Setembro",2145,1261,574,28113]
["2014SJESTurmas RecursaisSetembro","2014Turmas RecursaisSetembro","2014SJESTurmas Recursais","2014Turmas Recursais",2014,"SJES","Turmas Recursais","Setembro",547,581,0,17751]
["2014SJESVarasOutubro","2014VarasOutubro","2014SJESVaras","2014Varas",2014,"SJES","Varas","Outubro",2140,1312,509,109170]
["2014SJESJuizadosOutubro","2014JuizadosOutubro","2014SJESJuizados","2014Juizados",2014,"SJES","Juizados","Outubro",2260,1412,482,28721]
["2014SJESTurmas RecursaisOutubro","2014Turmas RecursaisOutubro","2014SJESTurmas Recursais","2014Turmas Recursais",2014,"SJES","Turmas Recursais","Outubro",459,1435,0,17834]
["2014SJESVarasNovembro","2014VarasNovembro","2014SJESVaras","2014Varas",2014,"SJES","Varas","Novembro",3656,1307,469,109866]
["2014SJESJuizadosNovembro","2014JuizadosNovembro","2014SJESJuizados","2014Juizados",2014,"SJES","Juizados","Novembro",1527,1273,418,29183]
["2014SJESTurmas RecursaisNovembro","2014Turmas RecursaisNovembro","2014SJESTurmas Recursais","2014Turmas Recursais",2014,"SJES","Turmas Recursais","Novembro",392,925,0,17563]
["2014SJESVarasDezembro","2014VarasDezembro","2014SJESVaras","2014Varas",2014,"SJES","Varas","Dezembro",3520,1183,286,112258]
["2014SJESJuizadosDezembro","2014JuizadosDezembro","2014SJESJuizados","2014Juizados",2014,"SJES","Juizados","Dezembro",1435,887,296,30303]
["2014SJESTurmas RecursaisDezembro","2014Turmas RecursaisDezembro","2014SJESTurmas Recursais","2014Turmas Recursais",2014,"SJES","Turmas Recursais","Dezembro",278,929,0,17361]
["2014SJRJVarasJaneiro","2014VarasJaneiro","2014SJRJVaras","2014Varas",2014,"SJRJ","Varas","Janeiro",9622,7594,2581,587033]
["2014SJRJJuizadosJaneiro","2014JuizadosJaneiro","2014SJRJJuizados","2014Juizados",2014,"SJRJ","Juizados","Janeiro",8466,8635,4564,104629]
["2014SJRJTurmas RecursaisJaneiro","2014Turmas RecursaisJaneiro","2014SJRJTurmas Recursais","2014Turmas Recursais",2014,"SJRJ","Turmas Recursais","Janeiro",4579,4567,0,79657]
["2014SJRJVarasFevereiro","2014VarasFevereiro","2014SJRJVaras","2014Varas",2014,"SJRJ","Varas","Fevereiro",13892,12730,3425,590589]
["2014SJRJJuizadosFevereiro","2014JuizadosFevereiro","2014SJRJJuizados","2014Juizados",2014,"SJRJ","Juizados","Fevereiro",9553,10633,4063,103300]
["2014SJRJTurmas RecursaisFevereiro","2014Turmas RecursaisFevereiro","2014SJRJTurmas Recursais","2014Turmas Recursais",2014,"SJRJ","Turmas Recursais","Fevereiro",3740,5961,0,80755]
["2014SJRJVarasMarço","2014VarasMarço","2014SJRJVaras","2014Varas",2014,"SJRJ","Varas","Março",11175,12203,3888,589288]
["2014SJRJJuizadosMarço","2014JuizadosMarço","2014SJRJJuizados","2014Juizados",2014,"SJRJ","Juizados","Março",9839,9889,4363,102725]
["2014SJRJTurmas RecursaisMarço","2014Turmas RecursaisMarço","2014SJRJTurmas Recursais","2014Turmas Recursais",2014,"SJRJ","Turmas Recursais","Março",4710,5194,0,81714]
["2014SJRJVarasAbril","2014VarasAbril","2014SJRJVaras","2014Varas",2014,"SJRJ","Varas","Abril",10472,10281,3500,587848]
["2014SJRJJuizadosAbril","2014JuizadosAbril","2014SJRJJuizados","2014Juizados",2014,"SJRJ","Juizados","Abril",9513,8860,4373,102538]
["2014SJRJTurmas RecursaisAbril","2014Turmas RecursaisAbril","2014SJRJTurmas Recursais","2014Turmas Recursais",2014,"SJRJ","Turmas Recursais","Abril",4248,7904,0,81809]
["2014SJRJVarasMaio","2014VarasMaio","2014SJRJVaras","2014Varas",2014,"SJRJ","Varas","Maio",6733,10815,5323,580620]
["2014SJRJJuizadosMaio","2014JuizadosMaio","2014SJRJJuizados","2014Juizados",2014,"SJRJ","Juizados","Maio",11631,11408,3951,104538]
["2014SJRJTurmas RecursaisMaio","2014Turmas RecursaisMaio","2014SJRJTurmas Recursais","2014Turmas Recursais",2014,"SJRJ","Turmas Recursais","Maio",3873,7937,0,81753]
["2014SJRJVarasJunho","2014VarasJunho","2014SJRJVaras","2014Varas",2014,"SJRJ","Varas","Junho",5842,9294,3415,575706]
["2014SJRJJuizadosJunho","2014JuizadosJunho","2014SJRJJuizados","2014Juizados",2014,"SJRJ","Juizados","Junho",9542,10040,4118,105084]
["2014SJRJTurmas RecursaisJunho","2014Turmas RecursaisJunho","2014SJRJTurmas Recursais","2014Turmas Recursais",2014,"SJRJ","Turmas Recursais","Junho",3851,5773,0,81122]
["2014SJRJVarasJulho","2014VarasJulho","2014SJRJVaras","2014Varas",2014,"SJRJ","Varas","Julho",7859,9869,5950,568811]
["2014SJRJJuizadosJulho","2014JuizadosJulho","2014SJRJJuizados","2014Juizados",2014,"SJRJ","Juizados","Julho",11271,11608,5253,104877]
["2014SJRJTurmas RecursaisJulho","2014Turmas RecursaisJulho","2014SJRJTurmas Recursais","2014Turmas Recursais",2014,"SJRJ","Turmas Recursais","Julho",5315,6758,0,82597]
["2014SJRJVarasAgosto","2014VarasAgosto","2014SJRJVaras","2014Varas",2014,"SJRJ","Varas","Agosto",8048,9390,4081,565338]
["2014SJRJJuizadosAgosto","2014JuizadosAgosto","2014SJRJJuizados","2014Juizados",2014,"SJRJ","Juizados","Agosto",9911,11090,4425,104327]
["2014SJRJTurmas RecursaisAgosto","2014Turmas RecursaisAgosto","2014SJRJTurmas Recursais","2014Turmas Recursais",2014,"SJRJ","Turmas Recursais","Agosto",4435,6924,0,82741]
["2014SJRJVarasSetembro","2014VarasSetembro","2014SJRJVaras","2014Varas",2014,"SJRJ","Varas","Setembro",11586,8677,3655,566568]
[{"$f":"E423&F423&G423&H423","v":"2014SJRJJuizadosSetembro"},"2014JuizadosSetembro","2014SJRJJuizados","2014Juizados",2014,"SJRJ","Juizados","Setembro",9983,9468,4654,104328]
["2014SJRJTurmas RecursaisSetembro","2014Turmas RecursaisSetembro","2014SJRJTurmas Recursais","2014Turmas Recursais",2014,"SJRJ","Turmas Recursais","Setembro",4469,6825,0,82557]
["2014SJRJVarasOutubro","2014VarasOutubro","2014SJRJVaras","2014Varas",2014,"SJRJ","Varas","Outubro",9227,10030,3602,564944]
["2014SJRJJuizadosOutubro","2014JuizadosOutubro","2014SJRJJuizados","2014Juizados",2014,"SJRJ","Juizados","Outubro",10050,11360,4099,103593]
["2014SJRJTurmas RecursaisOutubro","2014Turmas RecursaisOutubro",{"$f":"E427&F427&G427","v":"2014SJRJTurmas Recursais"},{"$f":"E427&G427","v":"2014Turmas Recursais"},2014,"SJRJ","Turmas Recursais","Outubro",4293,6071,0,84205]
["2014SJRJVarasNovembro","2014VarasNovembro","2014SJRJVaras","2014Varas",2014,"SJRJ","Varas","Novembro",13454,11849,3858,567921]
["2014SJRJJuizadosNovembro","2014JuizadosNovembro","2014SJRJJuizados","2014Juizados",2014,"SJRJ","Juizados","Novembro",7665,9607,3923,101927]
["2014SJRJTurmas RecursaisNovembro","2014Turmas RecursaisNovembro","2014SJRJTurmas Recursais","2014Turmas Recursais",2014,"SJRJ","Turmas Recursais","Novembro",3743,5311,0,83323]
["2014SJRJVarasDezembro","2014VarasDezembro","2014SJRJVaras","2014Varas",2014,"SJRJ","Varas","Dezembro",13756,9951,3152,572508]
["2014SJRJJuizadosDezembro","2014JuizadosDezembro","2014SJRJJuizados","2014Juizados",2014,"SJRJ","Juizados","Dezembro",7431,6819,2644,102785]
["2014SJRJTurmas RecursaisDezembro","2014Turmas RecursaisDezembro","2014SJRJTurmas Recursais","2014Turmas Recursais",2014,"SJRJ","Turmas Recursais","Dezembro",2740,3795,0,83589]
["2013SJESVarasJaneiro","2013VarasJaneiro",{"$f":"E434&F434&G434","v":"2013SJESVaras"},{"$f":"E434&G434","v":"2013Varas"},2013,"SJES","Varas","Janeiro",2045,1431,413,117493]
["2013SJESJuizadosJaneiro","2013JuizadosJaneiro",{"$f":"E435&F435&G435","v":"2013SJESJuizados"},{"$f":"E435&G435","v":"2013Juizados"},2013,"SJES","Juizados","Janeiro",901,1661,568,30926]
["2013SJESTurmas RecursaisJaneiro","2013Turmas RecursaisJaneiro","2013SJESTurmas Recursais","2013Turmas Recursais",2013,"SJES","Turmas Recursais","Janeiro",573,10,0,12402]
["2013SJESVarasFevereiro","2013VarasFevereiro","2013SJESVaras","2013Varas",2013,"SJES","Varas","Fevereiro",1185,1963,355,116678]
["2013SJESJuizadosFevereiro","2013JuizadosFevereiro","2013SJESJuizados","2013Juizados",2013,"SJES","Juizados","Fevereiro",985,1004,655,29877]
["2013SJESTurmas RecursaisFevereiro","2013Turmas RecursaisFevereiro","2013SJESTurmas Recursais","2013Turmas Recursais",2013,"SJES","Turmas Recursais","Fevereiro",723,535,0,12916]
["2013SJESVarasMarço","2013VarasMarço","2013SJESVaras","2013Varas",2013,"SJES","Varas","Março",1051,1860,294,115984]
["2013SJESJuizadosMarço","2013JuizadosMarço","2013SJESJuizados","2013Juizados",2013,"SJES","Juizados","Março",1167,1754,349,29153]
["2013SJESTurmas RecursaisMarço","2013Turmas RecursaisMarço","2013SJESTurmas Recursais","2013Turmas Recursais",2013,"SJES","Turmas Recursais","Março",2578,1431,0,13156]
["2013SJESVarasAbril","2013VarasAbril","2013SJESVaras","2013Varas",2013,"SJES","Varas","Abril",1952,2023,348,115714]
["2013SJESJuizadosAbril","2013JuizadosAbril","2013SJESJuizados","2013Juizados",2013,"SJES","Juizados","Abril",1335,1950,729,29147]
["2013SJESTurmas RecursaisAbril","2013Turmas RecursaisAbril","2013SJESTurmas Recursais","2013Turmas Recursais",2013,"SJES","Turmas Recursais","Abril",8880,94,0,13144]
["2013SJESVarasMaio","2013VarasMaio","2013SJESVaras","2013Varas",2013,"SJES","Varas","Maio",2139,1790,381,115714]
["2013SJESJuizadosMaio","2013JuizadosMaio","2013SJESJuizados","2013Juizados",2013,"SJES","Juizados","Maio",1270,1714,781,28558]
["2013SJESTurmas RecursaisMaio","2013Turmas RecursaisMaio","2013SJESTurmas Recursais","2013Turmas Recursais",2013,"SJES","Turmas Recursais","Maio",3554,433,0,13783]
["2013SJESVarasJunho","2013VarasJunho","2013SJESVaras","2013Varas",2013,"SJES","Varas","Junho",1850,2085,531,115555]
["2013SJESJuizadosJunho",{"$f":"E450&G450&H450","v":"2013JuizadosJunho"},"2013SJESJuizados","2013Juizados",2013,"SJES","Juizados","Junho",1185,1438,642,28415]
["2013SJESTurmas RecursaisJunho","2013Turmas RecursaisJunho","2013SJESTurmas Recursais","2013Turmas Recursais",2013,"SJES","Turmas Recursais","Junho",648,186,0,14409]
["2013SJESVarasJulho","2013VarasJulho","2013SJESVaras","2013Varas",2013,"SJES","Varas","Julho",1591,1444,805,114592]
["2013SJESJuizadosJulho","2013JuizadosJulho","2013SJESJuizados","2013Juizados",2013,"SJES","Juizados","Julho",1560,1612,747,28043]
["2013SJESTurmas RecursaisJulho","2013Turmas RecursaisJulho","2013SJESTurmas Recursais","2013Turmas Recursais",2013,"SJES","Turmas Recursais","Julho",1052,556,0,14912]
["2013SJESVarasAgosto","2013VarasAgosto","2013SJESVaras","2013Varas",2013,"SJES","Varas","Agosto",1754,2505,416,113954]
["2013SJESJuizadosAgosto","2013JuizadosAgosto","2013SJESJuizados","2013Juizados",2013,"SJES","Juizados","Agosto",1283,1477,620,27553]
["2013SJESTurmas RecursaisAgosto","2013Turmas RecursaisAgosto","2013SJESTurmas Recursais","2013Turmas Recursais",2013,"SJES","Turmas Recursais","Agosto",2628,621,0,15378]
["2013SJESVarasSetembro","2013VarasSetembro","2013SJESVaras","2013Varas",2013,"SJES","Varas","Setembro",1460,2139,889,112944]
["2013SJESJuizadosSetembro","2013JuizadosSetembro","2013SJESJuizados","2013Juizados",2013,"SJES","Juizados","Setembro",1327,1846,670,26727]
["2013SJESTurmas RecursaisSetembro","2013Turmas RecursaisSetembro","2013SJESTurmas Recursais","2013Turmas Recursais",2013,"SJES","Turmas Recursais","Setembro",1000,701,0,15911]
["2013SJESVarasOutubro","2013VarasOutubro","2013SJESVaras","2013Varas",2013,"SJES","Varas","Outubro",1894,1665,431,112691]
["2013SJESJuizadosOutubro","2013JuizadosOutubro","2013SJESJuizados","2013Juizados",2013,"SJES","Juizados","Outubro",1312,2315,736,25929]
["2013SJESTurmas RecursaisOutubro","2013Turmas RecursaisOutubro","2013SJESTurmas Recursais","2013Turmas Recursais",2013,"SJES","Turmas Recursais","Outubro",838,1527,0,16250]
["2013SJESVarasNovembro","2013VarasNovembro","2013SJESVaras","2013Varas",2013,"SJES","Varas","Novembro",2558,1782,382,113437]
["2013SJESJuizadosNovembro","2013JuizadosNovembro","2013SJESJuizados","2013Juizados",2013,"SJES","Juizados","Novembro",1219,1550,638,25155]
["2013SJESTurmas RecursaisNovembro","2013Turmas RecursaisNovembro","2013SJESTurmas Recursais","2013Turmas Recursais",2013,"SJES","Turmas Recursais","Novembro",1719,588,0,16548]
["2013SJESVarasDezembro","2013VarasDezembro","2013SJESVaras","2013Varas",2013,"SJES","Varas","Dezembro",2010,1155,301,114324]
["2013SJESJuizadosDezembro","2013JuizadosDezembro","2013SJESJuizados","2013Juizados",2013,"SJES","Juizados","Dezembro",1015,1406,528,25192]
["2013SJESTurmas RecursaisDezembro","2013Turmas RecursaisDezembro","2013SJESTurmas Recursais","2013Turmas Recursais",2013,"SJES","Turmas Recursais","Dezembro",1077,916,0,16755]
["2013SJRJVarasJaneiro","2013VarasJaneiro","2013SJRJVaras","2013Varas",2013,"SJRJ","Varas","Janeiro",7183,6954,2454,630804]
["2013SJRJJuizadosJaneiro","2013JuizadosJaneiro","2013SJRJJuizados","2013Juizados",2013,"SJRJ","Juizados","Janeiro",6943,8643,2924,111726]
["2013SJRJTurmas RecursaisJaneiro","2013Turmas RecursaisJaneiro","2013SJRJTurmas Recursais","2013Turmas Recursais",2013,"SJRJ","Turmas Recursais","Janeiro",4259,2060,0,65220]
["2013SJRJVarasFevereiro","2013VarasFevereiro","2013SJRJVaras","2013Varas",2013,"SJRJ","Varas","Fevereiro",5764,10433,1942,630632]
["2013SJRJJuizadosFevereiro","2013JuizadosFevereiro","2013SJRJJuizados","2013Juizados",2013,"SJRJ","Juizados","Fevereiro",5844,8413,2544,109640]
["2013SJRJTurmas RecursaisFevereiro","2013Turmas RecursaisFevereiro","2013SJRJTurmas Recursais","2013Turmas Recursais",2013,"SJRJ","Turmas Recursais","Fevereiro",4344,3380,0,66279]
["2013SJRJVarasMarço","2013VarasMarço","2013SJRJVaras","2013Varas",2013,"SJRJ","Varas","Março",5104,10981,2270,628053]
["2013SJRJJuizadosMarço","2013JuizadosMarço","2013SJRJJuizados","2013Juizados",2013,"SJRJ","Juizados","Março",7149,9642,2974,108711]
["2013SJRJTurmas RecursaisMarço","2013Turmas RecursaisMarço","2013SJRJTurmas Recursais","2013Turmas Recursais",2013,"SJRJ","Turmas Recursais","Março",3773,3931,0,68039]
["2013SJRJVarasAbril","2013VarasAbril","2013SJRJVaras","2013Varas",2013,"SJRJ","Varas","Abril",5103,8870,3363,618273]
["2013SJRJJuizadosAbril","2013JuizadosAbril","2013SJRJJuizados","2013Juizados",2013,"SJRJ","Juizados","Abril",7281,9020,3765,107676]
["2013SJRJTurmas RecursaisAbril","2013Turmas RecursaisAbril","2013SJRJTurmas Recursais","2013Turmas Recursais",2013,"SJRJ","Turmas Recursais","Abril",5164,4296,0,68645]
["2013SJRJVarasMaio","2013VarasMaio","2013SJRJVaras","2013Varas",2013,"SJRJ","Varas","Maio",7754,15386,3944,613560]
["2013SJRJJuizadosMaio","2013JuizadosMaio","2013SJRJJuizados","2013Juizados",2013,"SJRJ","Juizados","Maio",11114,10471,3900,109200]
["2013SJRJTurmas RecursaisMaio","2013Turmas RecursaisMaio","2013SJRJTurmas Recursais","2013Turmas Recursais",2013,"SJRJ","Turmas Recursais","Maio",4796,7004,0,70817]
["2013SJRJVarasJunho","2013VarasJunho","2013SJRJVaras","2013Varas",2013,"SJRJ","Varas","Junho",4196,9409,3346,604401]
["2013SJRJJuizadosJunho","2013JuizadosJunho","2013SJRJJuizados","2013Juizados",2013,"SJRJ","Juizados","Junho",6278,9082,3491,107645]
[{"$f":"E487&F487&G487&H487","v":"2013SJRJTurmas RecursaisJunho"},"2013Turmas RecursaisJunho","2013SJRJTurmas Recursais","2013Turmas Recursais",2013,"SJRJ","Turmas Recursais","Junho",4966,5843,0,71880]
["2013SJRJVarasJulho","2013VarasJulho","2013SJRJVaras","2013Varas",2013,"SJRJ","Varas","Julho",5713,10076,4326,595372]
["2013SJRJJuizadosJulho","2013JuizadosJulho","2013SJRJJuizados","2013Juizados",2013,"SJRJ","Juizados","Julho",8177,9565,4029,106121]
["2013SJRJTurmas RecursaisJulho","2013Turmas RecursaisJulho","2013SJRJTurmas Recursais","2013Turmas Recursais",2013,"SJRJ","Turmas Recursais","Julho",5715,4122,0,71467]
["2013SJRJVarasAgosto","2013VarasAgosto","2013SJRJVaras","2013Varas",2013,"SJRJ","Varas","Agosto",10827,14046,3666,592974]
["2013SJRJJuizadosAgosto","2013JuizadosAgosto","2013SJRJJuizados","2013Juizados",2013,"SJRJ","Juizados","Agosto",14326,12269,4133,110312]
["2013SJRJTurmas RecursaisAgosto","2013Turmas RecursaisAgosto","2013SJRJTurmas Recursais","2013Turmas Recursais",2013,"SJRJ","Turmas Recursais","Agosto",5555,5043,0,72490]
["2013SJRJVarasSetembro","2013VarasSetembro","2013SJRJVaras","2013Varas",2013,"SJRJ","Varas","Setembro",12946,11090,3775,592307]
["2013SJRJJuizadosSetembro","2013JuizadosSetembro","2013SJRJJuizados","2013Juizados",2013,"SJRJ","Juizados","Setembro",9905,11739,4571,110376]
["2013SJRJTurmas RecursaisSetembro","2013Turmas RecursaisSetembro","2013SJRJTurmas Recursais","2013Turmas Recursais",2013,"SJRJ","Turmas Recursais","Setembro",5624,5337,0,72462]
["2013SJRJVarasOutubro","2013VarasOutubro","2013SJRJVaras","2013Varas",2013,"SJRJ","Varas","Outubro",7126,10048,4294,585510]
["2013SJRJJuizadosOutubro","2013JuizadosOutubro","2013SJRJJuizados","2013Juizados",2013,"SJRJ","Juizados","Outubro",10615,12800,5915,108114]
["2013SJRJTurmas RecursaisOutubro","2013Turmas RecursaisOutubro",{"$f":"E499&F499&G499","v":"2013SJRJTurmas Recursais"},{"$f":"E499&G499","v":"2013Turmas Recursais"},2013,"SJRJ","Turmas Recursais","Outubro",7129,7517,0,75161]
["2013SJRJVarasNovembro","2013VarasNovembro","2013SJRJVaras","2013Varas",2013,"SJRJ","Varas","Novembro",5864,8662,3510,581153]
["2013SJRJJuizadosNovembro","2013JuizadosNovembro","2013SJRJJuizados","2013Juizados",2013,"SJRJ","Juizados","Novembro",10032,11016,4502,107995]
["2013SJRJTurmas RecursaisNovembro","2013Turmas RecursaisNovembro","2013SJRJTurmas Recursais","2013Turmas Recursais",2013,"SJRJ","Turmas Recursais","Novembro",6087,6025,0,76150]
["2013SJRJVarasDezembro","2013VarasDezembro","2013SJRJVaras","2013Varas",2013,"SJRJ","Varas","Dezembro",10381,6363,2384,584820]
["2013SJRJJuizadosDezembro","2013JuizadosDezembro","2013SJRJJuizados","2013Juizados",2013,"SJRJ","Juizados","Dezembro",6828,7252,3662,106558]
["2013SJRJTurmas RecursaisDezembro","2013Turmas RecursaisDezembro","2013SJRJTurmas Recursais","2013Turmas Recursais",2013,"SJRJ","Turmas Recursais","Dezembro",6261,4528,0,77659]
["2012SJESVarasJaneiro","2012VarasJaneiro","2012SJESVaras","2012Varas",2012,"SJES","Varas","Janeiro",3532,1401,223,118588]
["2012SJESJuizadosJaneiro","2012JuizadosJaneiro","2012SJESJuizados","2012Juizados",2012,"SJES","Juizados","Janeiro",993,1270,161,32925]
["2012SJESTurmas RecursaisJaneiro","2012Turmas RecursaisJaneiro","2012SJESTurmas Recursais","2012Turmas Recursais",2012,"SJES","Turmas Recursais","Janeiro",281,21,null,10043]
["2012SJESVarasFevereiro","2012VarasFevereiro","2012SJESVaras","2012Varas",2012,"SJES","Varas","Fevereiro",1657,1967,333,118612]
["2012SJESJuizadosFevereiro","2012JuizadosFevereiro","2012SJESJuizados","2012Juizados",2012,"SJES","Juizados","Fevereiro",1063,1328,327,32539]
["2012SJESTurmas RecursaisFevereiro","2012Turmas RecursaisFevereiro","2012SJESTurmas Recursais","2012Turmas Recursais",2012,"SJES","Turmas Recursais","Fevereiro",369,321,null,10050]
["2012SJESVarasMarço","2012VarasMarço","2012SJESVaras","2012Varas",2012,"SJES","Varas","Março",2077,1624,453,118590]
["2012SJESJuizadosMarço","2012JuizadosMarço","2012SJESJuizados","2012Juizados",2012,"SJES","Juizados","Março",1803,2024,514,32666]
["2012SJESTurmas RecursaisMarço",{"$f":"E514&G514&H514","v":"2012Turmas RecursaisMarço"},"2012SJESTurmas Recursais","2012Turmas Recursais",2012,"SJES","Turmas Recursais","Março",477,1197,null,10288]
["2012SJESVarasAbril","2012VarasAbril","2012SJESVaras","2012Varas",2012,"SJES","Varas","Abril",1238,1478,421,118546]
["2012SJESJuizadosAbril","2012JuizadosAbril","2012SJESJuizados","2012Juizados",2012,"SJES","Juizados","Abril",1510,1313,327,32929]
["2012SJESTurmas RecursaisAbril","2012Turmas RecursaisAbril","2012SJESTurmas Recursais","2012Turmas Recursais",2012,"SJES","Turmas Recursais","Abril",372,307,null,10271]
["2012SJESVarasMaio","2012VarasMaio","2012SJESVaras","2012Varas",2012,"SJES","Varas","Maio",2259,1319,631,118796]
["2012SJESJuizadosMaio","2012JuizadosMaio","2012SJESJuizados","2012Juizados",2012,"SJES","Juizados","Maio",2091,1329,799,33490]
["2012SJESTurmas RecursaisMaio","2012Turmas RecursaisMaio","2012SJESTurmas Recursais","2012Turmas Recursais",2012,"SJES","Turmas Recursais","Maio",649,360,null,10356]
["2012SJESVarasJunho","2012VarasJunho","2012SJESVaras","2012Varas",2012,"SJES","Varas","Junho",1906,1914,455,118916]
["2012SJESJuizadosJunho","2012JuizadosJunho","2012SJESJuizados","2012Juizados",2012,"SJES","Juizados","Junho",2155,1184,549,34080]
["2012SJESTurmas RecursaisJunho","2012Turmas RecursaisJunho","2012SJESTurmas Recursais","2012Turmas Recursais",2012,"SJES","Turmas Recursais","Junho",669,740,null,10330]
["2012SJESVarasJulho","2012VarasJulho","2012SJESVaras","2012Varas",2012,"SJES","Varas","Julho",1463,1606,339,118983]
["2012SJESJuizadosJulho","2012JuizadosJulho","2012SJESJuizados","2012Juizados",2012,"SJES","Juizados","Julho",2223,2969,473,35153]
["2012SJESTurmas RecursaisJulho","2012Turmas RecursaisJulho","2012SJESTurmas Recursais","2012Turmas Recursais",2012,"SJES","Turmas Recursais","Julho",470,53,null,10339]
["2012SJESVarasAgosto","2012VarasAgosto","2012SJESVaras","2012Varas",2012,"SJES","Varas","Agosto",1510,1469,792,118305]
["2012SJESJuizadosAgosto","2012JuizadosAgosto","2012SJESJuizados","2012Juizados",2012,"SJES","Juizados","Agosto",1337,2036,493,34761]
["2012SJESTurmas RecursaisAgosto","2012Turmas RecursaisAgosto","2012SJESTurmas Recursais","2012Turmas Recursais",2012,"SJES","Turmas Recursais","Agosto",619,6,null,10152]
["2012SJESVarasSetembro","2012VarasSetembro","2012SJESVaras","2012Varas",2012,"SJES","Varas","Setembro",1564,1718,338,118110]
["2012SJESJuizadosSetembro","2012JuizadosSetembro","2012SJESJuizados","2012Juizados",2012,"SJES","Juizados","Setembro",1058,1699,440,33975]
["2012SJESTurmas RecursaisSetembro","2012Turmas RecursaisSetembro","2012SJESTurmas Recursais","2012Turmas Recursais",2012,"SJES","Turmas Recursais","Setembro",1656,310,null,10773]
["2012SJESVarasOutubro","2012VarasOutubro","2012SJESVaras","2012Varas",2012,"SJES","Varas","Outubro",1764,2080,479,117860]
["2012SJESJuizadosOutubro","2012JuizadosOutubro","2012SJESJuizados","2012Juizados",2012,"SJES","Juizados","Outubro",1330,2611,741,32773]
["2012SJESTurmas RecursaisOutubro","2012Turmas RecursaisOutubro","2012SJESTurmas Recursais","2012Turmas Recursais",2012,"SJES","Turmas Recursais","Outubro",826,513,null,11498]
["2012SJESVarasNovembro","2012VarasNovembro","2012SJESVaras","2012Varas",2012,"SJES","Varas","Novembro",1451,2017,342,117436]
["2012SJESJuizadosNovembro","2012JuizadosNovembro","2012SJESJuizados","2012Juizados",2012,"SJES","Juizados","Novembro",1028,1410,640,31315]
["2012SJESTurmas RecursaisNovembro","2012Turmas RecursaisNovembro","2012SJESTurmas Recursais","2012Turmas Recursais",2012,"SJES","Turmas Recursais","Novembro",589,280,null,11845]
["2012SJESVarasDezembro","2012VarasDezembro","2012SJESVaras","2012Varas",2012,"SJES","Varas","Dezembro",1008,1364,244,117094]
["2012SJESJuizadosDezembro","2012JuizadosDezembro","2012SJESJuizados","2012Juizados",2012,"SJES","Juizados","Dezembro",916,1494,430,31171]
["2012SJESTurmas RecursaisDezembro","2012Turmas RecursaisDezembro","2012SJESTurmas Recursais","2012Turmas Recursais",2012,"SJES","Turmas Recursais","Dezembro",488,174,null,12128]
["2012SJRJVarasJaneiro","2012VarasJaneiro","2012SJRJVaras","2012Varas",2012,"SJRJ","Varas","Janeiro",8095,7039,2305,644095]
["2012SJRJJuizadosJaneiro","2012JuizadosJaneiro","2012SJRJJuizados","2012Juizados",2012,"SJRJ","Juizados","Janeiro",5065,7094,3153,137616]
["2012SJRJTurmas RecursaisJaneiro","2012Turmas RecursaisJaneiro","2012SJRJTurmas Recursais","2012Turmas Recursais",2012,"SJRJ","Turmas Recursais","Janeiro",8610,2918,null,49949]
["2012SJRJVarasFevereiro","2012VarasFevereiro","2012SJRJVaras","2012Varas",2012,"SJRJ","Varas","Fevereiro",7259,6536,2395,644026]
["2012SJRJJuizadosFevereiro","2012JuizadosFevereiro","2012SJRJJuizados","2012Juizados",2012,"SJRJ","Juizados","Fevereiro",6232,7862,3500,133485]
["2012SJRJTurmas RecursaisFevereiro","2012Turmas RecursaisFevereiro","2012SJRJTurmas Recursais","2012Turmas Recursais",2012,"SJRJ","Turmas Recursais","Fevereiro",4354,4227,null,52864]
["2012SJRJVarasMarço","2012VarasMarço","2012SJRJVaras","2012Varas",2012,"SJRJ","Varas","Março",9069,8514,2546,643969]
["2012SJRJJuizadosMarço","2012JuizadosMarço","2012SJRJJuizados","2012Juizados",2012,"SJRJ","Juizados","Março",7389,9254,3735,130528]
["2012SJRJTurmas RecursaisMarço","2012Turmas RecursaisMarço","2012SJRJTurmas Recursais","2012Turmas Recursais",2012,"SJRJ","Turmas Recursais","Março",3764,6296,null,53900]
[{"$f":"E551&F551&G551&H551","v":"2012SJRJVarasAbril"},"2012VarasAbril","2012SJRJVaras","2012Varas",2012,"SJRJ","Varas","Abril",6250,6667,2019,643547]
["2012SJRJJuizadosAbril","2012JuizadosAbril","2012SJRJJuizados","2012Juizados",2012,"SJRJ","Juizados","Abril",6524,7164,2850,129436]
["2012SJRJTurmas RecursaisAbril","2012Turmas RecursaisAbril","2012SJRJTurmas Recursais","2012Turmas Recursais",2012,"SJRJ","Turmas Recursais","Abril",2820,5097,null,53424]
["2012SJRJVarasMaio","2012VarasMaio","2012SJRJVaras","2012Varas",2012,"SJRJ","Varas","Maio",11491,10959,3732,642465]
["2012SJRJJuizadosMaio","2012JuizadosMaio","2012SJRJJuizados","2012Juizados",2012,"SJRJ","Juizados","Maio",7462,9305,3715,126142]
["2012SJRJTurmas RecursaisMaio","2012Turmas RecursaisMaio","2012SJRJTurmas Recursais","2012Turmas Recursais",2012,"SJRJ","Turmas Recursais","Maio",3607,6440,null,53983]
["2012SJRJVarasJunho","2012VarasJunho","2012SJRJVaras","2012Varas",2012,"SJRJ","Varas","Junho",7996,8486,2020,641514]
["2012SJRJJuizadosJunho","2012JuizadosJunho","2012SJRJJuizados","2012Juizados",2012,"SJRJ","Juizados","Junho",6526,7889,3349,123732]
["2012SJRJTurmas RecursaisJunho","2012Turmas RecursaisJunho","2012SJRJTurmas Recursais","2012Turmas Recursais",2012,"SJRJ","Turmas Recursais","Junho",3274,5150,null,55184]
["2012SJRJVarasJulho","2012VarasJulho","2012SJRJVaras","2012Varas",2012,"SJRJ","Varas","Julho",10126,8836,3220,639883]
["2012SJRJJuizadosJulho","2012JuizadosJulho","2012SJRJJuizados","2012Juizados",2012,"SJRJ","Juizados","Julho",7387,9121,3822,121662]
["2012SJRJTurmas RecursaisJulho","2012Turmas RecursaisJulho","2012SJRJTurmas Recursais","2012Turmas Recursais",2012,"SJRJ","Turmas Recursais","Julho",3775,2938,null,54868]
["2012SJRJVarasAgosto","2012VarasAgosto",{"$f":"E563&F563&G563","v":"2012SJRJVaras"},{"$f":"E563&G563","v":"2012Varas"},2012,"SJRJ","Varas","Agosto",7814,9548,3482,635385]
["2012SJRJJuizadosAgosto","2012JuizadosAgosto","2012SJRJJuizados","2012Juizados",2012,"SJRJ","Juizados","Agosto",8755,8247,3985,119580]
["2012SJRJTurmas RecursaisAgosto","2012Turmas RecursaisAgosto","2012SJRJTurmas Recursais","2012Turmas Recursais",2012,"SJRJ","Turmas Recursais","Agosto",1185,193,null,54439]
["2012SJRJVarasSetembro","2012VarasSetembro","2012SJRJVaras","2012Varas",2012,"SJRJ","Varas","Setembro",7207,7443,2414,633383]
["2012SJRJJuizadosSetembro","2012JuizadosSetembro","2012SJRJJuizados","2012Juizados",2012,"SJRJ","Juizados","Setembro",6823,8505,2818,116874]
["2012SJRJTurmas RecursaisSetembro","2012Turmas RecursaisSetembro","2012SJRJTurmas Recursais","2012Turmas Recursais",2012,"SJRJ","Turmas Recursais","Setembro",5892,929,null,60034]
["2012SJRJVarasOutubro","2012VarasOutubro","2012SJRJVaras","2012Varas",2012,"SJRJ","Varas","Outubro",8289,13259,3310,631321]
["2012SJRJJuizadosOutubro","2012JuizadosOutubro","2012SJRJJuizados","2012Juizados",2012,"SJRJ","Juizados","Outubro",7853,11462,3267,114469]
["2012SJRJTurmas RecursaisOutubro","2012Turmas RecursaisOutubro","2012SJRJTurmas Recursais","2012Turmas Recursais",2012,"SJRJ","Turmas Recursais","Outubro",4240,7474,null,63423]
["2012SJRJVarasNovembro","2012VarasNovembro","2012SJRJVaras","2012Varas",2012,"SJRJ","Varas","Novembro",5585,7250,2683,628714]
["2012SJRJJuizadosNovembro","2012JuizadosNovembro","2012SJRJJuizados","2012Juizados",2012,"SJRJ","Juizados","Novembro",6879,7486,3372,112695]
["2012SJRJTurmas RecursaisNovembro","2012Turmas RecursaisNovembro","2012SJRJTurmas Recursais","2012Turmas Recursais",2012,"SJRJ","Turmas Recursais","Novembro",4655,5278,null,64742]
["2012SJRJVarasDezembro","2012VarasDezembro","2012SJRJVaras","2012Varas",2012,"SJRJ","Varas","Dezembro",7441,6105,2207,630103]
["2012SJRJJuizadosDezembro","2012JuizadosDezembro","2012SJRJJuizados","2012Juizados",2012,"SJRJ","Juizados","Dezembro",6144,6058,2248,111759]
["2012SJRJTurmas RecursaisDezembro","2012Turmas RecursaisDezembro","2012SJRJTurmas Recursais","2012Turmas Recursais",2012,"SJRJ","Turmas Recursais","Dezembro",3251,2854,null,65235]
["2011SJESVarasJaneiro",{"$f":"E578&G578&H578","v":"2011VarasJaneiro"},"2011SJESVaras","2011Varas",2011,"SJES","Varas","Janeiro",1467,878,239,112363]
["2011SJESJuizadosJaneiro","2011JuizadosJaneiro","2011SJESJuizados","2011Juizados",2011,"SJES","Juizados","Janeiro",1076,772,258,30199]
["2011SJESTurmas RecursaisJaneiro","2011Turmas RecursaisJaneiro","2011SJESTurmas Recursais","2011Turmas Recursais",2011,"SJES","Turmas Recursais","Janeiro",258,1,null,6094]
["2011SJESVarasFevereiro","2011VarasFevereiro","2011SJESVaras","2011Varas",2011,"SJES","Varas","Fevereiro",1684,1357,325,112695]
["2011SJESJuizadosFevereiro","2011JuizadosFevereiro","2011SJESJuizados","2011Juizados",2011,"SJES","Juizados","Fevereiro",1416,1197,509,30185]
["2011SJESTurmas RecursaisFevereiro","2011Turmas RecursaisFevereiro","2011SJESTurmas Recursais","2011Turmas Recursais",2011,"SJES","Turmas Recursais","Fevereiro",302,256,null,7007]
["2011SJESVarasMarço","2011VarasMarço","2011SJESVaras","2011Varas",2011,"SJES","Varas","Março",1148,1277,311,112732]
["2011SJESJuizadosMarço","2011JuizadosMarço","2011SJESJuizados","2011Juizados",2011,"SJES","Juizados","Março",1537,1179,375,30575]
["2011SJESTurmas RecursaisMarço","2011Turmas RecursaisMarço","2011SJESTurmas Recursais","2011Turmas Recursais",2011,"SJES","Turmas Recursais","Março",560,333,null,7610]
["2011SJESVarasAbril","2011VarasAbril","2011SJESVaras","2011Varas",2011,"SJES","Varas","Abril",1159,760,304,112498]
["2011SJESJuizadosAbril","2011JuizadosAbril","2011SJESJuizados","2011Juizados",2011,"SJES","Juizados","Abril",1437,1179,383,31142]
["2011SJESTurmas RecursaisAbril","2011Turmas RecursaisAbril","2011SJESTurmas Recursais","2011Turmas Recursais",2011,"SJES","Turmas Recursais","Abril",343,204,null,7793]
["2011SJESVarasMaio","2011VarasMaio","2011SJESVaras","2011Varas",2011,"SJES","Varas","Maio",2066,1250,322,113599]
["2011SJESJuizadosMaio","2011JuizadosMaio","2011SJESJuizados","2011Juizados",2011,"SJES","Juizados","Maio",2095,1607,432,32182]
["2011SJESTurmas RecursaisMaio","2011Turmas RecursaisMaio","2011SJESTurmas Recursais","2011Turmas Recursais",2011,"SJES","Turmas Recursais","Maio",330,192,null,7968]
["2011SJESVarasJunho","2011VarasJunho","2011SJESVaras","2011Varas",2011,"SJES","Varas","Junho",2011,1332,398,114500]
["2011SJESJuizadosJunho","2011JuizadosJunho","2011SJESJuizados","2011Juizados",2011,"SJES","Juizados","Junho",1294,1499,391,32409]
["2011SJESTurmas RecursaisJunho","2011Turmas RecursaisJunho","2011SJESTurmas Recursais","2011Turmas Recursais",2011,"SJES","Turmas Recursais","Junho",496,402,null,8270]
["2011SJESVarasJulho","2011VarasJulho","2011SJESVaras","2011Varas",2011,"SJES","Varas","Julho",2242,1284,277,115024]
["2011SJESJuizadosJulho","2011JuizadosJulho","2011SJESJuizados","2011Juizados",2011,"SJES","Juizados","Julho",1327,1225,703,32388]
["2011SJESTurmas RecursaisJulho","2011Turmas RecursaisJulho","2011SJESTurmas Recursais","2011Turmas Recursais",2011,"SJES","Turmas Recursais","Julho",879,318,null,8868]
["2011SJESVarasAgosto","2011VarasAgosto","2011SJESVaras","2011Varas",2011,"SJES","Varas","Agosto",2135,1678,310,115485]
["2011SJESJuizadosAgosto","2011JuizadosAgosto","2011SJESJuizados","2011Juizados",2011,"SJES","Juizados","Agosto",1552,1317,524,32622]
["2011SJESTurmas RecursaisAgosto","2011Turmas RecursaisAgosto","2011SJESTurmas Recursais","2011Turmas Recursais",2011,"SJES","Turmas Recursais","Agosto",649,684,null,9174]
["2011SJESVarasSetembro","2011VarasSetembro","2011SJESVaras","2011Varas",2011,"SJES","Varas","Setembro",2800,1305,274,116327]
["2011SJESJuizadosSetembro","2011JuizadosSetembro","2011SJESJuizados","2011Juizados",2011,"SJES","Juizados","Setembro",1131,1329,513,32583]
["2011SJESTurmas RecursaisSetembro","2011Turmas RecursaisSetembro","2011SJESTurmas Recursais","2011Turmas Recursais",2011,"SJES","Turmas Recursais","Setembro",506,421,null,9512]
["2011SJESVarasOutubro","2011VarasOutubro","2011SJESVaras","2011Varas",2011,"SJES","Varas","Outubro",1986,1479,790,116663]
["2011SJESJuizadosOutubro","2011JuizadosOutubro","2011SJESJuizados","2011Juizados",2011,"SJES","Juizados","Outubro",1251,1356,718,32568]
["2011SJESTurmas RecursaisOutubro","2011Turmas RecursaisOutubro","2011SJESTurmas Recursais","2011Turmas Recursais",2011,"SJES","Turmas Recursais","Outubro",785,415,null,9813]
["2011SJESVarasNovembro","2011VarasNovembro","2011SJESVaras","2011Varas",2011,"SJES","Varas","Novembro",1142,919,331,116429]
["2011SJESJuizadosNovembro","2011JuizadosNovembro","2011SJESJuizados","2011Juizados",2011,"SJES","Juizados","Novembro",1292,973,502,32725]
["2011SJESTurmas RecursaisNovembro","2011Turmas RecursaisNovembro","2011SJESTurmas Recursais","2011Turmas Recursais",2011,"SJES","Turmas Recursais","Novembro",410,382,null,9933]
["2011SJESVarasDezembro","2011VarasDezembro","2011SJESVaras","2011Varas",2011,"SJES","Varas","Dezembro",1864,918,166,116456]
["2011SJESJuizadosDezembro","2011JuizadosDezembro","2011SJESJuizados","2011Juizados",2011,"SJES","Juizados","Dezembro",830,766,264,32798]
["2011SJESTurmas RecursaisDezembro","2011Turmas RecursaisDezembro","2011SJESTurmas Recursais","2011Turmas Recursais",2011,"SJES","Turmas Recursais","Dezembro",339,196,null,10015]
["2011SJRJVarasJaneiro","2011VarasJaneiro","2011SJRJVaras","2011Varas",2011,"SJRJ","Varas","Janeiro",6502,5045,2070,667718]
[{"$f":"E615&F615&G615&H615","v":"2011SJRJJuizadosJaneiro"},"2011JuizadosJaneiro","2011SJRJJuizados","2011Juizados",2011,"SJRJ","Juizados","Janeiro",5788,7231,3454,159944]
["2011SJRJTurmas RecursaisJaneiro","2011Turmas RecursaisJaneiro","2011SJRJTurmas Recursais","2011Turmas Recursais",2011,"SJRJ","Turmas Recursais","Janeiro",2929,1723,null,43002]
["2011SJRJVarasFevereiro","2011VarasFevereiro","2011SJRJVaras","2011Varas",2011,"SJRJ","Varas","Fevereiro",7520,8023,3743,664342]
["2011SJRJJuizadosFevereiro","2011JuizadosFevereiro","2011SJRJJuizados","2011Juizados",2011,"SJRJ","Juizados","Fevereiro",10011,10279,3518,160857]
["2011SJRJTurmas RecursaisFevereiro","2011Turmas RecursaisFevereiro","2011SJRJTurmas Recursais","2011Turmas Recursais",2011,"SJRJ","Turmas Recursais","Fevereiro",3630,4783,null,43882]
["2011SJRJVarasMarço","2011VarasMarço","2011SJRJVaras","2011Varas",2011,"SJRJ","Varas","Março",6108,6777,2805,661478]
["2011SJRJJuizadosMarço","2011JuizadosMarço","2011SJRJJuizados","2011Juizados",2011,"SJRJ","Juizados","Março",7461,9283,3011,160232]
["2011SJRJTurmas RecursaisMarço","2011Turmas RecursaisMarço","2011SJRJTurmas Recursais","2011Turmas Recursais",2011,"SJRJ","Turmas Recursais","Março",2522,5081,null,44068]
["2011SJRJVarasAbril","2011VarasAbril","2011SJRJVaras","2011Varas",2011,"SJRJ","Varas","Abril",6117,8715,2993,657655]
["2011SJRJJuizadosAbril","2011JuizadosAbril","2011SJRJJuizados","2011Juizados",2011,"SJRJ","Juizados","Abril",7140,8681,3560,159852]
["2011SJRJTurmas RecursaisAbril","2011Turmas RecursaisAbril","2011SJRJTurmas Recursais","2011Turmas Recursais",2011,"SJRJ","Turmas Recursais","Abril",3718,4619,null,45404]
["2011SJRJVarasMaio","2011VarasMaio","2011SJRJVaras","2011Varas",2011,"SJRJ","Varas","Maio",7795,9469,3024,654721]
["2011SJRJJuizadosMaio","2011JuizadosMaio",{"$f":"E627&F627&G627","v":"2011SJRJJuizados"},{"$f":"E627&G627","v":"2011Juizados"},2011,"SJRJ","Juizados","Maio",9289,10188,3935,158878]
["2011SJRJTurmas RecursaisMaio","2011Turmas RecursaisMaio","2011SJRJTurmas Recursais","2011Turmas Recursais",2011,"SJRJ","Turmas Recursais","Maio",4333,6024,null,48604]
["2011SJRJVarasJunho","2011VarasJunho","2011SJRJVaras","2011Varas",2011,"SJRJ","Varas","Junho",12949,9786,2763,657496]
["2011SJRJJuizadosJunho","2011JuizadosJunho","2011SJRJJuizados","2011Juizados",2011,"SJRJ","Juizados","Junho",8804,11254,4232,156550]
["2011SJRJTurmas RecursaisJunho","2011Turmas RecursaisJunho","2011SJRJTurmas Recursais","2011Turmas Recursais",2011,"SJRJ","Turmas Recursais","Junho",4598,5424,null,50412]
["2011SJRJVarasJulho","2011VarasJulho","2011SJRJVaras","2011Varas",2011,"SJRJ","Varas","Julho",9161,10184,3727,656167]
["2011SJRJJuizadosJulho","2011JuizadosJulho","2011SJRJJuizados","2011Juizados",2011,"SJRJ","Juizados","Julho",8383,10146,3865,155184]
["2011SJRJTurmas RecursaisJulho","2011Turmas RecursaisJulho","2011SJRJTurmas Recursais","2011Turmas Recursais",2011,"SJRJ","Turmas Recursais","Julho",4720,4356,null,51514]
["2011SJRJVarasAgosto","2011VarasAgosto","2011SJRJVaras","2011Varas",2011,"SJRJ","Varas","Agosto",8351,10977,3696,650804]
["2011SJRJJuizadosAgosto","2011JuizadosAgosto","2011SJRJJuizados","2011Juizados",2011,"SJRJ","Juizados","Agosto",9984,12277,3700,154911]
["2011SJRJTurmas RecursaisAgosto","2011Turmas RecursaisAgosto","2011SJRJTurmas Recursais","2011Turmas Recursais",2011,"SJRJ","Turmas Recursais","Agosto",4020,5065,null,52414]
["2011SJRJVarasSetembro","2011VarasSetembro","2011SJRJVaras","2011Varas",2011,"SJRJ","Varas","Setembro",10634,9819,3471,648892]
["2011SJRJJuizadosSetembro","2011JuizadosSetembro","2011SJRJJuizados","2011Juizados",2011,"SJRJ","Juizados","Setembro",8029,10626,4164,151400]
["2011SJRJTurmas RecursaisSetembro","2011Turmas RecursaisSetembro","2011SJRJTurmas Recursais","2011Turmas Recursais",2011,"SJRJ","Turmas Recursais","Setembro",3955,5114,null,54271]
["2011SJRJVarasOutubro","2011VarasOutubro","2011SJRJVaras","2011Varas",2011,"SJRJ","Varas","Outubro",7229,11634,2684,646771]
["2011SJRJJuizadosOutubro",{"$f":"E642&G642&H642","v":"2011JuizadosOutubro"},"2011SJRJJuizados","2011Juizados",2011,"SJRJ","Juizados","Outubro",6176,10698,3706,146960]
["2011SJRJTurmas RecursaisOutubro","2011Turmas RecursaisOutubro","2011SJRJTurmas Recursais","2011Turmas Recursais",2011,"SJRJ","Turmas Recursais","Outubro",4042,10704,null,55733]
["2011SJRJVarasNovembro","2011VarasNovembro","2011SJRJVaras","2011Varas",2011,"SJRJ","Varas","Novembro",12257,8624,3009,647018]
["2011SJRJJuizadosNovembro","2011JuizadosNovembro","2011SJRJJuizados","2011Juizados",2011,"SJRJ","Juizados","Novembro",6198,9118,3302,142911]
["2011SJRJTurmas RecursaisNovembro","2011Turmas RecursaisNovembro","2011SJRJTurmas Recursais","2011Turmas Recursais",2011,"SJRJ","Turmas Recursais","Novembro",3143,4487,null,49977]
["2011SJRJVarasDezembro","2011VarasDezembro","2011SJRJVaras","2011Varas",2011,"SJRJ","Varas","Dezembro",17867,5289,1646,642936]
["2011SJRJJuizadosDezembro","2011JuizadosDezembro","2011SJRJJuizados","2011Juizados",2011,"SJRJ","Juizados","Dezembro",6155,5931,2056,141923]
["2011SJRJTurmas RecursaisDezembro","2011Turmas RecursaisDezembro","2011SJRJTurmas Recursais","2011Turmas Recursais",2011,"SJRJ","Turmas Recursais","Dezembro",1864,2652,null,50069]
["2010SJESVarasJaneiro","2010VarasJaneiro","2010SJESVaras","2010Varas",2010,"SJES","Varas","Janeiro",1946,1011,214,110483]
["2010SJESJuizadosJaneiro","2010JuizadosJaneiro","2010SJESJuizados","2010Juizados",2010,"SJES","Juizados","Janeiro",893,903,196,29331]
["2010SJESTurmas RecursaisJaneiro","2010Turmas RecursaisJaneiro","2010SJESTurmas Recursais","2010Turmas Recursais",2010,"SJES","Turmas Recursais","Janeiro",274,2,null,5457]
["2010SJESVarasFevereiro","2010VarasFevereiro","2010SJESVaras","2010Varas",2010,"SJES","Varas","Fevereiro",1463,1159,443,110133]
["2010SJESJuizadosFevereiro","2010JuizadosFevereiro","2010SJESJuizados","2010Juizados",2010,"SJES","Juizados","Fevereiro",822,900,145,29658]
["2010SJESTurmas RecursaisFevereiro","2010Turmas RecursaisFevereiro","2010SJESTurmas Recursais","2010Turmas Recursais",2010,"SJES","Turmas Recursais","Fevereiro",164,84,null,5256]
["2010SJESVarasMarço","2010VarasMarço","2010SJESVaras","2010Varas",2010,"SJES","Varas","Março",1548,1554,514,109678]
["2010SJESJuizadosMarço","2010JuizadosMarço","2010SJESJuizados","2010Juizados",2010,"SJES","Juizados","Março",1664,1102,383,29715]
["2010SJESTurmas RecursaisMarço","2010Turmas RecursaisMarço","2010SJESTurmas Recursais","2010Turmas Recursais",2010,"SJES","Turmas Recursais","Março",372,407,null,4642]
["2010SJESVarasAbril","2010VarasAbril","2010SJESVaras","2010Varas",2010,"SJES","Varas","Abril",1928,1127,370,109496]
["2010SJESJuizadosAbril","2010JuizadosAbril","2010SJESJuizados","2010Juizados",2010,"SJES","Juizados","Abril",1339,943,309,29889]
["2010SJESTurmas RecursaisAbril","2010Turmas RecursaisAbril","2010SJESTurmas Recursais","2010Turmas Recursais",2010,"SJES","Turmas Recursais","Abril",318,327,null,4794]
["2010SJESVarasMaio","2010VarasMaio","2010SJESVaras","2010Varas",2010,"SJES","Varas","Maio",1836,1781,325,109472]
["2010SJESJuizadosMaio","2010JuizadosMaio","2010SJESJuizados","2010Juizados",2010,"SJES","Juizados","Maio",1281,1169,475,30085]
["2010SJESTurmas RecursaisMaio","2010Turmas RecursaisMaio","2010SJESTurmas Recursais","2010Turmas Recursais",2010,"SJES","Turmas Recursais","Maio",417,248,null,4970]
["2010SJESVarasJunho","2010VarasJunho","2010SJESVaras","2010Varas",2010,"SJES","Varas","Junho",1841,1409,462,109280]
["2010SJESJuizadosJunho","2010JuizadosJunho","2010SJESJuizados","2010Juizados",2010,"SJES","Juizados","Junho",828,1043,293,30012]
["2010SJESTurmas RecursaisJunho","2010Turmas RecursaisJunho","2010SJESTurmas Recursais","2010Turmas Recursais",2010,"SJES","Turmas Recursais","Junho",453,290,null,4746]
["2010SJESVarasJulho","2010VarasJulho","2010SJESVaras","2010Varas",2010,"SJES","Varas","Julho",2234,1074,360,109979]
["2010SJESJuizadosJulho","2010JuizadosJulho","2010SJESJuizados","2010Juizados",2010,"SJES","Juizados","Julho",1280,1365,459,29786]
["2010SJESTurmas RecursaisJulho","2010Turmas RecursaisJulho","2010SJESTurmas Recursais","2010Turmas Recursais",2010,"SJES","Turmas Recursais","Julho",593,78,null,4940]
["2010SJESVarasAgosto","2010VarasAgosto","2010SJESVaras","2010Varas",2010,"SJES","Varas","Agosto",2240,1339,304,110609]
["2010SJESJuizadosAgosto","2010JuizadosAgosto","2010SJESJuizados","2010Juizados",2010,"SJES","Juizados","Agosto",1422,1643,435,29658]
["2010SJESTurmas RecursaisAgosto","2010Turmas RecursaisAgosto","2010SJESTurmas Recursais","2010Turmas Recursais",2010,"SJES","Turmas Recursais","Agosto",429,407,null,5174]
["2010SJESVarasSetembro","2010VarasSetembro","2010SJESVaras","2010Varas",2010,"SJES","Varas","Setembro",1751,1137,390,111026]
["2010SJESJuizadosSetembro","2010JuizadosSetembro","2010SJESJuizados","2010Juizados",2010,"SJES","Juizados","Setembro",994,1246,486,29372]
["2010SJESTurmas RecursaisSetembro","2010Turmas RecursaisSetembro","2010SJESTurmas Recursais","2010Turmas Recursais",2010,"SJES","Turmas Recursais","Setembro",531,527,null,5552]
["2010SJESVarasOutubro","2010VarasOutubro","2010SJESVaras","2010Varas",2010,"SJES","Varas","Outubro",1814,1321,392,111504]
["2010SJESJuizadosOutubro","2010JuizadosOutubro","2010SJESJuizados","2010Juizados",2010,"SJES","Juizados","Outubro",985,1173,478,29744]
[{"$f":"E679&F679&G679&H679","v":"2010SJESTurmas RecursaisOutubro"},"2010Turmas RecursaisOutubro","2010SJESTurmas Recursais","2010Turmas Recursais",2010,"SJES","Turmas Recursais","Outubro",511,295,null,5866]
["2010SJESVarasNovembro","2010VarasNovembro","2010SJESVaras","2010Varas",2010,"SJES","Varas","Novembro",1438,1074,410,111385]
["2010SJESJuizadosNovembro","2010JuizadosNovembro","2010SJESJuizados","2010Juizados",2010,"SJES","Juizados","Novembro",1281,1143,238,30075]
["2010SJESTurmas RecursaisNovembro","2010Turmas RecursaisNovembro","2010SJESTurmas Recursais","2010Turmas Recursais",2010,"SJES","Turmas Recursais","Novembro",355,890,null,5904]
["2010SJESVarasDezembro","2010VarasDezembro","2010SJESVaras","2010Varas",2010,"SJES","Varas","Dezembro",1048,669,214,111700]
["2010SJESJuizadosDezembro","2010JuizadosDezembro","2010SJESJuizados","2010Juizados",2010,"SJES","Juizados","Dezembro",804,559,303,29945]
["2010SJESTurmas RecursaisDezembro","2010Turmas RecursaisDezembro","2010SJESTurmas Recursais","2010Turmas Recursais",2010,"SJES","Turmas Recursais","Dezembro",228,631,null,6002]
["2010SJRJVarasJaneiro","2010VarasJaneiro","2010SJRJVaras","2010Varas",2010,"SJRJ","Varas","Janeiro",9683,5470,2000,688635]
["2010SJRJJuizadosJaneiro","2010JuizadosJaneiro","2010SJRJJuizados","2010Juizados",2010,"SJRJ","Juizados","Janeiro",6112,6679,3334,153036]
["2010SJRJTurmas RecursaisJaneiro","2010Turmas RecursaisJaneiro","2010SJRJTurmas Recursais","2010Turmas Recursais",2010,"SJRJ","Turmas Recursais","Janeiro",3347,2730,null,58174]
["2010SJRJVarasFevereiro","2010VarasFevereiro","2010SJRJVaras","2010Varas",2010,"SJRJ","Varas","Fevereiro",6842,6051,1931,688298]
["2010SJRJJuizadosFevereiro","2010JuizadosFevereiro","2010SJRJJuizados","2010Juizados",2010,"SJRJ","Juizados","Fevereiro",6251,7329,2442,153108]
["2010SJRJTurmas RecursaisFevereiro","2010Turmas RecursaisFevereiro",{"$f":"E691&F691&G691","v":"2010SJRJTurmas Recursais"},{"$f":"E691&G691","v":"2010Turmas Recursais"},2010,"SJRJ","Turmas Recursais","Fevereiro",2290,3511,null,57263]
["2010SJRJVarasMarço","2010VarasMarço","2010SJRJVaras","2010Varas",2010,"SJRJ","Varas","Março",10803,9939,2996,688216]
["2010SJRJJuizadosMarço","2010JuizadosMarço","2010SJRJJuizados","2010Juizados",2010,"SJRJ","Juizados","Março",11535,10676,4559,153371]
["2010SJRJTurmas RecursaisMarço","2010Turmas RecursaisMarço","2010SJRJTurmas Recursais","2010Turmas Recursais",2010,"SJRJ","Turmas Recursais","Março",4355,5144,null,58320]
["2010SJRJVarasAbril","2010VarasAbril","2010SJRJVaras","2010Varas",2010,"SJRJ","Varas","Abril",6399,7862,2717,685192]
["2010SJRJJuizadosAbril","2010JuizadosAbril","2010SJRJJuizados","2010Juizados",2010,"SJRJ","Juizados","Abril",10658,7166,2686,158386]
["2010SJRJTurmas RecursaisAbril","2010Turmas RecursaisAbril","2010SJRJTurmas Recursais","2010Turmas Recursais",2010,"SJRJ","Turmas Recursais","Abril",2805,4023,null,54645]
["2010SJRJVarasMaio","2010VarasMaio","2010SJRJVaras","2010Varas",2010,"SJRJ","Varas","Maio",7754,10647,2971,681223]
["2010SJRJJuizadosMaio","2010JuizadosMaio","2010SJRJJuizados","2010Juizados",2010,"SJRJ","Juizados","Maio",11286,11329,3149,164155]
["2010SJRJTurmas RecursaisMaio","2010Turmas RecursaisMaio","2010SJRJTurmas Recursais","2010Turmas Recursais",2010,"SJRJ","Turmas Recursais","Maio",3523,3029,null,48302]
["2010SJRJVarasJunho","2010VarasJunho","2010SJRJVaras","2010Varas",2010,"SJRJ","Varas","Junho",9851,9700,3058,680065]
["2010SJRJJuizadosJunho","2010JuizadosJunho","2010SJRJJuizados","2010Juizados",2010,"SJRJ","Juizados","Junho",9383,8340,2673,164131]
["2010SJRJTurmas RecursaisJunho","2010Turmas RecursaisJunho","2010SJRJTurmas Recursais","2010Turmas Recursais",2010,"SJRJ","Turmas Recursais","Junho",2624,2824,null,46362]
["2010SJRJVarasJulho","2010VarasJulho","2010SJRJVaras","2010Varas",2010,"SJRJ","Varas","Julho",8220,7107,3176,676773]
["2010SJRJJuizadosJulho","2010JuizadosJulho","2010SJRJJuizados","2010Juizados",2010,"SJRJ","Juizados","Julho",10915,7420,3843,164898]
["2010SJRJTurmas RecursaisJulho",{"$f":"E706&G706&H706","v":"2010Turmas RecursaisJulho"},"2010SJRJTurmas Recursais","2010Turmas Recursais",2010,"SJRJ","Turmas Recursais","Julho",4093,4245,null,46289]
["2010SJRJVarasAgosto","2010VarasAgosto","2010SJRJVaras","2010Varas",2010,"SJRJ","Varas","Agosto",7340,10746,3824,672307]
["2010SJRJJuizadosAgosto","2010JuizadosAgosto","2010SJRJJuizados","2010Juizados",2010,"SJRJ","Juizados","Agosto",12391,10846,4007,167841]
["2010SJRJTurmas RecursaisAgosto","2010Turmas RecursaisAgosto","2010SJRJTurmas Recursais","2010Turmas Recursais",2010,"SJRJ","Turmas Recursais","Agosto",4002,4452,null,42530]
["2010SJRJVarasSetembro","2010VarasSetembro","2010SJRJVaras","2010Varas",2010,"SJRJ","Varas","Setembro",6469,9537,3263,666460]
["2010SJRJJuizadosSetembro","2010JuizadosSetembro","2010SJRJJuizados","2010Juizados",2010,"SJRJ","Juizados","Setembro",11400,10546,3524,168903]
["2010SJRJTurmas RecursaisSetembro","2010Turmas RecursaisSetembro","2010SJRJTurmas Recursais","2010Turmas Recursais",2010,"SJRJ","Turmas Recursais","Setembro",3856,3311,null,42028]
["2010SJRJVarasOutubro","2010VarasOutubro","2010SJRJVaras","2010Varas",2010,"SJRJ","Varas","Outubro",7678,8544,3415,662872]
["2010SJRJJuizadosOutubro","2010JuizadosOutubro","2010SJRJJuizados","2010Juizados",2010,"SJRJ","Juizados","Outubro",9173,10193,3031,167691]
["2010SJRJTurmas RecursaisOutubro","2010Turmas RecursaisOutubro","2010SJRJTurmas Recursais","2010Turmas Recursais",2010,"SJRJ","Turmas Recursais","Outubro",2918,4252,null,43201]
["2010SJRJVarasNovembro","2010VarasNovembro","2010SJRJVaras","2010Varas",2010,"SJRJ","Varas","Novembro",7812,10941,3024,660408]
["2010SJRJJuizadosNovembro","2010JuizadosNovembro","2010SJRJJuizados","2010Juizados",2010,"SJRJ","Juizados","Novembro",9334,9064,3548,164428]
["2010SJRJTurmas RecursaisNovembro","2010Turmas RecursaisNovembro","2010SJRJTurmas Recursais","2010Turmas Recursais",2010,"SJRJ","Turmas Recursais","Novembro",2727,4210,null,43914]
["2010SJRJVarasDezembro","2010VarasDezembro","2010SJRJVaras","2010Varas",2010,"SJRJ","Varas","Dezembro",15189,5341,2790,666379]
["2010SJRJJuizadosDezembro","2010JuizadosDezembro","2010SJRJJuizados","2010Juizados",2010,"SJRJ","Juizados","Dezembro",7837,6240,2643,163916]
["2010SJRJTurmas RecursaisDezembro","2010Turmas RecursaisDezembro","2010SJRJTurmas Recursais","2010Turmas Recursais",2010,"SJRJ","Turmas Recursais","Dezembro",2095,2374,null,43631]
["2009SJESVarasJaneiro","2009VarasJaneiro","2009SJESVaras","2009Varas",2009,"SJES","Varas","Janeiro",2215,1139,181,105202]
["2009SJESJuizadosJaneiro","2009JuizadosJaneiro","2009SJESJuizados","2009Juizados",2009,"SJES","Juizados","Janeiro",1625,804,261,28488]
["2009SJESTurmas RecursaisJaneiro","2009Turmas RecursaisJaneiro","2009SJESTurmas Recursais","2009Turmas Recursais",2009,"SJES","Turmas Recursais","Janeiro",445,55,null,3722]
["2009SJESVarasFevereiro","2009VarasFevereiro","2009SJESVaras","2009Varas",2009,"SJES","Varas","Fevereiro",1224,1132,333,105125]
["2009SJESJuizadosFevereiro","2009JuizadosFevereiro","2009SJESJuizados","2009Juizados",2009,"SJES","Juizados","Fevereiro",1459,1157,327,28843]
["2009SJESTurmas RecursaisFevereiro","2009Turmas RecursaisFevereiro","2009SJESTurmas Recursais","2009Turmas Recursais",2009,"SJES","Turmas Recursais","Fevereiro",254,266,null,3819]
["2009SJESVarasMarço","2009VarasMarço","2009SJESVaras","2009Varas",2009,"SJES","Varas","Março",2426,1192,453,105399]
["2009SJESJuizadosMarço","2009JuizadosMarço","2009SJESJuizados","2009Juizados",2009,"SJES","Juizados","Março",1476,896,514,29004]
["2009SJESTurmas RecursaisMarço","2009Turmas RecursaisMarço","2009SJESTurmas Recursais","2009Turmas Recursais",2009,"SJES","Turmas Recursais","Março",300,449,null,3950]
["2009SJESVarasAbril","2009VarasAbril","2009SJESVaras","2009Varas",2009,"SJES","Varas","Abril",1238,1011,297,105385]
["2009SJESJuizadosAbril","2009JuizadosAbril","2009SJESJuizados","2009Juizados",2009,"SJES","Juizados","Abril",982,813,334,29432]
["2009SJESTurmas RecursaisAbril","2009Turmas RecursaisAbril","2009SJESTurmas Recursais","2009Turmas Recursais",2009,"SJES","Turmas Recursais","Abril",488,571,null,4294]
["2009SJESVarasMaio","2009VarasMaio","2009SJESVaras","2009Varas",2009,"SJES","Varas","Maio",1305,1260,485,104698]
["2009SJESJuizadosMaio","2009JuizadosMaio","2009SJESJuizados","2009Juizados",2009,"SJES","Juizados","Maio",1190,1285,336,29109]
["2009SJESTurmas RecursaisMaio","2009Turmas RecursaisMaio","2009SJESTurmas Recursais","2009Turmas Recursais",2009,"SJES","Turmas Recursais","Maio",239,296,null,4343]
["2009SJESVarasJunho","2009VarasJunho","2009SJESVaras","2009Varas",2009,"SJES","Varas","Junho",2438,1139,288,105755]
["2009SJESJuizadosJunho","2009JuizadosJunho","2009SJESJuizados","2009Juizados",2009,"SJES","Juizados","Junho",1352,1150,329,29340]
["2009SJESTurmas RecursaisJunho","2009Turmas RecursaisJunho","2009SJESTurmas Recursais","2009Turmas Recursais",2009,"SJES","Turmas Recursais","Junho",404,363,null,4549]
["2009SJESVarasJulho","2009VarasJulho","2009SJESVaras","2009Varas",2009,"SJES","Varas","Julho",3034,1345,425,107278]
["2009SJESJuizadosJulho","2009JuizadosJulho","2009SJESJuizados","2009Juizados",2009,"SJES","Juizados","Julho",1183,1233,677,28912]
["2009SJESTurmas RecursaisJulho","2009Turmas RecursaisJulho","2009SJESTurmas Recursais","2009Turmas Recursais",2009,"SJES","Turmas Recursais","Julho",396,502,null,4680]
[{"$f":"E743&F743&G743&H743","v":"2009SJESVarasAgosto"},"2009VarasAgosto","2009SJESVaras","2009Varas",2009,"SJES","Varas","Agosto",2080,1473,379,107741]
["2009SJESJuizadosAgosto","2009JuizadosAgosto","2009SJESJuizados","2009Juizados",2009,"SJES","Juizados","Agosto",1044,1168,614,28669]
["2009SJESTurmas RecursaisAgosto","2009Turmas RecursaisAgosto","2009SJESTurmas Recursais","2009Turmas Recursais",2009,"SJES","Turmas Recursais","Agosto",761,688,null,5287]
["2009SJESVarasSetembro","2009VarasSetembro","2009SJESVaras","2009Varas",2009,"SJES","Varas","Setembro",1854,1168,453,107449]
["2009SJESJuizadosSetembro","2009JuizadosSetembro","2009SJESJuizados","2009Juizados",2009,"SJES","Juizados","Setembro",1280,901,403,28320]
["2009SJESTurmas RecursaisSetembro","2009Turmas RecursaisSetembro","2009SJESTurmas Recursais","2009Turmas Recursais",2009,"SJES","Turmas Recursais","Setembro",397,1421,null,5499]
["2009SJESVarasOutubro","2009VarasOutubro","2009SJESVaras","2009Varas",2009,"SJES","Varas","Outubro",2487,1687,177,108760]
["2009SJESJuizadosOutubro","2009JuizadosOutubro","2009SJESJuizados","2009Juizados",2009,"SJES","Juizados","Outubro",1337,649,368,28367]
["2009SJESTurmas RecursaisOutubro","2009Turmas RecursaisOutubro","2009SJESTurmas Recursais","2009Turmas Recursais",2009,"SJES","Turmas Recursais","Outubro",489,806,null,5708]
["2009SJESVarasNovembro","2009VarasNovembro","2009SJESVaras","2009Varas",2009,"SJES","Varas","Novembro",2353,1372,220,109713]
["2009SJESJuizadosNovembro","2009JuizadosNovembro","2009SJESJuizados","2009Juizados",2009,"SJES","Juizados","Novembro",1093,866,330,28479]
["2009SJESTurmas RecursaisNovembro","2009Turmas RecursaisNovembro","2009SJESTurmas Recursais","2009Turmas Recursais",2009,"SJES","Turmas Recursais","Novembro",267,841,null,5653]
["2009SJESVarasDezembro","2009VarasDezembro",{"$f":"E755&F755&G755","v":"2009SJESVaras"},{"$f":"E755&G755","v":"2009Varas"},2009,"SJES","Varas","Dezembro",1564,1072,238,110035]
["2009SJESJuizadosDezembro","2009JuizadosDezembro","2009SJESJuizados","2009Juizados",2009,"SJES","Juizados","Dezembro",918,488,145,29148]
["2009SJESTurmas RecursaisDezembro","2009Turmas RecursaisDezembro","2009SJESTurmas Recursais","2009Turmas Recursais",2009,"SJES","Turmas Recursais","Dezembro",211,277,null,5490]
["2009SJRJVarasJaneiro","2009VarasJaneiro","2009SJRJVaras","2009Varas",2009,"SJRJ","Varas","Janeiro",11448,4599,1785,681696]
["2009SJRJJuizadosJaneiro","2009JuizadosJaneiro","2009SJRJJuizados","2009Juizados",2009,"SJRJ","Juizados","Janeiro",12501,7747,3114,144900]
["2009SJRJTurmas RecursaisJaneiro","2009Turmas RecursaisJaneiro","2009SJRJTurmas Recursais","2009Turmas Recursais",2009,"SJRJ","Turmas Recursais","Janeiro",3296,3625,null,47158]
["2009SJRJVarasFevereiro","2009VarasFevereiro","2009SJRJVaras","2009Varas",2009,"SJRJ","Varas","Fevereiro",10439,5519,1603,686186]
["2009SJRJJuizadosFevereiro","2009JuizadosFevereiro","2009SJRJJuizados","2009Juizados",2009,"SJRJ","Juizados","Fevereiro",9866,8968,3434,142716]
["2009SJRJTurmas RecursaisFevereiro","2009Turmas RecursaisFevereiro","2009SJRJTurmas Recursais","2009Turmas Recursais",2009,"SJRJ","Turmas Recursais","Fevereiro",3385,3315,null,49500]
["2009SJRJVarasMarço","2009VarasMarço","2009SJRJVaras","2009Varas",2009,"SJRJ","Varas","Março",11090,8089,2744,686307]
["2009SJRJJuizadosMarço","2009JuizadosMarço","2009SJRJJuizados","2009Juizados",2009,"SJRJ","Juizados","Março",12490,11453,4474,139814]
["2009SJRJTurmas RecursaisMarço","2009Turmas RecursaisMarço","2009SJRJTurmas Recursais","2009Turmas Recursais",2009,"SJRJ","Turmas Recursais","Março",4606,4848,null,52126]
["2009SJRJVarasAbril","2009VarasAbril","2009SJRJVaras","2009Varas",2009,"SJRJ","Varas","Abril",7624,6579,2105,686031]
["2009SJRJJuizadosAbril","2009JuizadosAbril","2009SJRJJuizados","2009Juizados",2009,"SJRJ","Juizados","Abril",11326,8695,2930,142407]
["2009SJRJTurmas RecursaisAbril","2009Turmas RecursaisAbril","2009SJRJTurmas Recursais","2009Turmas Recursais",2009,"SJRJ","Turmas Recursais","Abril",2951,4454,null,52274]
["2009SJRJVarasMaio",{"$f":"E770&G770&H770","v":"2009VarasMaio"},"2009SJRJVaras","2009Varas",2009,"SJRJ","Varas","Maio",9852,8742,2840,685247]
["2009SJRJJuizadosMaio","2009JuizadosMaio","2009SJRJJuizados","2009Juizados",2009,"SJRJ","Juizados","Maio",13246,10647,3644,144176]
["2009SJRJTurmas RecursaisMaio","2009Turmas RecursaisMaio","2009SJRJTurmas Recursais","2009Turmas Recursais",2009,"SJRJ","Turmas Recursais","Maio",3693,2772,null,53135]
["2009SJRJVarasJunho","2009VarasJunho","2009SJRJVaras","2009Varas",2009,"SJRJ","Varas","Junho",9051,8349,3070,683588]
["2009SJRJJuizadosJunho","2009JuizadosJunho","2009SJRJJuizados","2009Juizados",2009,"SJRJ","Juizados","Junho",12854,10990,3227,146701]
["2009SJRJTurmas RecursaisJunho","2009Turmas RecursaisJunho","2009SJRJTurmas Recursais","2009Turmas Recursais",2009,"SJRJ","Turmas Recursais","Junho",3277,3369,null,54265]
["2009SJRJVarasJulho","2009VarasJulho","2009SJRJVaras","2009Varas",2009,"SJRJ","Varas","Julho",10531,9448,2980,682854]
["2009SJRJJuizadosJulho","2009JuizadosJulho","2009SJRJJuizados","2009Juizados",2009,"SJRJ","Juizados","Julho",14246,11120,4543,148761]
["2009SJRJTurmas RecursaisJulho","2009Turmas RecursaisJulho","2009SJRJTurmas Recursais","2009Turmas Recursais",2009,"SJRJ","Turmas Recursais","Julho",4538,2423,null,55134]
["2009SJRJVarasAgosto","2009VarasAgosto","2009SJRJVaras","2009Varas",2009,"SJRJ","Varas","Agosto",8937,8209,2836,680318]
["2009SJRJJuizadosAgosto","2009JuizadosAgosto","2009SJRJJuizados","2009Juizados",2009,"SJRJ","Juizados","Agosto",12128,11956,4552,149877]
["2009SJRJTurmas RecursaisAgosto","2009Turmas RecursaisAgosto","2009SJRJTurmas Recursais","2009Turmas Recursais",2009,"SJRJ","Turmas Recursais","Agosto",4527,4820,null,57103]
["2009SJRJVarasSetembro","2009VarasSetembro","2009SJRJVaras","2009Varas",2009,"SJRJ","Varas","Setembro",9620,8692,2985,677638]
["2009SJRJJuizadosSetembro","2009JuizadosSetembro","2009SJRJJuizados","2009Juizados",2009,"SJRJ","Juizados","Setembro",12286,12240,4536,150465]
["2009SJRJTurmas RecursaisSetembro","2009Turmas RecursaisSetembro","2009SJRJTurmas Recursais","2009Turmas Recursais",2009,"SJRJ","Turmas Recursais","Setembro",5359,5480,null,58136]
["2009SJRJVarasOutubro","2009VarasOutubro","2009SJRJVaras","2009Varas",2009,"SJRJ","Varas","Outubro",12127,8515,3005,680077]
["2009SJRJJuizadosOutubro","2009JuizadosOutubro","2009SJRJJuizados","2009Juizados",2009,"SJRJ","Juizados","Outubro",9785,10690,5567,148903]
["2009SJRJTurmas RecursaisOutubro","2009Turmas RecursaisOutubro","2009SJRJTurmas Recursais","2009Turmas Recursais",2009,"SJRJ","Turmas Recursais","Outubro",5322,4863,null,59065]
["2009SJRJVarasNovembro","2009VarasNovembro","2009SJRJVaras","2009Varas",2009,"SJRJ","Varas","Novembro",11636,8251,2657,682241]
["2009SJRJJuizadosNovembro","2009JuizadosNovembro","2009SJRJJuizados","2009Juizados",2009,"SJRJ","Juizados","Novembro",9680,7709,3885,149753]
["2009SJRJTurmas RecursaisNovembro","2009Turmas RecursaisNovembro","2009SJRJTurmas Recursais","2009Turmas Recursais",2009,"SJRJ","Turmas Recursais","Novembro",3349,4888,null,58710]
["2009SJRJVarasDezembro","2009VarasDezembro","2009SJRJVaras","2009Varas",2009,"SJRJ","Varas","Dezembro",10951,6024,2063,685069]
["2009SJRJJuizadosDezembro","2009JuizadosDezembro","2009SJRJJuizados","2009Juizados",2009,"SJRJ","Juizados","Dezembro",9001,5521,2133,154408]
["2009SJRJTurmas RecursaisDezembro","2009Turmas RecursaisDezembro","2009SJRJTurmas Recursais","2009Turmas Recursais",2009,"SJRJ","Turmas Recursais","Dezembro",2845,3057,null,58182]
["2008SJESVarasJaneiro","2008VarasJaneiro","2008SJESVaras","2008Varas",2008,"SJES","Varas","Janeiro",2169,1111,421,100898]
["2008SJESJuizadosJaneiro","2008JuizadosJaneiro","2008SJESJuizados","2008Juizados",2008,"SJES","Juizados","Janeiro",1153,1088,181,25611]
["2008SJESTurmas RecursaisJaneiro","2008Turmas RecursaisJaneiro","2008SJESTurmas Recursais","2008Turmas Recursais",2008,"SJES","Turmas Recursais","Janeiro",269,138,null,2286]
["2008SJESVarasFevereiro","2008VarasFevereiro","2008SJESVaras","2008Varas",2008,"SJES","Varas","Fevereiro",1209,1283,389,100356]
["2008SJESJuizadosFevereiro","2008JuizadosFevereiro","2008SJESJuizados","2008Juizados",2008,"SJES","Juizados","Fevereiro",1057,788,225,25376]
["2008SJESTurmas RecursaisFevereiro","2008Turmas RecursaisFevereiro","2008SJESTurmas Recursais","2008Turmas Recursais",2008,"SJES","Turmas Recursais","Fevereiro",256,164,null,2440]
["2008SJESVarasMarço","2008VarasMarço","2008SJESVaras","2008Varas",2008,"SJES","Varas","Março",1230,1134,283,100471]
["2008SJESJuizadosMarço","2008JuizadosMarço","2008SJESJuizados","2008Juizados",2008,"SJES","Juizados","Março",1311,992,158,25845]
["2008SJESTurmas RecursaisMarço","2008Turmas RecursaisMarço","2008SJESTurmas Recursais","2008Turmas Recursais",2008,"SJES","Turmas Recursais","Março",97,234,null,2511]
["2008SJESVarasAbril","2008VarasAbril","2008SJESVaras","2008Varas",2008,"SJES","Varas","Abril",1499,1193,315,100309]
["2008SJESJuizadosAbril","2008JuizadosAbril","2008SJESJuizados","2008Juizados",2008,"SJES","Juizados","Abril",1419,969,315,25936]
["2008SJESTurmas RecursaisAbril","2008Turmas RecursaisAbril","2008SJESTurmas Recursais","2008Turmas Recursais",2008,"SJES","Turmas Recursais","Abril",346,392,null,2721]
["2008SJESVarasMaio","2008VarasMaio","2008SJESVaras","2008Varas",2008,"SJES","Varas","Maio",1562,1129,548,99971]
[{"$f":"E807&F807&G807&H807","v":"2008SJESJuizadosMaio"},"2008JuizadosMaio","2008SJESJuizados","2008Juizados",2008,"SJES","Juizados","Maio",1093,1038,402,26004]
["2008SJESTurmas RecursaisMaio","2008Turmas RecursaisMaio","2008SJESTurmas Recursais","2008Turmas Recursais",2008,"SJES","Turmas Recursais","Maio",242,217,null,2434]
["2008SJESVarasJunho","2008VarasJunho","2008SJESVaras","2008Varas",2008,"SJES","Varas","Junho",3029,1316,426,101588]
["2008SJESJuizadosJunho","2008JuizadosJunho","2008SJESJuizados","2008Juizados",2008,"SJES","Juizados","Junho",1080,1456,284,26482]
["2008SJESTurmas RecursaisJunho","2008Turmas RecursaisJunho","2008SJESTurmas Recursais","2008Turmas Recursais",2008,"SJES","Turmas Recursais","Junho",503,536,null,2595]
["2008SJESVarasJulho","2008VarasJulho","2008SJESVaras","2008Varas",2008,"SJES","Varas","Julho",1735,1197,470,101662]
["2008SJESJuizadosJulho","2008JuizadosJulho","2008SJESJuizados","2008Juizados",2008,"SJES","Juizados","Julho",1230,1209,382,26552]
["2008SJESTurmas RecursaisJulho","2008Turmas RecursaisJulho","2008SJESTurmas Recursais","2008Turmas Recursais",2008,"SJES","Turmas Recursais","Julho",520,302,null,2883]
["2008SJESVarasAgosto","2008VarasAgosto","2008SJESVaras","2008Varas",2008,"SJES","Varas","Agosto",1692,1540,385,101807]
["2008SJESJuizadosAgosto","2008JuizadosAgosto","2008SJESJuizados","2008Juizados",2008,"SJES","Juizados","Agosto",1045,1180,307,26638]
["2008SJESTurmas RecursaisAgosto","2008Turmas RecursaisAgosto","2008SJESTurmas Recursais","2008Turmas Recursais",2008,"SJES","Turmas Recursais","Agosto",273,210,null,2904]
["2008SJESVarasSetembro","2008VarasSetembro","2008SJESVaras","2008Varas",2008,"SJES","Varas","Setembro",2114,1675,380,102431]
["2008SJESJuizadosSetembro","2008JuizadosSetembro",{"$f":"E819&F819&G819","v":"2008SJESJuizados"},{"$f":"E819&G819","v":"2008Juizados"},2008,"SJES","Juizados","Setembro",1285,1334,276,26862]
["2008SJESTurmas RecursaisSetembro","2008Turmas RecursaisSetembro","2008SJESTurmas Recursais","2008Turmas Recursais",2008,"SJES","Turmas Recursais","Setembro",322,335,null,2904]
["2008SJESVarasOutubro","2008VarasOutubro","2008SJESVaras","2008Varas",2008,"SJES","Varas","Outubro",1819,1205,303,102688]
["2008SJESJuizadosOutubro","2008JuizadosOutubro","2008SJESJuizados","2008Juizados",2008,"SJES","Juizados","Outubro",1534,1285,330,26910]
["2008SJESTurmas RecursaisOutubro","2008Turmas RecursaisOutubro","2008SJESTurmas Recursais","2008Turmas Recursais",2008,"SJES","Turmas Recursais","Outubro",390,333,null,3209]
["2008SJESVarasNovembro","2008VarasNovembro","2008SJESVaras","2008Varas",2008,"SJES","Varas","Novembro",1962,1084,331,102912]
["2008SJESJuizadosNovembro","2008JuizadosNovembro","2008SJESJuizados","2008Juizados",2008,"SJES","Juizados","Novembro",1530,1247,290,27327]
["2008SJESTurmas RecursaisNovembro","2008Turmas RecursaisNovembro","2008SJESTurmas Recursais","2008Turmas Recursais",2008,"SJES","Turmas Recursais","Novembro",239,170,null,3269]
["2008SJESVarasDezembro","2008VarasDezembro","2008SJESVaras","2008Varas",2008,"SJES","Varas","Dezembro",1914,716,198,103899]
["2008SJESJuizadosDezembro","2008JuizadosDezembro","2008SJESJuizados","2008Juizados",2008,"SJES","Juizados","Dezembro",2045,1100,362,27972]
["2008SJESTurmas RecursaisDezembro","2008Turmas RecursaisDezembro","2008SJESTurmas Recursais","2008Turmas Recursais",2008,"SJES","Turmas Recursais","Dezembro",168,141,null,3319]
["2008SJRJVarasJaneiro","2008VarasJaneiro","2008SJRJVaras","2008Varas",2008,"SJRJ","Varas","Janeiro",10514,4921,1579,677034]
["2008SJRJJuizadosJaneiro","2008JuizadosJaneiro","2008SJRJJuizados","2008Juizados",2008,"SJRJ","Juizados","Janeiro",9526,11885,3283,167292]
["2008SJRJTurmas RecursaisJaneiro","2008Turmas RecursaisJaneiro","2008SJRJTurmas Recursais","2008Turmas Recursais",2008,"SJRJ","Turmas Recursais","Janeiro",3184,1817,null,16556]
["2008SJRJVarasFevereiro","2008VarasFevereiro","2008SJRJVaras","2008Varas",2008,"SJRJ","Varas","Fevereiro",7560,5324,1219,677391]
["2008SJRJJuizadosFevereiro",{"$f":"E834&G834&H834","v":"2008JuizadosFevereiro"},"2008SJRJJuizados","2008Juizados",2008,"SJRJ","Juizados","Fevereiro",8054,9034,3148,162552]
["2008SJRJTurmas RecursaisFevereiro","2008Turmas RecursaisFevereiro","2008SJRJTurmas Recursais","2008Turmas Recursais",2008,"SJRJ","Turmas Recursais","Fevereiro",3322,1976,null,19049]
["2008SJRJVarasMarço","2008VarasMarço","2008SJRJVaras","2008Varas",2008,"SJRJ","Varas","Março",8807,5485,1544,679102]
["2008SJRJJuizadosMarço","2008JuizadosMarço","2008SJRJJuizados","2008Juizados",2008,"SJRJ","Juizados","Março",8730,9552,2622,162840]
["2008SJRJTurmas RecursaisMarço","2008Turmas RecursaisMarço","2008SJRJTurmas Recursais","2008Turmas Recursais",2008,"SJRJ","Turmas Recursais","Março",2119,2613,null,18666]
["2008SJRJVarasAbril","2008VarasAbril","2008SJRJVaras","2008Varas",2008,"SJRJ","Varas","Abril",8263,5956,1399,679741]
["2008SJRJJuizadosAbril","2008JuizadosAbril","2008SJRJJuizados","2008Juizados",2008,"SJRJ","Juizados","Abril",10034,11087,2546,159880]
["2008SJRJTurmas RecursaisAbril","2008Turmas RecursaisAbril","2008SJRJTurmas Recursais","2008Turmas Recursais",2008,"SJRJ","Turmas Recursais","Abril",2493,3710,null,18893]
["2008SJRJVarasMaio","2008VarasMaio","2008SJRJVaras","2008Varas",2008,"SJRJ","Varas","Maio",8460,6209,2297,678637]
["2008SJRJJuizadosMaio","2008JuizadosMaio","2008SJRJJuizados","2008Juizados",2008,"SJRJ","Juizados","Maio",10530,12551,3598,156376]
["2008SJRJTurmas RecursaisMaio","2008Turmas RecursaisMaio","2008SJRJTurmas Recursais","2008Turmas Recursais",2008,"SJRJ","Turmas Recursais","Maio",3743,2956,null,20826]
["2008SJRJVarasJunho","2008VarasJunho","2008SJRJVaras","2008Varas",2008,"SJRJ","Varas","Junho",8231,6085,2122,678241]
["2008SJRJJuizadosJunho","2008JuizadosJunho","2008SJRJJuizados","2008Juizados",2008,"SJRJ","Juizados","Junho",11756,14013,5700,152036]
["2008SJRJTurmas RecursaisJunho","2008Turmas RecursaisJunho","2008SJRJTurmas Recursais","2008Turmas Recursais",2008,"SJRJ","Turmas Recursais","Junho",5940,4340,null,25575]
["2008SJRJVarasJulho","2008VarasJulho","2008SJRJVaras","2008Varas",2008,"SJRJ","Varas","Julho",10386,7573,2870,678434]
["2008SJRJJuizadosJulho","2008JuizadosJulho","2008SJRJJuizados","2008Juizados",2008,"SJRJ","Juizados","Julho",11425,12525,6898,144994]
["2008SJRJTurmas RecursaisJulho","2008Turmas RecursaisJulho","2008SJRJTurmas Recursais","2008Turmas Recursais",2008,"SJRJ","Turmas Recursais","Julho",7635,3872,null,31136]
["2008SJRJVarasAgosto","2008VarasAgosto","2008SJRJVaras","2008Varas",2008,"SJRJ","Varas","Agosto",8462,6070,2321,677130]
["2008SJRJJuizadosAgosto","2008JuizadosAgosto","2008SJRJJuizados","2008Juizados",2008,"SJRJ","Juizados","Agosto",11607,10619,6613,141003]
["2008SJRJTurmas RecursaisAgosto","2008Turmas RecursaisAgosto","2008SJRJTurmas Recursais","2008Turmas Recursais",2008,"SJRJ","Turmas Recursais","Agosto",6752,7533,null,36103]
["2008SJRJVarasSetembro","2008VarasSetembro","2008SJRJVaras","2008Varas",2008,"SJRJ","Varas","Setembro",9619,6681,2404,676325]
["2008SJRJJuizadosSetembro","2008JuizadosSetembro","2008SJRJJuizados","2008Juizados",2008,"SJRJ","Juizados","Setembro",12265,13553,4775,137048]
["2008SJRJTurmas RecursaisSetembro","2008Turmas RecursaisSetembro","2008SJRJTurmas Recursais","2008Turmas Recursais",2008,"SJRJ","Turmas Recursais","Setembro",5022,7011,null,38976]
["2008SJRJVarasOutubro","2008VarasOutubro","2008SJRJVaras","2008Varas",2008,"SJRJ","Varas","Outubro",8554,7431,2448,675292]
["2008SJRJJuizadosOutubro","2008JuizadosOutubro","2008SJRJJuizados","2008Juizados",2008,"SJRJ","Juizados","Outubro",12524,10952,5471,133967]
["2008SJRJTurmas RecursaisOutubro","2008Turmas RecursaisOutubro","2008SJRJTurmas Recursais","2008Turmas Recursais",2008,"SJRJ","Turmas Recursais","Outubro",5510,9707,null,42660]
["2008SJRJVarasNovembro","2008VarasNovembro","2008SJRJVaras","2008Varas",2008,"SJRJ","Varas","Novembro",7491,6270,2348,674286]
["2008SJRJJuizadosNovembro","2008JuizadosNovembro","2008SJRJJuizados","2008Juizados",2008,"SJRJ","Juizados","Novembro",12653,9752,3531,134426]
["2008SJRJTurmas RecursaisNovembro","2008Turmas RecursaisNovembro","2008SJRJTurmas Recursais","2008Turmas Recursais",2008,"SJRJ","Turmas Recursais","Novembro",3658,4805,null,44363]
["2008SJRJVarasDezembro","2008VarasDezembro","2008SJRJVaras","2008Varas",2008,"SJRJ","Varas","Dezembro",11214,4577,1659,677417]
["2008SJRJJuizadosDezembro","2008JuizadosDezembro","2008SJRJJuizados","2008Juizados",2008,"SJRJ","Juizados","Dezembro",18592,8389,2672,143213]
["2008SJRJTurmas RecursaisDezembro","2008Turmas RecursaisDezembro","2008SJRJTurmas Recursais","2008Turmas Recursais",2008,"SJRJ","Turmas Recursais","Dezembro",2645,3749,null,45288]
["2007SJESVarasJaneiro","2007VarasJaneiro","2007SJESVaras","2007Varas",2007,"SJES","Varas","Janeiro",1364,1097,286,101013]
["2007SJESJuizadosJaneiro","2007JuizadosJaneiro","2007SJESJuizados","2007Juizados",2007,"SJES","Juizados","Janeiro",847,757,203,16511]
["2007SJESTurmas RecursaisJaneiro","2007Turmas RecursaisJaneiro","2007SJESTurmas Recursais","2007Turmas Recursais",2007,"SJES","Turmas Recursais","Janeiro",67,435,0,3409]
["2007SJESVarasFevereiro","2007VarasFevereiro","2007SJESVaras","2007Varas",2007,"SJES","Varas","Fevereiro",984,980,339,100037]
["2007SJESJuizadosFevereiro","2007JuizadosFevereiro","2007SJESJuizados","2007Juizados",2007,"SJES","Juizados","Fevereiro",806,524,354,15920]
[{"$f":"E871&F871&G871&H871","v":"2007SJESTurmas RecursaisFevereiro"},"2007Turmas RecursaisFevereiro","2007SJESTurmas Recursais","2007Turmas Recursais",2007,"SJES","Turmas Recursais","Fevereiro",331,172,0,3472]
["2007SJESVarasMarço","2007VarasMarço","2007SJESVaras","2007Varas",2007,"SJES","Varas","Março",1586,1254,421,99297]
["2007SJESJuizadosMarço","2007JuizadosMarço","2007SJESJuizados","2007Juizados",2007,"SJES","Juizados","Março",1162,733,397,15924]
["2007SJESTurmas RecursaisMarço","2007Turmas RecursaisMarço","2007SJESTurmas Recursais","2007Turmas Recursais",2007,"SJES","Turmas Recursais","Março",542,340,0,3742]
["2007SJESVarasAbril","2007VarasAbril","2007SJESVaras","2007Varas",2007,"SJES","Varas","Abril",2312,1059,314,99862]
["2007SJESJuizadosAbril","2007JuizadosAbril","2007SJESJuizados","2007Juizados",2007,"SJES","Juizados","Abril",1236,592,215,16377]
["2007SJESTurmas RecursaisAbril","2007Turmas RecursaisAbril","2007SJESTurmas Recursais","2007Turmas Recursais",2007,"SJES","Turmas Recursais","Abril",221,340,0,3690]
["2007SJESVarasMaio","2007VarasMaio","2007SJESVaras","2007Varas",2007,"SJES","Varas","Maio",2247,1383,368,99931]
["2007SJESJuizadosMaio","2007JuizadosMaio","2007SJESJuizados","2007Juizados",2007,"SJES","Juizados","Maio",2146,1172,239,17666]
["2007SJESTurmas RecursaisMaio","2007Turmas RecursaisMaio","2007SJESTurmas Recursais","2007Turmas Recursais",2007,"SJES","Turmas Recursais","Maio",240,565,0,3527]
["2007SJESVarasJunho","2007VarasJunho","2007SJESVaras","2007Varas",2007,"SJES","Varas","Junho",2061,1147,393,100525]
["2007SJESJuizadosJunho","2007JuizadosJunho","2007SJESJuizados","2007Juizados",2007,"SJES","Juizados","Junho",4383,802,186,20825]
["2007SJESTurmas RecursaisJunho","2007Turmas RecursaisJunho",{"$f":"E883&F883&G883","v":"2007SJESTurmas Recursais"},{"$f":"E883&G883","v":"2007Turmas Recursais"},2007,"SJES","Turmas Recursais","Junho",210,1023,0,3645]
["2007SJESVarasJulho","2007VarasJulho","2007SJESVaras","2007Varas",2007,"SJES","Varas","Julho",2584,1229,393,100971]
["2007SJESJuizadosJulho","2007JuizadosJulho","2007SJESJuizados","2007Juizados",2007,"SJES","Juizados","Julho",2836,770,226,22723]
["2007SJESTurmas RecursaisJulho","2007Turmas RecursaisJulho","2007SJESTurmas Recursais","2007Turmas Recursais",2007,"SJES","Turmas Recursais","Julho",298,207,0,3244]
["2007SJESVarasAgosto","2007VarasAgosto","2007SJESVaras","2007Varas",2007,"SJES","Varas","Agosto",1920,1685,483,100843]
["2007SJESJuizadosAgosto","2007JuizadosAgosto","2007SJESJuizados","2007Juizados",2007,"SJES","Juizados","Agosto",2277,927,244,23747]
["2007SJESTurmas RecursaisAgosto","2007Turmas RecursaisAgosto","2007SJESTurmas Recursais","2007Turmas Recursais",2007,"SJES","Turmas Recursais","Agosto",290,550,0,2784]
["2007SJESVarasSetembro","2007VarasSetembro","2007SJESVaras","2007Varas",2007,"SJES","Varas","Setembro",1437,1115,363,100343]
["2007SJESJuizadosSetembro","2007JuizadosSetembro","2007SJESJuizados","2007Juizados",2007,"SJES","Juizados","Setembro",1509,685,139,24168]
["2007SJESTurmas RecursaisSetembro","2007Turmas RecursaisSetembro","2007SJESTurmas Recursais","2007Turmas Recursais",2007,"SJES","Turmas Recursais","Setembro",146,580,0,2679]
["2007SJESVarasOutubro","2007VarasOutubro","2007SJESVaras","2007Varas",2007,"SJES","Varas","Outubro",1725,1424,630,99935]
["2007SJESJuizadosOutubro","2007JuizadosOutubro","2007SJESJuizados","2007Juizados",2007,"SJES","Juizados","Outubro",1690,945,254,24582]
["2007SJESTurmas RecursaisOutubro","2007Turmas RecursaisOutubro","2007SJESTurmas Recursais","2007Turmas Recursais",2007,"SJES","Turmas Recursais","Outubro",286,457,0,2521]
["2007SJESVarasNovembro","2007VarasNovembro","2007SJESVaras","2007Varas",2007,"SJES","Varas","Novembro",1305,1163,424,99727]
["2007SJESJuizadosNovembro","2007JuizadosNovembro","2007SJESJuizados","2007Juizados",2007,"SJES","Juizados","Novembro",1064,643,152,25066]
["2007SJESTurmas RecursaisNovembro",{"$f":"E898&G898&H898","v":"2007Turmas RecursaisNovembro"},"2007SJESTurmas Recursais","2007Turmas Recursais",2007,"SJES","Turmas Recursais","Novembro",120,336,0,2373]
["2007SJESVarasDezembro","2007VarasDezembro","2007SJESVaras","2007Varas",2007,"SJES","Varas","Dezembro",1331,675,303,100047]
["2007SJESJuizadosDezembro","2007JuizadosDezembro","2007SJESJuizados","2007Juizados",2007,"SJES","Juizados","Dezembro",1036,787,144,25345]
["2007SJESTurmas RecursaisDezembro","2007Turmas RecursaisDezembro","2007SJESTurmas Recursais","2007Turmas Recursais",2007,"SJES","Turmas Recursais","Dezembro",143,159,0,2261]
["2007SJRJVarasJaneiro","2007VarasJaneiro","2007SJRJVaras","2007Varas",2007,"SJRJ","Varas","Janeiro",6872,4533,1806,642091]
["2007SJRJJuizadosJaneiro","2007JuizadosJaneiro","2007SJRJJuizados","2007Juizados",2007,"SJRJ","Juizados","Janeiro",9590,8092,2357,142168]
["2007SJRJTurmas RecursaisJaneiro","2007Turmas RecursaisJaneiro","2007SJRJTurmas Recursais","2007Turmas Recursais",2007,"SJRJ","Turmas Recursais","Janeiro",2600,3740,0,21121]
["2007SJRJVarasFevereiro","2007VarasFevereiro","2007SJRJVaras","2007Varas",2007,"SJRJ","Varas","Fevereiro",5893,5440,1839,640605]
["2007SJRJJuizadosFevereiro","2007JuizadosFevereiro","2007SJRJJuizados","2007Juizados",2007,"SJRJ","Juizados","Fevereiro",9087,10713,2126,139000]
["2007SJRJTurmas RecursaisFevereiro","2007Turmas RecursaisFevereiro","2007SJRJTurmas Recursais","2007Turmas Recursais",2007,"SJRJ","Turmas Recursais","Fevereiro",2162,4312,0,21470]
["2007SJRJVarasMarço","2007VarasMarço","2007SJRJVaras","2007Varas",2007,"SJRJ","Varas","Março",12057,7367,2222,642568]
["2007SJRJJuizadosMarço","2007JuizadosMarço","2007SJRJJuizados","2007Juizados",2007,"SJRJ","Juizados","Março",10426,14433,3225,132559]
["2007SJRJTurmas RecursaisMarço","2007Turmas RecursaisMarço","2007SJRJTurmas Recursais","2007Turmas Recursais",2007,"SJRJ","Turmas Recursais","Março",3332,4241,0,21838]
["2007SJRJVarasAbril","2007VarasAbril","2007SJRJVaras","2007Varas",2007,"SJRJ","Varas","Abril",8373,5822,1770,642997]
["2007SJRJJuizadosAbril","2007JuizadosAbril","2007SJRJJuizados","2007Juizados",2007,"SJRJ","Juizados","Abril",8938,8532,2449,128295]
["2007SJRJTurmas RecursaisAbril","2007Turmas RecursaisAbril","2007SJRJTurmas Recursais","2007Turmas Recursais",2007,"SJRJ","Turmas Recursais","Abril",2259,4371,0,20651]
["2007SJRJVarasMaio","2007VarasMaio","2007SJRJVaras","2007Varas",2007,"SJRJ","Varas","Maio",12728,7054,2441,644920]
["2007SJRJJuizadosMaio","2007JuizadosMaio","2007SJRJJuizados","2007Juizados",2007,"SJRJ","Juizados","Maio",13073,12134,2910,128732]
["2007SJRJTurmas RecursaisMaio","2007Turmas RecursaisMaio","2007SJRJTurmas Recursais","2007Turmas Recursais",2007,"SJRJ","Turmas Recursais","Maio",2992,4546,0,19410]
["2007SJRJVarasJunho","2007VarasJunho","2007SJRJVaras","2007Varas",2007,"SJRJ","Varas","Junho",14388,6661,1990,650270]
["2007SJRJJuizadosJunho","2007JuizadosJunho","2007SJRJJuizados","2007Juizados",2007,"SJRJ","Juizados","Junho",34281,9172,2289,152738]
["2007SJRJTurmas RecursaisJunho","2007Turmas RecursaisJunho","2007SJRJTurmas Recursais","2007Turmas Recursais",2007,"SJRJ","Turmas Recursais","Junho",2536,3608,0,18901]
["2007SJRJVarasJulho","2007VarasJulho","2007SJRJVaras","2007Varas",2007,"SJRJ","Varas","Julho",14253,6907,2174,654556]
["2007SJRJJuizadosJulho","2007JuizadosJulho","2007SJRJJuizados","2007Juizados",2007,"SJRJ","Juizados","Julho",30703,12379,1895,169240]
["2007SJRJTurmas RecursaisJulho","2007Turmas RecursaisJulho","2007SJRJTurmas Recursais","2007Turmas Recursais",2007,"SJRJ","Turmas Recursais","Julho",1902,2083,0,17556]
["2007SJRJVarasAgosto","2007VarasAgosto","2007SJRJVaras","2007Varas",2007,"SJRJ","Varas","Agosto",10312,6939,2496,655776]
["2007SJRJJuizadosAgosto","2007JuizadosAgosto","2007SJRJJuizados","2007Juizados",2007,"SJRJ","Juizados","Agosto",30220,15974,1773,182969]
["2007SJRJTurmas RecursaisAgosto","2007Turmas RecursaisAgosto","2007SJRJTurmas Recursais","2007Turmas Recursais",2007,"SJRJ","Turmas Recursais","Agosto",1964,4142,0,16536]
["2007SJRJVarasSetembro","2007VarasSetembro","2007SJRJVaras","2007Varas",2007,"SJRJ","Varas","Setembro",9235,6156,1951,656325]
["2007SJRJJuizadosSetembro","2007JuizadosSetembro","2007SJRJJuizados","2007Juizados",2007,"SJRJ","Juizados","Setembro",19151,16254,2295,182980]
["2007SJRJTurmas RecursaisSetembro","2007Turmas RecursaisSetembro","2007SJRJTurmas Recursais","2007Turmas Recursais",2007,"SJRJ","Turmas Recursais","Setembro",2449,2277,0,15732]
["2007SJRJVarasOutubro","2007VarasOutubro","2007SJRJVaras","2007Varas",2007,"SJRJ","Varas","Outubro",19289,6541,2612,665069]
["2007SJRJJuizadosOutubro","2007JuizadosOutubro","2007SJRJJuizados","2007Juizados",2007,"SJRJ","Juizados","Outubro",15662,19232,2447,177735]
["2007SJRJTurmas RecursaisOutubro","2007Turmas RecursaisOutubro","2007SJRJTurmas Recursais","2007Turmas Recursais",2007,"SJRJ","Turmas Recursais","Outubro",2667,3162,0,14775]
["2007SJRJVarasNovembro","2007VarasNovembro","2007SJRJVaras","2007Varas",2007,"SJRJ","Varas","Novembro",9533,5585,2013,666627]
["2007SJRJJuizadosNovembro","2007JuizadosNovembro","2007SJRJJuizados","2007Juizados",2007,"SJRJ","Juizados","Novembro",9153,13036,2082,173743]
["2007SJRJTurmas RecursaisNovembro","2007Turmas RecursaisNovembro","2007SJRJTurmas Recursais","2007Turmas Recursais",2007,"SJRJ","Turmas Recursais","Novembro",2378,2133,0,14729]
[{"$f":"E935&F935&G935&H935","v":"2007SJRJVarasDezembro"},"2007VarasDezembro","2007SJRJVaras","2007Varas",2007,"SJRJ","Varas","Dezembro",11996,3812,1273,672198]
["2007SJRJJuizadosDezembro","2007JuizadosDezembro","2007SJRJJuizados","2007Juizados",2007,"SJRJ","Juizados","Dezembro",9285,10115,2141,171510]
["2007SJRJTurmas RecursaisDezembro","2007Turmas RecursaisDezembro","2007SJRJTurmas Recursais","2007Turmas Recursais",2007,"SJRJ","Turmas Recursais","Dezembro",2340,1232,0,15098]
["2006SJESVarasJaneiro","2006VarasJaneiro","2006SJESVaras","2006Varas",2006,"SJES","Varas","Janeiro",1621,725,124,105994]
["2006SJESJuizadosJaneiro","2006JuizadosJaneiro","2006SJESJuizados","2006Juizados",2006,"SJES","Juizados","Janeiro",718,2309,269,19223]
["2006SJESTurmas RecursaisJaneiro","2006Turmas RecursaisJaneiro","2006SJESTurmas Recursais","2006Turmas Recursais",2006,"SJES","Turmas Recursais","Janeiro",704,9,0,2746]
["2006SJESVarasFevereiro","2006VarasFevereiro","2006SJESVaras","2006Varas",2006,"SJES","Varas","Fevereiro",1673,1135,248,106356]
["2006SJESJuizadosFevereiro","2006JuizadosFevereiro","2006SJESJuizados","2006Juizados",2006,"SJES","Juizados","Fevereiro",692,1522,403,18504]
["2006SJESTurmas RecursaisFevereiro","2006Turmas RecursaisFevereiro","2006SJESTurmas Recursais","2006Turmas Recursais",2006,"SJES","Turmas Recursais","Fevereiro",233,459,0,2777]
["2006SJESVarasMarço","2006VarasMarço","2006SJESVaras","2006Varas",2006,"SJES","Varas","Março",1577,1259,650,105597]
["2006SJESJuizadosMarço","2006JuizadosMarço","2006SJESJuizados","2006Juizados",2006,"SJES","Juizados","Março",1025,1064,267,17474]
["2006SJESTurmas RecursaisMarço","2006Turmas RecursaisMarço","2006SJESTurmas Recursais","2006Turmas Recursais",2006,"SJES","Turmas Recursais","Março",176,477,0,2890]
["2006SJESVarasAbril","2006VarasAbril",{"$f":"E947&F947&G947","v":"2006SJESVaras"},{"$f":"E947&G947","v":"2006Varas"},2006,"SJES","Varas","Abril",888,1208,207,105186]
["2006SJESJuizadosAbril","2006JuizadosAbril","2006SJESJuizados","2006Juizados",2006,"SJES","Juizados","Abril",806,1058,238,17096]
["2006SJESTurmas RecursaisAbril","2006Turmas RecursaisAbril","2006SJESTurmas Recursais","2006Turmas Recursais",2006,"SJES","Turmas Recursais","Abril",352,285,0,3160]
["2006SJESVarasMaio","2006VarasMaio","2006SJESVaras","2006Varas",2006,"SJES","Varas","Maio",1321,1945,415,104469]
["2006SJESJuizadosMaio","2006JuizadosMaio","2006SJESJuizados","2006Juizados",2006,"SJES","Juizados","Maio",1194,970,271,17061]
["2006SJESTurmas RecursaisMaio","2006Turmas RecursaisMaio","2006SJESTurmas Recursais","2006Turmas Recursais",2006,"SJES","Turmas Recursais","Maio",337,360,0,3212]
["2006SJESVarasJunho","2006VarasJunho","2006SJESVaras","2006Varas",2006,"SJES","Varas","Junho",1565,1358,225,103710]
["2006SJESJuizadosJunho","2006JuizadosJunho","2006SJESJuizados","2006Juizados",2006,"SJES","Juizados","Junho",1258,1341,215,17215]
["2006SJESTurmas RecursaisJunho","2006Turmas RecursaisJunho","2006SJESTurmas Recursais","2006Turmas Recursais",2006,"SJES","Turmas Recursais","Junho",215,188,0,3283]
["2006SJESVarasJulho","2006VarasJulho","2006SJESVaras","2006Varas",2006,"SJES","Varas","Julho",1807,1494,326,103908]
["2006SJESJuizadosJulho","2006JuizadosJulho","2006SJESJuizados","2006Juizados",2006,"SJES","Juizados","Julho",1355,920,317,17217]
["2006SJESTurmas RecursaisJulho","2006Turmas RecursaisJulho","2006SJESTurmas Recursais","2006Turmas Recursais",2006,"SJES","Turmas Recursais","Julho",249,249,0,3389]
["2006SJESVarasAgosto","2006VarasAgosto","2006SJESVaras","2006Varas",2006,"SJES","Varas","Agosto",1463,1453,424,102587]
["2006SJESJuizadosAgosto","2006JuizadosAgosto","2006SJESJuizados","2006Juizados",2006,"SJES","Juizados","Agosto",1415,1167,293,17574]
["2006SJESTurmas RecursaisAgosto","2006Turmas RecursaisAgosto","2006SJESTurmas Recursais","2006Turmas Recursais",2006,"SJES","Turmas Recursais","Agosto",326,789,0,3361]
["2006SJESVarasSetembro",{"$f":"E962&G962&H962","v":"2006VarasSetembro"},"2006SJESVaras","2006Varas",2006,"SJES","Varas","Setembro",1328,1126,443,101998]
["2006SJESJuizadosSetembro","2006JuizadosSetembro","2006SJESJuizados","2006Juizados",2006,"SJES","Juizados","Setembro",1079,1068,358,17175]
["2006SJESTurmas RecursaisSetembro","2006Turmas RecursaisSetembro","2006SJESTurmas Recursais","2006Turmas Recursais",2006,"SJES","Turmas Recursais","Setembro",285,282,0,3295]
["2006SJESVarasOutubro","2006VarasOutubro","2006SJESVaras","2006Varas",2006,"SJES","Varas","Outubro",1211,1414,712,101305]
["2006SJESJuizadosOutubro","2006JuizadosOutubro","2006SJESJuizados","2006Juizados",2006,"SJES","Juizados","Outubro",1023,1201,344,16681]
["2006SJESTurmas RecursaisOutubro","2006Turmas RecursaisOutubro","2006SJESTurmas Recursais","2006Turmas Recursais",2006,"SJES","Turmas Recursais","Outubro",323,405,0,3370]
["2006SJESVarasNovembro","2006VarasNovembro","2006SJESVaras","2006Varas",2006,"SJES","Varas","Novembro",1211,1222,364,100958]
["2006SJESJuizadosNovembro","2006JuizadosNovembro","2006SJESJuizados","2006Juizados",2006,"SJES","Juizados","Novembro",963,771,353,16393]
["2006SJESTurmas RecursaisNovembro","2006Turmas RecursaisNovembro","2006SJESTurmas Recursais","2006Turmas Recursais",2006,"SJES","Turmas Recursais","Novembro",390,585,0,3539]
["2006SJESVarasDezembro","2006VarasDezembro","2006SJESVaras","2006Varas",2006,"SJES","Varas","Dezembro",1431,679,288,101158]
["2006SJESJuizadosDezembro","2006JuizadosDezembro","2006SJESJuizados","2006Juizados",2006,"SJES","Juizados","Dezembro",781,800,181,16435]
["2006SJESTurmas RecursaisDezembro","2006Turmas RecursaisDezembro","2006SJESTurmas Recursais","2006Turmas Recursais",2006,"SJES","Turmas Recursais","Dezembro",242,230,0,3493]
["2006SJRJVarasJaneiro","2006VarasJaneiro","2006SJRJVaras","2006Varas",2006,"SJRJ","Varas","Janeiro",5973,3876,968,612825]
["2006SJRJJuizadosJaneiro","2006JuizadosJaneiro","2006SJRJJuizados","2006Juizados",2006,"SJRJ","Juizados","Janeiro",31624,35000,1896,201587]
["2006SJRJTurmas RecursaisJaneiro","2006Turmas RecursaisJaneiro","2006SJRJTurmas Recursais","2006Turmas Recursais",2006,"SJRJ","Turmas Recursais","Janeiro",2001,971,0,14817]
["2006SJRJVarasFevereiro","2006VarasFevereiro","2006SJRJVaras","2006Varas",2006,"SJRJ","Varas","Fevereiro",8382,5192,1679,613446]
["2006SJRJJuizadosFevereiro","2006JuizadosFevereiro","2006SJRJJuizados","2006Juizados",2006,"SJRJ","Juizados","Fevereiro",35380,26927,2177,200649]
["2006SJRJTurmas RecursaisFevereiro","2006Turmas RecursaisFevereiro","2006SJRJTurmas Recursais","2006Turmas Recursais",2006,"SJRJ","Turmas Recursais","Fevereiro",1734,1820,0,15218]
["2006SJRJVarasMarço","2006VarasMarço","2006SJRJVaras","2006Varas",2006,"SJRJ","Varas","Março",19861,6374,2151,624819]
["2006SJRJJuizadosMarço","2006JuizadosMarço","2006SJRJJuizados","2006Juizados",2006,"SJRJ","Juizados","Março",17214,18972,2641,192977]
["2006SJRJTurmas RecursaisMarço","2006Turmas RecursaisMarço","2006SJRJTurmas Recursais","2006Turmas Recursais",2006,"SJRJ","Turmas Recursais","Março",2994,1836,0,14959]
["2006SJRJVarasAbril","2006VarasAbril","2006SJRJVaras","2006Varas",2006,"SJRJ","Varas","Abril",14122,4622,1503,613525]
["2006SJRJJuizadosAbril","2006JuizadosAbril","2006SJRJJuizados","2006Juizados",2006,"SJRJ","Juizados","Abril",12297,13732,2466,188856]
["2006SJRJTurmas RecursaisAbril","2006Turmas RecursaisAbril","2006SJRJTurmas Recursais","2006Turmas Recursais",2006,"SJRJ","Turmas Recursais","Abril",2133,1586,0,15282]
["2006SJRJVarasMaio","2006VarasMaio","2006SJRJVaras","2006Varas",2006,"SJRJ","Varas","Maio",15131,6836,1726,637767]
["2006SJRJJuizadosMaio","2006JuizadosMaio","2006SJRJJuizados","2006Juizados",2006,"SJRJ","Juizados","Maio",13731,19031,3350,182423]
["2006SJRJTurmas RecursaisMaio","2006Turmas RecursaisMaio","2006SJRJTurmas Recursais","2006Turmas Recursais",2006,"SJRJ","Turmas Recursais","Maio",3508,2205,0,16353]
["2006SJRJVarasJunho","2006VarasJunho","2006SJRJVaras","2006Varas",2006,"SJRJ","Varas","Junho",11389,5624,1609,642194]
["2006SJRJJuizadosJunho","2006JuizadosJunho","2006SJRJJuizados","2006Juizados",2006,"SJRJ","Juizados","Junho",11736,14080,2504,178191]
["2006SJRJTurmas RecursaisJunho","2006Turmas RecursaisJunho","2006SJRJTurmas Recursais","2006Turmas Recursais",2006,"SJRJ","Turmas Recursais","Junho",2758,1680,0,17303]
["2006SJRJVarasJulho","2006VarasJulho","2006SJRJVaras","2006Varas",2006,"SJRJ","Varas","Julho",9270,6368,1741,644140]
["2006SJRJJuizadosJulho","2006JuizadosJulho","2006SJRJJuizados","2006Juizados",2006,"SJRJ","Juizados","Julho",11236,14777,2659,172751]
["2006SJRJTurmas RecursaisJulho","2006Turmas RecursaisJulho","2006SJRJTurmas Recursais","2006Turmas Recursais",2006,"SJRJ","Turmas Recursais","Julho",2528,2204,0,17171]
["2006SJRJVarasAgosto","2006VarasAgosto","2006SJRJVaras","2006Varas",2006,"SJRJ","Varas","Agosto",10454,7687,2471,643603]
["2006SJRJJuizadosAgosto","2006JuizadosAgosto","2006SJRJJuizados","2006Juizados",2006,"SJRJ","Juizados","Agosto",11188,15716,3506,163206]
["2006SJRJTurmas RecursaisAgosto","2006Turmas RecursaisAgosto","2006SJRJTurmas Recursais","2006Turmas Recursais",2006,"SJRJ","Turmas Recursais","Agosto",3096,3005,0,17851]
["2006SJRJVarasSetembro","2006VarasSetembro","2006SJRJVaras","2006Varas",2006,"SJRJ","Varas","Setembro",9017,6016,2287,643989]
[{"$f":"E999&F999&G999&H999","v":"2006SJRJJuizadosSetembro"},"2006JuizadosSetembro","2006SJRJJuizados","2006Juizados",2006,"SJRJ","Juizados","Setembro",11307,12647,3184,157252]
["2006SJRJTurmas RecursaisSetembro","2006Turmas RecursaisSetembro","2006SJRJTurmas Recursais","2006Turmas Recursais",2006,"SJRJ","Turmas Recursais","Setembro",3163,2995,0,18765]
["2006SJRJVarasOutubro","2006VarasOutubro","2006SJRJVaras","2006Varas",2006,"SJRJ","Varas","Outubro",8030,7901,2446,641538]
["2006SJRJJuizadosOutubro","2006JuizadosOutubro","2006SJRJJuizados","2006Juizados",2006,"SJRJ","Juizados","Outubro",10952,13230,3755,149414]
["2006SJRJTurmas RecursaisOutubro","2006Turmas RecursaisOutubro","2006SJRJTurmas Recursais","2006Turmas Recursais",2006,"SJRJ","Turmas Recursais","Outubro",3918,3157,0,19469]
["2006SJRJVarasNovembro","2006VarasNovembro","2006SJRJVaras","2006Varas",2006,"SJRJ","Varas","Novembro",6670,5981,2286,639676]
["2006SJRJJuizadosNovembro","2006JuizadosNovembro","2006SJRJJuizados","2006Juizados",2006,"SJRJ","Juizados","Novembro",10337,10682,2784,143680]
["2006SJRJTurmas RecursaisNovembro","2006Turmas RecursaisNovembro","2006SJRJTurmas Recursais","2006Turmas Recursais",2006,"SJRJ","Turmas Recursais","Novembro",2850,3791,0,20112]
["2006SJRJVarasDezembro","2006VarasDezembro","2006SJRJVaras","2006Varas",2006,"SJRJ","Varas","Dezembro",9414,4089,1634,642234]
["2006SJRJJuizadosDezembro","2006JuizadosDezembro","2006SJRJJuizados","2006Juizados",2006,"SJRJ","Juizados","Dezembro",10584,6828,1922,143456]
["2006SJRJTurmas RecursaisDezembro","2006Turmas RecursaisDezembro","2006SJRJTurmas Recursais","2006Turmas Recursais",2006,"SJRJ","Turmas Recursais","Dezembro",1899,1926,0,20495]
["2005SJESVarasJaneiro","2005VarasJaneiro","2005SJESVaras","2005Varas",2005,"SJES","Varas","Janeiro",1654,482,33,98950]
["2005SJESJuizadosJaneiro","2005JuizadosJaneiro",{"$f":"E1011&F1011&G1011","v":"2005SJESJuizados"},{"$f":"E1011&G1011","v":"2005Juizados"},2005,"SJES","Juizados","Janeiro",2014,1616,14,32671]
["2005SJESTurmas RecursaisJaneiro","2005Turmas RecursaisJaneiro","2005SJESTurmas Recursais","2005Turmas Recursais",2005,"SJES","Turmas Recursais","Janeiro",7,0,0,861]
["2005SJESVarasFevereiro","2005VarasFevereiro","2005SJESVaras","2005Varas",2005,"SJES","Varas","Fevereiro",1273,508,149,99441]
["2005SJESJuizadosFevereiro","2005JuizadosFevereiro","2005SJESJuizados","2005Juizados",2005,"SJES","Juizados","Fevereiro",2487,2065,167,33485]
["2005SJESTurmas RecursaisFevereiro","2005Turmas RecursaisFevereiro","2005SJESTurmas Recursais","2005Turmas Recursais",2005,"SJES","Turmas Recursais","Fevereiro",145,0,0,983]
["2005SJESVarasMarço","2005VarasMarço","2005SJESVaras","2005Varas",2005,"SJES","Varas","Março",2051,703,238,100451]
["2005SJESJuizadosMarço","2005JuizadosMarço","2005SJESJuizados","2005Juizados",2005,"SJES","Juizados","Março",3345,2463,161,34929]
["2005SJESTurmas RecursaisMarço","2005Turmas RecursaisMarço","2005SJESTurmas Recursais","2005Turmas Recursais",2005,"SJES","Turmas Recursais","Março",109,0,0,1065]
["2005SJESVarasAbril","2005VarasAbril","2005SJESVaras","2005Varas",2005,"SJES","Varas","Abril",1832,630,31,101380]
["2005SJESJuizadosAbril","2005JuizadosAbril","2005SJESJuizados","2005Juizados",2005,"SJES","Juizados","Abril",2876,845,186,35835]
["2005SJESTurmas RecursaisAbril","2005Turmas RecursaisAbril","2005SJESTurmas Recursais","2005Turmas Recursais",2005,"SJES","Turmas Recursais","Abril",235,0,0,1235]
["2005SJESVarasMaio","2005VarasMaio","2005SJESVaras","2005Varas",2005,"SJES","Varas","Maio",3225,1138,183,102867]
["2005SJESJuizadosMaio","2005JuizadosMaio","2005SJESJuizados","2005Juizados",2005,"SJES","Juizados","Maio",1177,3696,139,34277]
["2005SJESTurmas RecursaisMaio","2005Turmas RecursaisMaio","2005SJESTurmas Recursais","2005Turmas Recursais",2005,"SJES","Turmas Recursais","Maio",143,0,0,1342]
["2005SJESVarasJunho","2005VarasJunho","2005SJESVaras","2005Varas",2005,"SJES","Varas","Junho",2704,989,434,102986]
["2005SJESJuizadosJunho",{"$f":"E1026&G1026&H1026","v":"2005JuizadosJunho"},"2005SJESJuizados","2005Juizados",2005,"SJES","Juizados","Junho",1891,5766,143,32118]
["2005SJESTurmas RecursaisJunho","2005Turmas RecursaisJunho","2005SJESTurmas Recursais","2005Turmas Recursais",2005,"SJES","Turmas Recursais","Junho",2,0,0,1312]
["2005SJESVarasJulho","2005VarasJulho","2005SJESVaras","2005Varas",2005,"SJES","Varas","Julho",1974,823,167,103512]
["2005SJESJuizadosJulho","2005JuizadosJulho","2005SJESJuizados","2005Juizados",2005,"SJES","Juizados","Julho",1628,1863,245,29516]
["2005SJESTurmas RecursaisJulho","2005Turmas RecursaisJulho","2005SJESTurmas Recursais","2005Turmas Recursais",2005,"SJES","Turmas Recursais","Julho",255,0,0,1216]
["2005SJESVarasAgosto","2005VarasAgosto","2005SJESVaras","2005Varas",2005,"SJES","Varas","Agosto",2519,1123,286,104160]
["2005SJESJuizadosAgosto","2005JuizadosAgosto","2005SJESJuizados","2005Juizados",2005,"SJES","Juizados","Agosto",1377,1544,337,27018]
["2005SJESTurmas RecursaisAgosto","2005Turmas RecursaisAgosto","2005SJESTurmas Recursais","2005Turmas Recursais",2005,"SJES","Turmas Recursais","Agosto",299,0,0,1466]
["2005SJESVarasSetembro","2005VarasSetembro","2005SJESVaras","2005Varas",2005,"SJES","Varas","Setembro",1795,888,385,104278]
["2005SJESJuizadosSetembro","2005JuizadosSetembro","2005SJESJuizados","2005Juizados",2005,"SJES","Juizados","Setembro",1340,1606,228,24252]
["2005SJESTurmas RecursaisSetembro","2005Turmas RecursaisSetembro","2005SJESTurmas Recursais","2005Turmas Recursais",2005,"SJES","Turmas Recursais","Setembro",289,0,0,1771]
["2005SJESVarasOutubro","2005VarasOutubro","2005SJESVaras","2005Varas",2005,"SJES","Varas","Outubro",1928,1032,162,104814]
["2005SJESJuizadosOutubro","2005JuizadosOutubro","2005SJESJuizados","2005Juizados",2005,"SJES","Juizados","Outubro",1161,1939,320,22689]
["2005SJESTurmas RecursaisOutubro","2005Turmas RecursaisOutubro","2005SJESTurmas Recursais","2005Turmas Recursais",2005,"SJES","Turmas Recursais","Outubro",246,0,0,1921]
["2005SJESVarasNovembro","2005VarasNovembro","2005SJESVaras","2005Varas",2005,"SJES","Varas","Novembro",1766,1146,309,104980]
["2005SJESJuizadosNovembro","2005JuizadosNovembro","2005SJESJuizados","2005Juizados",2005,"SJES","Juizados","Novembro",1356,2580,517,21260]
["2005SJESTurmas RecursaisNovembro","2005Turmas RecursaisNovembro","2005SJESTurmas Recursais","2005Turmas Recursais",2005,"SJES","Turmas Recursais","Novembro",411,242,0,2236]
["2005SJESVarasDezembro","2005VarasDezembro","2005SJESVaras","2005Varas",2005,"SJES","Varas","Dezembro",1326,704,245,105198]
["2005SJESJuizadosDezembro","2005JuizadosDezembro","2005SJESJuizados","2005Juizados",2005,"SJES","Juizados","Dezembro",724,1057,225,20317]
["2005SJESTurmas RecursaisDezembro","2005Turmas RecursaisDezembro","2005SJESTurmas Recursais","2005Turmas Recursais",2005,"SJES","Turmas Recursais","Dezembro",307,206,0,2113]
["2005SJRJVarasJaneiro","2005VarasJaneiro","2005SJRJVaras","2005Varas",2005,"SJRJ","Varas","Janeiro",7765,3420,998,594827]
["2005SJRJJuizadosJaneiro","2005JuizadosJaneiro","2005SJRJJuizados","2005Juizados",2005,"SJRJ","Juizados","Janeiro",8816,7416,1617,210117]
["2005SJRJTurmas RecursaisJaneiro","2005Turmas RecursaisJaneiro","2005SJRJTurmas Recursais","2005Turmas Recursais",2005,"SJRJ","Turmas Recursais","Janeiro",1244,0,0,23804]
["2005SJRJVarasFevereiro","2005VarasFevereiro","2005SJRJVaras","2005Varas",2005,"SJRJ","Varas","Fevereiro",6391,4261,1283,596074]
["2005SJRJJuizadosFevereiro","2005JuizadosFevereiro","2005SJRJJuizados","2005Juizados",2005,"SJRJ","Juizados","Fevereiro",6819,10068,1946,207040]
["2005SJRJTurmas RecursaisFevereiro","2005Turmas RecursaisFevereiro","2005SJRJTurmas Recursais","2005Turmas Recursais",2005,"SJRJ","Turmas Recursais","Fevereiro",2024,0,0,24935]
["2005SJRJVarasMarço","2005VarasMarço","2005SJRJVaras","2005Varas",2005,"SJRJ","Varas","Março",5894,5753,1697,594354]
["2005SJRJJuizadosMarço","2005JuizadosMarço","2005SJRJJuizados","2005Juizados",2005,"SJRJ","Juizados","Março",8414,10899,2228,197893]
["2005SJRJTurmas RecursaisMarço","2005Turmas RecursaisMarço","2005SJRJTurmas Recursais","2005Turmas Recursais",2005,"SJRJ","Turmas Recursais","Março",1911,0,0,25322]
["2005SJRJVarasAbril","2005VarasAbril","2005SJRJVaras","2005Varas",2005,"SJRJ","Varas","Abril",8595,5309,1945,596075]
["2005SJRJJuizadosAbril","2005JuizadosAbril","2005SJRJJuizados","2005Juizados",2005,"SJRJ","Juizados","Abril",7854,9682,2207,185260]
["2005SJRJTurmas RecursaisAbril","2005Turmas RecursaisAbril","2005SJRJTurmas Recursais","2005Turmas Recursais",2005,"SJRJ","Turmas Recursais","Abril",2641,0,0,25435]
["2005SJRJVarasMaio","2005VarasMaio","2005SJRJVaras","2005Varas",2005,"SJRJ","Varas","Maio",8675,5676,1935,597856]
["2005SJRJJuizadosMaio","2005JuizadosMaio","2005SJRJJuizados","2005Juizados",2005,"SJRJ","Juizados","Maio",9007,11293,2165,174839]
["2005SJRJTurmas RecursaisMaio","2005Turmas RecursaisMaio","2005SJRJTurmas Recursais","2005Turmas Recursais",2005,"SJRJ","Turmas Recursais","Maio",1892,0,0,22893]
["2005SJRJVarasJunho","2005VarasJunho","2005SJRJVaras","2005Varas",2005,"SJRJ","Varas","Junho",9672,5477,2072,599417]
["2005SJRJJuizadosJunho","2005JuizadosJunho","2005SJRJJuizados","2005Juizados",2005,"SJRJ","Juizados","Junho",16251,12497,2182,170343]
[{"$f":"E1063&F1063&G1063&H1063","v":"2005SJRJTurmas RecursaisJunho"},"2005Turmas RecursaisJunho","2005SJRJTurmas Recursais","2005Turmas Recursais",2005,"SJRJ","Turmas Recursais","Junho",2313,0,0,21518]
["2005SJRJVarasJulho","2005VarasJulho","2005SJRJVaras","2005Varas",2005,"SJRJ","Varas","Julho",6421,5460,1728,599099]
["2005SJRJJuizadosJulho","2005JuizadosJulho","2005SJRJJuizados","2005Juizados",2005,"SJRJ","Juizados","Julho",11147,12459,2169,166245]
["2005SJRJTurmas RecursaisJulho","2005Turmas RecursaisJulho","2005SJRJTurmas Recursais","2005Turmas Recursais",2005,"SJRJ","Turmas Recursais","Julho",2232,0,0,19314]
["2005SJRJVarasAgosto","2005VarasAgosto","2005SJRJVaras","2005Varas",2005,"SJRJ","Varas","Agosto",9448,6253,2184,599710]
["2005SJRJJuizadosAgosto","2005JuizadosAgosto","2005SJRJJuizados","2005Juizados",2005,"SJRJ","Juizados","Agosto",19863,13059,2450,166902]
["2005SJRJTurmas RecursaisAgosto","2005Turmas RecursaisAgosto","2005SJRJTurmas Recursais","2005Turmas Recursais",2005,"SJRJ","Turmas Recursais","Agosto",2350,0,0,19134]
["2005SJRJVarasSetembro","2005VarasSetembro","2005SJRJVaras","2005Varas",2005,"SJRJ","Varas","Setembro",8546,5968,1958,599725]
["2005SJRJJuizadosSetembro","2005JuizadosSetembro","2005SJRJJuizados","2005Juizados",2005,"SJRJ","Juizados","Setembro",21948,14379,2425,172411]
["2005SJRJTurmas RecursaisSetembro","2005Turmas RecursaisSetembro","2005SJRJTurmas Recursais","2005Turmas Recursais",2005,"SJRJ","Turmas Recursais","Setembro",2490,501,0,18031]
["2005SJRJVarasOutubro","2005VarasOutubro","2005SJRJVaras","2005Varas",2005,"SJRJ","Varas","Outubro",8302,5148,1813,600240]
["2005SJRJJuizadosOutubro","2005JuizadosOutubro","2005SJRJJuizados","2005Juizados",2005,"SJRJ","Juizados","Outubro",16356,17037,2335,170726]
["2005SJRJTurmas RecursaisOutubro","2005Turmas RecursaisOutubro",{"$f":"E1075&F1075&G1075","v":"2005SJRJTurmas Recursais"},{"$f":"E1075&G1075","v":"2005Turmas Recursais"},2005,"SJRJ","Turmas Recursais","Outubro",2099,907,0,17715]
["2005SJRJVarasNovembro","2005VarasNovembro","2005SJRJVaras","2005Varas",2005,"SJRJ","Varas","Novembro",13404,5302,1688,606369]
["2005SJRJJuizadosNovembro","2005JuizadosNovembro","2005SJRJJuizados","2005Juizados",2005,"SJRJ","Juizados","Novembro",15193,12666,2959,169168]
["2005SJRJTurmas RecursaisNovembro","2005Turmas RecursaisNovembro","2005SJRJTurmas Recursais","2005Turmas Recursais",2005,"SJRJ","Turmas Recursais","Novembro",2730,1918,0,16986]
["2005SJRJVarasDezembro","2005VarasDezembro","2005SJRJVaras","2005Varas",2005,"SJRJ","Varas","Dezembro",10426,3285,1044,611472]
["2005SJRJJuizadosDezembro","2005JuizadosDezembro","2005SJRJJuizados","2005Juizados",2005,"SJRJ","Juizados","Dezembro",37750,7755,1802,195008]
["2005SJRJTurmas RecursaisDezembro","2005Turmas RecursaisDezembro","2005SJRJTurmas Recursais","2005Turmas Recursais",2005,"SJRJ","Turmas Recursais","Dezembro",1948,373,0,16499]
[]
[]
[]
[]
[]
[]
[]
[]
[null,null,null,null,null,null,null,null,3952602,3605642,954862,139237709]
[]
[null,null,null,null,null,null,null,null,{"$f":"SUM(I218:I1081)","v":3952602},{"$f":"SUM(J218:J1081)","v":3605642},954862,{"$f":"SUM(L218:L1081)","v":139237709}]
[]
[null,null,null,null,null,null,null,null,{"$f":"IF(I1090=I1092,\"Ok\",\"DIF\")","v":"Ok"},{"$f":"IF(J1090=J1092,\"Ok\",\"DIF\")","v":"Ok"},"Ok","Ok"]

{"sheet":"DadosTD","index":21,"n_rows":1153,"n_cols":9,"rows_kept":1153,"cut":false,"hidden":true,"merged":[]}
["Ano","Seção Judiciária","Base","Tipo de Juízo","Mês","Dist","Julg","Remetidos TRF/TR","Tram R"]
[2019,"SJES","Apolo","Varas","Janeiro",188,631,144,93508]
[2019,"SJES","Apolo","Juizados","Janeiro",0,630,104,10002]
[2019,"SJES","Apolo","Turmas Recursais","Janeiro",103,822,0,13487]
[2019,"SJES","Apolo","Varas","Fevereiro",189,840,231,90396]
[2019,"SJES","Apolo","Juizados","Fevereiro",1,459,210,9128]
[2019,"SJES","Apolo","Turmas Recursais","Fevereiro",206,1593,0,12990]
[2019,"SJES","Apolo","Varas","Março",435,749,169,88137]
[2019,"SJES","Apolo","Juizados","Março",2,382,221,8434]
[2019,"SJES","Apolo","Turmas Recursais","Março",208,836,0,12592]
[2019,"SJES","Apolo","Varas","Abril",112,814,243,84572]
[2019,"SJES","Apolo","Juizados","Abril",3,388,186,7103]
[2019,"SJES","Apolo","Turmas Recursais","Abril",102,1349,0,11906]
[2019,"SJES","Apolo","Varas","Maio",524,981,201,82488]
[2019,"SJES","Apolo","Juizados","Maio",2,479,111,5742]
[2019,"SJES","Apolo","Turmas Recursais","Maio",112,1447,0,11045]
[2019,"SJES","Apolo","Varas","Junho",156,853,92,79541]
[2019,"SJES","Apolo","Juizados","Junho",1,179,57,5364]
[2019,"SJES","Apolo","Turmas Recursais","Junho",60,1123,0,10129]
[2019,"SJES","Apolo","Varas","Julho",118,764,141,77441]
[2019,"SJES","Apolo","Juizados","Julho",1,165,66,5522]
[2019,"SJES","Apolo","Turmas Recursais","Julho",54,1070,0,9091]
[2019,"SJES","Apolo","Varas","Agosto",57,665,88,63102]
[2019,"SJES","Apolo","Juizados","Agosto",0,93,24,4882]
[2019,"SJES","Apolo","Turmas Recursais","Agosto",26,1680,0,8570]
[2019,"SJES","Apolo","Varas","Setembro",65,518,123,32269]
[2019,"SJES","Apolo","Juizados","Setembro",0,62,701,4531]
[2019,"SJES","Apolo","Turmas Recursais","Setembro",17,1046,0,7804]
[2019,"SJES","Apolo","Varas","Outubro",41,287,96,21334]
[2019,"SJES","Apolo","Juizados","Outubro",1,85,16,4263]
[2019,"SJES","Apolo","Turmas Recursais","Outubro",15,698,0,7093]
[2019,"SJES","Apolo","Varas","Novembro",28,240,54,14539]
[2019,"SJES","Apolo","Juizados","Novembro",1,47,11,4299]
[2019,"SJES","Apolo","Turmas Recursais","Novembro",6,280,0,6558]
[2019,"SJES","Apolo","Varas","Dezembro",47,155,51,13705]
[2019,"SJES","Apolo","Juizados","Dezembro",1,47,9,4559]
[2019,"SJES","Apolo","Turmas Recursais","Dezembro",12,425,0,5943]
[2019,"SJES","Eproc","Varas","Janeiro",1347,285,354,33235]
[2019,"SJES","Eproc","Juizados","Janeiro",1623,1252,88,21795]
[2019,"SJES","Eproc","Turmas Recursais","Janeiro",286,190,0,1458]
[2019,"SJES","Eproc","Varas","Fevereiro",1506,634,529,36336]
[2019,"SJES","Eproc","Juizados","Fevereiro",2115,1773,231,22358]
[2019,"SJES","Eproc","Turmas Recursais","Fevereiro",536,155,0,1931]
[2019,"SJES","Eproc","Varas","Março",1383,627,451,38713]
[2019,"SJES","Eproc","Juizados","Março",1988,1861,151,23019]
[2019,"SJES","Eproc","Turmas Recursais","Março",432,99,0,2251]
[2019,"SJES","Eproc","Varas","Abril",1420,843,675,41798]
[2019,"SJES","Eproc","Juizados","Abril",2197,1811,239,24607]
[2019,"SJES","Eproc","Turmas Recursais","Abril",641,308,0,2812]
[2019,"SJES","Eproc","Varas","Maio",1751,1124,754,43714]
[2019,"SJES","Eproc","Juizados","Maio",2520,2348,323,26621]
[2019,"SJES","Eproc","Turmas Recursais","Maio",823,273,0,3488]
[2019,"SJES","Eproc","Varas","Junho",2173,981,624,47106]
[2019,"SJES","Eproc","Juizados","Junho",1856,2029,437,26877]
[2019,"SJES","Eproc","Turmas Recursais","Junho",874,492,0,4096]
[2019,"SJES","Eproc","Varas","Julho",2311,1345,862,49279]
[2019,"SJES","Eproc","Juizados","Julho",2635,2267,572,27705]
[2019,"SJES","Eproc","Turmas Recursais","Julho",1076,670,0,4699]
[2019,"SJES","Eproc","Varas","Agosto",1929,1817,755,63204]
[2019,"SJES","Eproc","Juizados","Agosto",2512,2462,424,28600]
[2019,"SJES","Eproc","Turmas Recursais","Agosto",887,886,0,5176]
[2019,"SJES","Eproc","Varas","Setembro",1765,1688,761,93354]
[2019,"SJES","Eproc","Juizados","Setembro",2479,2611,457,28941]
[2019,"SJES","Eproc","Turmas Recursais","Setembro",870,900,0,5523]
[2019,"SJES","Eproc","Varas","Outubro",2068,1701,774,105883]
[2019,"SJES","Eproc","Juizados","Outubro",3350,2488,526,30209]
[2019,"SJES","Eproc","Turmas Recursais","Outubro",899,943,0,5647]
[2019,"SJES","Eproc","Varas","Novembro",2713,1535,833,111359]
[2019,"SJES","Eproc","Juizados","Novembro",6375,2471,496,34975]
[2019,"SJES","Eproc","Turmas Recursais","Novembro",935,945,0,5829]
[2019,"SJES","Eproc","Varas","Dezembro",2359,1343,563,112998]
[2019,"SJES","Eproc","Juizados","Dezembro",2366,1484,341,36203]
[2019,"SJES","Eproc","Turmas Recursais","Dezembro",596,608,0,5414]
[2019,"SJRJ","Apolo","Varas","Janeiro",827,4735,1009,513561]
[2019,"SJRJ","Apolo","Juizados","Janeiro",6,2186,592,33022]
[2019,"SJRJ","Apolo","Turmas Recursais","Janeiro",1034,1316,0,50625]
[2019,"SJRJ","Apolo","Varas","Fevereiro",816,5988,1030,481199]
[2019,"SJRJ","Apolo","Juizados","Fevereiro",3,1415,632,24520]
[2019,"SJRJ","Apolo","Turmas Recursais","Fevereiro",265,2355,0,48799]
[2019,"SJRJ","Apolo","Varas","Março",616,4023,797,460944]
[2019,"SJRJ","Apolo","Juizados","Março",1,867,331,21189]
[2019,"SJRJ","Apolo","Turmas Recursais","Março",492,2338,0,47420]
[2019,"SJRJ","Apolo","Varas","Abril",641,4226,771,436204]
[2019,"SJRJ","Apolo","Juizados","Abril",2,597,267,18944]
[2019,"SJRJ","Apolo","Turmas Recursais","Abril",473,2011,0,46210]
[2019,"SJRJ","Apolo","Varas","Maio",821,5621,1045,401153]
[2019,"SJRJ","Apolo","Juizados","Maio",3,776,273,16638]
[2019,"SJRJ","Apolo","Turmas Recursais","Maio",277,13070,0,45393]
[2019,"SJRJ","Apolo","Varas","Junho",551,3266,680,268732]
[2019,"SJRJ","Apolo","Juizados","Junho",5,538,162,18370]
[2019,"SJRJ","Apolo","Turmas Recursais","Junho",164,2398,0,39786]
[2019,"SJRJ","Apolo","Varas","Julho",760,3973,659,258410]
[2019,"SJRJ","Apolo","Juizados","Julho",2,983,174,20586]
[2019,"SJRJ","Apolo","Turmas Recursais","Julho",142,1747,0,33433]
[2019,"SJRJ","Apolo","Varas","Agosto",640,4279,542,154374]
[2019,"SJRJ","Apolo","Juizados","Agosto",9,913,151,19869]
[2019,"SJRJ","Apolo","Turmas Recursais","Agosto",124,1300,0,29722]
[2019,"SJRJ","Apolo","Varas","Setembro",673,2512,397,132698]
[2019,"SJRJ","Apolo","Juizados","Setembro",4,1043,142,21248]
[2019,"SJRJ","Apolo","Turmas Recursais","Setembro",91,916,0,26449]
[2019,"SJRJ","Apolo","Varas","Outubro",567,2358,442,118947]
[2019,"SJRJ","Apolo","Juizados","Outubro",5,1369,144,18345]
[2019,"SJRJ","Apolo","Turmas Recursais","Outubro",132,806,0,25098]
[2019,"SJRJ","Apolo","Varas","Novembro",562,1323,243,109315]
[2019,"SJRJ","Apolo","Juizados","Novembro",2,480,85,16675]
[2019,"SJRJ","Apolo","Turmas Recursais","Novembro",100,721,0,24537]
[2019,"SJRJ","Apolo","Varas","Dezembro",485,1067,191,100231]
[2019,"SJRJ","Apolo","Juizados","Dezembro",3,319,153,15130]
[2019,"SJRJ","Apolo","Turmas Recursais","Dezembro",63,533,0,24048]
[2019,"SJRJ","Eproc","Varas","Janeiro",4840,1134,1446,75081]
[2019,"SJRJ","Eproc","Juizados","Janeiro",6950,6294,369,84475]
[2019,"SJRJ","Eproc","Turmas Recursais","Janeiro",1536,664,0,6924]
[2019,"SJRJ","Eproc","Varas","Fevereiro",6355,2828,3027,106459]
[2019,"SJRJ","Eproc","Juizados","Fevereiro",9717,9600,765,89246]
[2019,"SJRJ","Eproc","Turmas Recursais","Fevereiro",3118,860,0,9296]
[2019,"SJRJ","Eproc","Varas","Março",11446,2814,2545,132396]
[2019,"SJRJ","Eproc","Juizados","Março",8355,8220,568,91926]
[2019,"SJRJ","Eproc","Turmas Recursais","Março",2419,1860,0,10848]
[2019,"SJRJ","Eproc","Varas","Abril",6743,3283,2746,156924]
[2019,"SJRJ","Eproc","Juizados","Abril",9609,8286,573,94920]
[2019,"SJRJ","Eproc","Turmas Recursais","Abril",2404,1308,0,12228]
[2019,"SJRJ","Eproc","Varas","Maio",7485,4718,3540,240346]
[2019,"SJRJ","Eproc","Juizados","Maio",11209,11093,734,98227]
[2019,"SJRJ","Eproc","Turmas Recursais","Maio",2815,2246,0,14078]
[2019,"SJRJ","Eproc","Varas","Junho",5970,4656,3278,320014]
[2019,"SJRJ","Eproc","Juizados","Junho",9276,9850,754,100045]
[2019,"SJRJ","Eproc","Turmas Recursais","Junho",2683,1834,0,14875]
[2019,"SJRJ","Eproc","Varas","Julho",8257,6676,4527,327480]
[2019,"SJRJ","Eproc","Juizados","Julho",11862,11845,1042,102569]
[2019,"SJRJ","Eproc","Turmas Recursais","Julho",3571,1943,0,16257]
[2019,"SJRJ","Eproc","Varas","Agosto",7965,8359,4559,428772]
[2019,"SJRJ","Eproc","Juizados","Agosto",11077,12639,1044,103180]
[2019,"SJRJ","Eproc","Turmas Recursais","Agosto",3460,2603,0,18107]
[2019,"SJRJ","Eproc","Varas","Setembro",7127,8264,4561,447088]
[2019,"SJRJ","Eproc","Juizados","Setembro",10457,10656,1034,104121]
[2019,"SJRJ","Eproc","Turmas Recursais","Setembro",3445,3625,0,19884]
[2019,"SJRJ","Eproc","Varas","Outubro",8176,7642,4497,457423]
[2019,"SJRJ","Eproc","Juizados","Outubro",13300,11175,1019,107979]
[2019,"SJRJ","Eproc","Turmas Recursais","Outubro",3260,3515,0,19449]
[2019,"SJRJ","Eproc","Varas","Novembro",11226,6652,3494,469916]
[2019,"SJRJ","Eproc","Juizados","Novembro",24928,10091,776,125479]
[2019,"SJRJ","Eproc","Turmas Recursais","Novembro",2503,2594,0,19654]
[2019,"SJRJ","Eproc","Varas","Dezembro",10708,5657,2740,483805]
[2019,"SJRJ","Eproc","Juizados","Dezembro",9355,8027,567,128057]
[2019,"SJRJ","Eproc","Turmas Recursais","Dezembro",2057,2816,0,19969]
[2018,"SJES","Apolo","Varas","Janeiro",2530,1271,292,126813]
[2018,"SJES","Apolo","Juizados","Janeiro",1669,1401,431,43396]
[2018,"SJES","Apolo","Turmas Recursais","Janeiro",445,266,0,18156]
[2018,"SJES","Apolo","Varas","Fevereiro",1475,1759,285,126791]
[2018,"SJES","Apolo","Juizados","Fevereiro",1370,1999,632,42617]
[2018,"SJES","Apolo","Turmas Recursais","Fevereiro",508,1466,0,17748]
[2018,"SJES","Apolo","Varas","Março",1586,2209,337,126287]
[2018,"SJES","Apolo","Juizados","Março",983,2033,559,41321]
[2018,"SJES","Apolo","Turmas Recursais","Março",552,1596,0,17689]
[2018,"SJES","Apolo","Varas","Abril",2178,1377,327,126689]
[2018,"SJES","Apolo","Juizados","Abril",660,1280,623,40287]
[2018,"SJES","Apolo","Turmas Recursais","Abril",722,1127,0,17544]
[2018,"SJES","Apolo","Varas","Maio",1632,2116,355,126457]
[2018,"SJES","Apolo","Juizados","Maio",8,2509,573,38694]
[2018,"SJES","Apolo","Turmas Recursais","Maio",581,1454,0,17083]
[2018,"SJES","Apolo","Varas","Junho",993,2216,396,125574]
[2018,"SJES","Apolo","Juizados","Junho",3,8237,860,35376]
[2018,"SJES","Apolo","Turmas Recursais","Junho",581,1324,0,16623]
[2018,"SJES","Apolo","Varas","Julho",262,1578,477,123714]
[2018,"SJES","Apolo","Juizados","Julho",4,3934,1587,31179]
[2018,"SJES","Apolo","Turmas Recursais","Julho",1820,1878,0,17362]
[2018,"SJES","Apolo","Varas","Agosto",334,2049,571,121440]
[2018,"SJES","Apolo","Juizados","Agosto",6,6605,1031,25106]
[2018,"SJES","Apolo","Turmas Recursais","Agosto",874,2228,0,17043]
[2018,"SJES","Apolo","Varas","Setembro",248,1969,336,119772]
[2018,"SJES","Apolo","Juizados","Setembro",3,1117,911,19042]
[2018,"SJES","Apolo","Turmas Recursais","Setembro",1049,2568,0,16645]
[2018,"SJES","Apolo","Varas","Outubro",276,1483,503,117913]
[2018,"SJES","Apolo","Juizados","Outubro",6,1542,266,14813]
[2018,"SJES","Apolo","Turmas Recursais","Outubro",249,2036,0,14897]
[2018,"SJES","Apolo","Varas","Novembro",358,1548,354,116782]
[2018,"SJES","Apolo","Juizados","Novembro",3,1876,308,13476]
[2018,"SJES","Apolo","Turmas Recursais","Novembro",299,1291,0,14560]
[2018,"SJES","Apolo","Varas","Dezembro",265,831,213,95889]
[2018,"SJES","Apolo","Juizados","Dezembro",3,477,251,11569]
[2018,"SJES","Apolo","Turmas Recursais","Dezembro",233,947,0,13698]
[2018,"SJES","Eproc","Varas","Janeiro",0,0,0,0]
[2018,"SJES","Eproc","Juizados","Janeiro",0,0,0,0]
[2018,"SJES","Eproc","Turmas Recursais","Janeiro",0,0,0,0]
[2018,"SJES","Eproc","Varas","Fevereiro",0,0,0,0]
[2018,"SJES","Eproc","Juizados","Fevereiro",134,1,0,0]
[2018,"SJES","Eproc","Turmas Recursais","Fevereiro",0,0,0,0]
[2018,"SJES","Eproc","Varas","Março",0,0,0,0]
[2018,"SJES","Eproc","Juizados","Março",967,29,0,0]
[2018,"SJES","Eproc","Turmas Recursais","Março",0,0,0,0]
[2018,"SJES","Eproc","Varas","Abril",11,0,0,5]
[2018,"SJES","Eproc","Juizados","Abril",1511,52,0,2523]
[2018,"SJES","Eproc","Turmas Recursais","Abril",0,0,0,0]
[2018,"SJES","Eproc","Varas","Maio",250,3,0,226]
[2018,"SJES","Eproc","Juizados","Maio",2218,114,5,4447]
[2018,"SJES","Eproc","Turmas Recursais","Maio",7,0,0,7]
[2018,"SJES","Eproc","Varas","Junho",649,4,0,891]
[2018,"SJES","Eproc","Juizados","Junho",2134,186,16,6794]
[2018,"SJES","Eproc","Turmas Recursais","Junho",19,0,0,26]
[2018,"SJES","Eproc","Varas","Julho",1340,39,0,2106]
[2018,"SJES","Eproc","Juizados","Julho",2261,372,49,8771]
[2018,"SJES","Eproc","Turmas Recursais","Julho",52,4,0,78]
[2018,"SJES","Eproc","Varas","Agosto",1391,46,1,3338]
[2018,"SJES","Eproc","Juizados","Agosto",2514,625,29,12029]
[2018,"SJES","Eproc","Turmas Recursais","Agosto",37,5,0,105]
[2018,"SJES","Eproc","Varas","Setembro",1575,66,3,4802]
[2018,"SJES","Eproc","Juizados","Setembro",2029,726,123,15205]
[2018,"SJES","Eproc","Turmas Recursais","Setembro",133,25,0,238]
[2018,"SJES","Eproc","Varas","Outubro",2634,331,10,7063]
[2018,"SJES","Eproc","Juizados","Outubro",2418,1228,313,17262]
[2018,"SJES","Eproc","Turmas Recursais","Outubro",319,34,0,535]
[2018,"SJES","Eproc","Varas","Novembro",1727,439,15,8702]
[2018,"SJES","Eproc","Juizados","Novembro",1982,1466,443,18587]
[2018,"SJES","Eproc","Turmas Recursais","Novembro",446,59,0,957]
[2018,"SJES","Eproc","Varas","Dezembro",2280,269,36,30388]
[2018,"SJES","Eproc","Juizados","Dezembro",2015,782,277,21075]
[2018,"SJES","Eproc","Turmas Recursais","Dezembro",281,112,0,1182]
[2018,"SJRJ","Apolo","Varas","Janeiro",9338,8260,1356,622019]
[2018,"SJRJ","Apolo","Juizados","Janeiro",8591,6660,1973,141802]
[2018,"SJRJ","Apolo","Turmas Recursais","Janeiro",1958,2217,0,57812]
[2018,"SJRJ","Apolo","Varas","Fevereiro",6065,7432,1349,613659]
[2018,"SJRJ","Apolo","Juizados","Fevereiro",7287,8778,2506,141269]
[2018,"SJRJ","Apolo","Turmas Recursais","Fevereiro",2644,3469,0,57441]
[2018,"SJRJ","Apolo","Varas","Março",6598,9747,1740,608484]
[2018,"SJRJ","Apolo","Juizados","Março",8985,10344,2635,142338]
[2018,"SJRJ","Apolo","Turmas Recursais","Março",2590,3765,0,56872]
[2018,"SJRJ","Apolo","Varas","Abril",15884,10595,1717,613541]
[2018,"SJRJ","Apolo","Juizados","Abril",5855,10336,3193,140316]
[2018,"SJRJ","Apolo","Turmas Recursais","Abril",3177,3523,0,56110]
[2018,"SJRJ","Apolo","Varas","Maio",8077,12527,2252,610014]
[2018,"SJRJ","Apolo","Juizados","Maio",3452,19064,2956,134356]
[2018,"SJRJ","Apolo","Turmas Recursais","Maio",2890,4370,0,56361]
[2018,"SJRJ","Apolo","Varas","Junho",6180,10491,2141,606727]
[2018,"SJRJ","Apolo","Juizados","Junho",889,23419,4433,114265]
[2018,"SJRJ","Apolo","Turmas Recursais","Junho",4361,5972,0,57838]
[2018,"SJRJ","Apolo","Varas","Julho",1516,7879,2893,597546]
[2018,"SJRJ","Apolo","Juizados","Julho",20,12310,5438,98178]
[2018,"SJRJ","Apolo","Turmas Recursais","Julho",4912,5481,0,58101]
[2018,"SJRJ","Apolo","Varas","Agosto",1514,11873,2777,585316]
[2018,"SJRJ","Apolo","Juizados","Agosto",10,12558,3708,83467]
[2018,"SJRJ","Apolo","Turmas Recursais","Agosto",4171,5931,0,59073]
[2018,"SJRJ","Apolo","Varas","Setembro",1229,8888,2231,576834]
[2018,"SJRJ","Apolo","Juizados","Setembro",8,10413,2984,70234]
[2018,"SJRJ","Apolo","Turmas Recursais","Setembro",2965,4967,0,58083]
[2018,"SJRJ","Apolo","Varas","Outubro",1290,9729,2858,565794]
[2018,"SJRJ","Apolo","Juizados","Outubro",8,7724,2181,51846]
[2018,"SJRJ","Apolo","Turmas Recursais","Outubro",2122,4479,0,55392]
[2018,"SJRJ","Apolo","Varas","Novembro",809,7058,1697,558734]
[2018,"SJRJ","Apolo","Juizados","Novembro",1,4212,991,41630]
[2018,"SJRJ","Apolo","Turmas Recursais","Novembro",992,2711,0,53258]
[2018,"SJRJ","Apolo","Varas","Dezembro",620,5333,1127,530063]
[2018,"SJRJ","Apolo","Juizados","Dezembro",2,2556,580,36713]
[2018,"SJRJ","Apolo","Turmas Recursais","Dezembro",70,1991,0,50962]
[2018,"SJRJ","Eproc","Varas","Janeiro",0,0,0,0]
[2018,"SJRJ","Eproc","Juizados","Janeiro",0,0,0,0]
[2018,"SJRJ","Eproc","Turmas Recursais","Janeiro",0,0,0,0]
[2018,"SJRJ","Eproc","Varas","Fevereiro",0,0,0,0]
[2018,"SJRJ","Eproc","Juizados","Fevereiro",0,0,0,0]
[2018,"SJRJ","Eproc","Turmas Recursais","Fevereiro",0,0,0,0]
[2018,"SJRJ","Eproc","Varas","Março",0,0,0,0]
[2018,"SJRJ","Eproc","Juizados","Março",342,5,0,0]
[2018,"SJRJ","Eproc","Turmas Recursais","Março",0,0,0,0]
[2018,"SJRJ","Eproc","Varas","Abril",14,0,0,0]
[2018,"SJRJ","Eproc","Juizados","Abril",3492,125,1,3648]
[2018,"SJRJ","Eproc","Turmas Recursais","Abril",2,0,0,2]
[2018,"SJRJ","Eproc","Varas","Maio",997,30,0,916]
[2018,"SJRJ","Eproc","Juizados","Maio",7712,443,1,10975]
[2018,"SJRJ","Eproc","Turmas Recursais","Maio",21,2,0,23]
[2018,"SJRJ","Eproc","Varas","Junho",1487,68,7,2317]
[2018,"SJRJ","Eproc","Juizados","Junho",8427,1117,44,19446]
[2018,"SJRJ","Eproc","Turmas Recursais","Junho",69,1,0,91]
[2018,"SJRJ","Eproc","Varas","Julho",5601,142,6,7334]
[2018,"SJRJ","Eproc","Juizados","Julho",9933,2026,148,28126]
[2018,"SJRJ","Eproc","Turmas Recursais","Julho",173,4,0,261]
[2018,"SJRJ","Eproc","Varas","Agosto",7772,383,23,14301]
[2018,"SJRJ","Eproc","Juizados","Agosto",10846,3549,285,37369]
[2018,"SJRJ","Eproc","Turmas Recursais","Agosto",338,14,0,596]
[2018,"SJRJ","Eproc","Varas","Setembro",5731,517,44,19107]
[2018,"SJRJ","Eproc","Juizados","Setembro",9447,3964,515,45387]
[2018,"SJRJ","Eproc","Turmas Recursais","Setembro",564,20,0,1156]
[2018,"SJRJ","Eproc","Varas","Outubro",7260,806,129,24620]
[2018,"SJRJ","Eproc","Juizados","Outubro",10742,6399,1196,62845]
[2018,"SJRJ","Eproc","Turmas Recursais","Outubro",1262,302,0,2398]
[2018,"SJRJ","Eproc","Varas","Novembro",5834,744,105,29457]
[2018,"SJRJ","Eproc","Juizados","Novembro",8901,5680,1851,73534]
[2018,"SJRJ","Eproc","Turmas Recursais","Novembro",1895,387,0,4249]
[2018,"SJRJ","Eproc","Varas","Dezembro",9097,840,157,61696]
[2018,"SJRJ","Eproc","Juizados","Dezembro",8372,5169,1389,80327]
[2018,"SJRJ","Eproc","Turmas Recursais","Dezembro",1424,456,0,5497]
[2017,"SJES","Apolo","Varas","Janeiro",2955,792,233,124525]
[2017,"SJES","Apolo","Juizados","Janeiro",1543,1182,415,40309]
[2017,"SJES","Apolo","Turmas Recursais","Janeiro",397,73,0,18895]
[2017,"SJES","Apolo","Varas","Fevereiro",1011,906,367,124801]
[2017,"SJES","Apolo","Juizados","Fevereiro",1278,1020,364,40810]
[2017,"SJES","Apolo","Turmas Recursais","Fevereiro",374,1178,0,18432]
[2017,"SJES","Apolo","Varas","Março",2692,1481,380,125458]
[2017,"SJES","Apolo","Juizados","Março",2157,1970,790,40884]
[2017,"SJES","Apolo","Turmas Recursais","Março",748,825,0,18612]
[2017,"SJES","Apolo","Varas","Abril",1515,1015,257,125696]
[2017,"SJES","Apolo","Juizados","Abril",1667,1031,432,41501]
[2017,"SJES","Apolo","Turmas Recursais","Abril",385,499,0,18392]
[2017,"SJES","Apolo","Varas","Maio",1392,1954,431,125499]
[2017,"SJES","Apolo","Juizados","Maio",2217,1930,485,42410]
[2017,"SJES","Apolo","Turmas Recursais","Maio",522,1796,0,18424]
[2017,"SJES","Apolo","Varas","Junho",1535,1789,294,125442]
[2017,"SJES","Apolo","Juizados","Junho",2080,2014,512,43073]
[2017,"SJES","Apolo","Turmas Recursais","Junho",443,1093,0,18303]
[2017,"SJES","Apolo","Varas","Julho",1971,1675,341,125609]
[2017,"SJES","Apolo","Juizados","Julho",2131,1737,633,43285]
[2017,"SJES","Apolo","Turmas Recursais","Julho",653,441,0,17960]
[2017,"SJES","Apolo","Varas","Agosto",1805,2815,490,124658]
[2017,"SJES","Apolo","Juizados","Agosto",2071,1976,638,43265]
[2017,"SJES","Apolo","Turmas Recursais","Agosto",640,1166,0,18050]
[2017,"SJES","Apolo","Varas","Setembro",2062,1467,413,124994]
[2017,"SJES","Apolo","Juizados","Setembro",1801,1927,480,43511]
[2017,"SJES","Apolo","Turmas Recursais","Setembro",460,1092,0,18132]
[2017,"SJES","Apolo","Varas","Outubro",2158,2256,634,124691]
[2017,"SJES","Apolo","Juizados","Outubro",2033,2346,819,43016]
[2017,"SJES","Apolo","Turmas Recursais","Outubro",833,1012,0,18338]
[2017,"SJES","Apolo","Varas","Novembro",2005,1514,384,124728]
[2017,"SJES","Apolo","Juizados","Novembro",1746,1998,596,42917]
[2017,"SJES","Apolo","Turmas Recursais","Novembro",560,1497,0,18253]
[2017,"SJES","Apolo","Varas","Dezembro",1747,1180,265,125316]
[2017,"SJES","Apolo","Juizados","Dezembro",1398,1576,566,42922]
[2017,"SJES","Apolo","Turmas Recursais","Dezembro",587,1151,0,18600]
[2017,"SJRJ","Apolo","Varas","Janeiro",7097,3922,1486,595930]
[2017,"SJRJ","Apolo","Juizados","Janeiro",7710,5798,1546,124454]
[2017,"SJRJ","Apolo","Turmas Recursais","Janeiro",1542,1716,0,83276]
[2017,"SJRJ","Apolo","Varas","Fevereiro",6880,6369,1794,596685]
[2017,"SJRJ","Apolo","Juizados","Fevereiro",7601,8561,2648,124108]
[2017,"SJRJ","Apolo","Turmas Recursais","Fevereiro",2502,5804,0,83042]
[2017,"SJRJ","Apolo","Varas","Março",17346,7022,2478,605160]
[2017,"SJRJ","Apolo","Juizados","Março",10016,10950,2982,124466]
[2017,"SJRJ","Apolo","Turmas Recursais","Março",3034,7827,0,79908]
[2017,"SJRJ","Apolo","Varas","Abril",23013,4601,1748,623119]
[2017,"SJRJ","Apolo","Juizados","Abril",8448,7373,2406,126346]
[2017,"SJRJ","Apolo","Turmas Recursais","Abril",2484,3112,0,74658]
[2017,"SJRJ","Apolo","Varas","Maio",19364,11089,2277,635489]
[2017,"SJRJ","Apolo","Juizados","Maio",11286,10834,3364,128603]
[2017,"SJRJ","Apolo","Turmas Recursais","Maio",3359,3084,0,63441]
[2017,"SJRJ","Apolo","Varas","Junho",8654,16163,1988,635109]
[2017,"SJRJ","Apolo","Juizados","Junho",10965,9130,3220,129334]
[2017,"SJRJ","Apolo","Turmas Recursais","Junho",3194,4919,0,62574]
[2017,"SJRJ","Apolo","Varas","Julho",9931,14107,2204,632666]
[2017,"SJRJ","Apolo","Juizados","Julho",10972,9399,2973,131792]
[2017,"SJRJ","Apolo","Turmas Recursais","Julho",2947,3903,0,59015]
[2017,"SJRJ","Apolo","Varas","Agosto",12957,15945,2322,629532]
[2017,"SJRJ","Apolo","Juizados","Agosto",11516,10710,3059,133075]
[2017,"SJRJ","Apolo","Turmas Recursais","Agosto",3100,4159,0,59739]
[2017,"SJRJ","Apolo","Varas","Setembro",19368,17492,2286,634440]
[2017,"SJRJ","Apolo","Juizados","Setembro",9906,9753,3029,133633]
[2017,"SJRJ","Apolo","Turmas Recursais","Setembro",3033,3440,0,58677]
[2017,"SJRJ","Apolo","Varas","Outubro",13795,18365,2944,631446]
[2017,"SJRJ","Apolo","Juizados","Outubro",10031,9698,2996,135603]
[2017,"SJRJ","Apolo","Turmas Recursais","Outubro",2967,4145,0,56876]
[2017,"SJRJ","Apolo","Varas","Novembro",6712,17012,1763,622704]
[2017,"SJRJ","Apolo","Juizados","Novembro",9450,9217,2324,137720]
[2017,"SJRJ","Apolo","Turmas Recursais","Novembro",2248,2981,0,57166]
[2017,"SJRJ","Apolo","Varas","Dezembro",6347,7275,1226,621087]
[2017,"SJRJ","Apolo","Juizados","Dezembro",6917,6605,1877,139350]
[2017,"SJRJ","Apolo","Turmas Recursais","Dezembro",1837,1880,0,56454]
[2016,"SJES","Apolo","Varas","Janeiro",1401,1100,301,118504]
[2016,"SJES","Apolo","Juizados","Janeiro",1519,979,381,34790]
[2016,"SJES","Apolo","Turmas Recursais","Janeiro",375,636,0,18065]
[2016,"SJES","Apolo","Varas","Fevereiro",1465,1557,670,117917]
[2016,"SJES","Apolo","Juizados","Fevereiro",1450,1495,660,35247]
[2016,"SJES","Apolo","Turmas Recursais","Fevereiro",646,979,0,18058]
[2016,"SJES","Apolo","Varas","Março",1347,1770,514,117682]
[2016,"SJES","Apolo","Juizados","Março",1797,1555,558,35637]
[2016,"SJES","Apolo","Turmas Recursais","Março",383,1142,0,17838]
[2016,"SJES","Apolo","Varas","Abril",2029,1165,587,117539]
[2016,"SJES","Apolo","Juizados","Abril",1650,1521,642,35840]
[2016,"SJES","Apolo","Turmas Recursais","Abril",810,877,0,18411]
[2016,"SJES","Apolo","Varas","Maio",1314,1323,383,117002]
[2016,"SJES","Apolo","Juizados","Maio",1898,1506,705,36654]
[2016,"SJES","Apolo","Turmas Recursais","Maio",697,467,0,18265]
[2016,"SJES","Apolo","Varas","Junho",2822,1860,523,117680]
[2016,"SJES","Apolo","Juizados","Junho",2198,1699,706,37177]
[2016,"SJES","Apolo","Turmas Recursais","Junho",645,1390,0,18497]
[2016,"SJES","Apolo","Varas","Julho",1469,1147,410,117442]
[2016,"SJES","Apolo","Juizados","Julho",1928,1422,664,37644]
[2016,"SJES","Apolo","Turmas Recursais","Julho",693,1083,0,18585]
[2016,"SJES","Apolo","Varas","Agosto",2836,1494,410,118467]
[2016,"SJES","Apolo","Juizados","Agosto",2197,1709,878,37663]
[2016,"SJES","Apolo","Turmas Recursais","Agosto",870,1097,0,18811]
[2016,"SJES","Apolo","Varas","Setembro",2041,1237,399,118913]
[2016,"SJES","Apolo","Juizados","Setembro",1897,1567,687,38187]
[2016,"SJES","Apolo","Turmas Recursais","Setembro",675,1073,0,18860]
[2016,"SJES","Apolo","Varas","Outubro",2289,1193,349,119687]
[2016,"SJES","Apolo","Juizados","Outubro",1924,1192,555,38670]
[2016,"SJES","Apolo","Turmas Recursais","Outubro",532,921,0,18847]
[2016,"SJES","Apolo","Varas","Novembro",2502,1430,374,120623]
[2016,"SJES","Apolo","Juizados","Novembro",1886,1710,639,39420]
[2016,"SJES","Apolo","Turmas Recursais","Novembro",631,1054,0,18772]
[2016,"SJES","Apolo","Varas","Dezembro",2383,958,229,122374]
[2016,"SJES","Apolo","Juizados","Dezembro",1178,1139,288,39831]
[2016,"SJES","Apolo","Turmas Recursais","Dezembro",283,945,0,18856]
[2016,"SJRJ","Apolo","Varas","Janeiro",7233,4808,1588,573754]
[2016,"SJRJ","Apolo","Juizados","Janeiro",6767,6869,2725,102990]
[2016,"SJRJ","Apolo","Turmas Recursais","Janeiro",2765,2209,0,84068]
[2016,"SJRJ","Apolo","Varas","Fevereiro",9055,6043,2067,574926]
[2016,"SJRJ","Apolo","Juizados","Fevereiro",6505,8672,2657,100456]
[2016,"SJRJ","Apolo","Turmas Recursais","Fevereiro",2643,3282,0,85321]
[2016,"SJRJ","Apolo","Varas","Março",10938,7543,2316,579022]
[2016,"SJRJ","Apolo","Juizados","Março",9414,8640,3194,100561]
[2016,"SJRJ","Apolo","Turmas Recursais","Março",3128,4101,0,86037]
[2016,"SJRJ","Apolo","Varas","Abril",10029,6630,2135,581060]
[2016,"SJRJ","Apolo","Juizados","Abril",8878,7894,2760,101347]
[2016,"SJRJ","Apolo","Turmas Recursais","Abril",2720,3611,0,86370]
[2016,"SJRJ","Apolo","Varas","Maio",9735,7158,2312,583430]
[2016,"SJRJ","Apolo","Juizados","Maio",10026,8497,2737,103928]
[2016,"SJRJ","Apolo","Turmas Recursais","Maio",2741,3305,0,85496]
[2016,"SJRJ","Apolo","Varas","Junho",10311,7780,2481,585465]
[2016,"SJRJ","Apolo","Juizados","Junho",10528,9272,2852,105494]
[2016,"SJRJ","Apolo","Turmas Recursais","Junho",2964,4950,0,85272]
[2016,"SJRJ","Apolo","Varas","Julho",6628,6760,2223,584915]
[2016,"SJRJ","Apolo","Juizados","Julho",11006,8547,2821,109526]
[2016,"SJRJ","Apolo","Turmas Recursais","Julho",2837,4846,0,84325]
[2016,"SJRJ","Apolo","Varas","Agosto",7693,5318,1786,587530]
[2016,"SJRJ","Apolo","Juizados","Agosto",9506,7594,2262,112804]
[2016,"SJRJ","Apolo","Turmas Recursais","Agosto",2288,3389,0,83847]
[2016,"SJRJ","Apolo","Varas","Setembro",7383,6740,2404,587800]
[2016,"SJRJ","Apolo","Juizados","Setembro",11067,10129,3082,115472]
[2016,"SJRJ","Apolo","Turmas Recursais","Setembro",3073,3653,0,83159]
[2016,"SJRJ","Apolo","Varas","Outubro",8487,6517,2120,589927]
[2016,"SJRJ","Apolo","Juizados","Outubro",9793,9175,2874,117638]
[2016,"SJRJ","Apolo","Turmas Recursais","Outubro",2854,4276,0,83468]
[2016,"SJRJ","Apolo","Varas","Novembro",7320,7191,2182,589706]
[2016,"SJRJ","Apolo","Juizados","Novembro",10021,9428,2926,118826]
[2016,"SJRJ","Apolo","Turmas Recursais","Novembro",2951,4306,0,84661]
[2016,"SJRJ","Apolo","Varas","Dezembro",6997,4272,1308,592525]
[2016,"SJRJ","Apolo","Juizados","Dezembro",6837,5920,1718,120229]
[2016,"SJRJ","Apolo","Turmas Recursais","Dezembro",1768,1874,0,83901]
[2015,"SJES","Apolo","Varas","Janeiro",1688,878,287,112752]
[2015,"SJES","Apolo","Juizados","Janeiro",1181,1272,389,30229]
[2015,"SJES","Apolo","Turmas Recursais","Janeiro",384,606,0,17394]
[2015,"SJES","Apolo","Varas","Fevereiro",1652,1634,240,113096]
[2015,"SJES","Apolo","Juizados","Fevereiro",1238,1357,311,30342]
[2015,"SJES","Apolo","Turmas Recursais","Fevereiro",326,553,0,17249]
[2015,"SJES","Apolo","Varas","Março",1506,1452,368,112614]
[2015,"SJES","Apolo","Juizados","Março",1993,1740,525,30602]
[2015,"SJES","Apolo","Turmas Recursais","Março",525,842,0,17331]
[2015,"SJES","Apolo","Varas","Abril",1097,1299,458,112423]
[2015,"SJES","Apolo","Juizados","Abril",1624,1210,457,30859]
[2015,"SJES","Apolo","Turmas Recursais","Abril",394,689,0,17495]
[2015,"SJES","Apolo","Varas","Maio",1598,1363,457,112471]
[2015,"SJES","Apolo","Juizados","Maio",1647,1849,581,30739]
[2015,"SJES","Apolo","Turmas Recursais","Maio",621,577,0,17783]
[2015,"SJES","Apolo","Varas","Junho",1907,1556,441,112687]
[2015,"SJES","Apolo","Juizados","Junho",1994,1539,596,31647]
[2015,"SJES","Apolo","Turmas Recursais","Junho",560,811,0,17696]
[2015,"SJES","Apolo","Varas","Julho",2816,1216,392,114014]
[2015,"SJES","Apolo","Juizados","Julho",2130,1490,509,32377]
[2015,"SJES","Apolo","Turmas Recursais","Julho",383,840,0,17928]
[2015,"SJES","Apolo","Varas","Agosto",1548,1571,204,114909]
[2015,"SJES","Apolo","Juizados","Agosto",1731,1127,615,32558]
[2015,"SJES","Apolo","Turmas Recursais","Agosto",283,632,0,18204]
[2015,"SJES","Apolo","Varas","Setembro",3965,1858,422,117180]
[2015,"SJES","Apolo","Juizados","Setembro",1459,1644,478,32907]
[2015,"SJES","Apolo","Turmas Recursais","Setembro",923,1158,0,18574]
[2015,"SJES","Apolo","Varas","Outubro",2620,1802,446,117811]
[2015,"SJES","Apolo","Juizados","Outubro",1560,1672,461,33343]
[2015,"SJES","Apolo","Turmas Recursais","Outubro",474,920,0,18318]
[2015,"SJES","Apolo","Varas","Novembro",1968,1753,462,118096]
[2015,"SJES","Apolo","Juizados","Novembro",1583,1492,728,33827]
[2015,"SJES","Apolo","Turmas Recursais","Novembro",701,802,0,18008]
[2015,"SJES","Apolo","Varas","Dezembro",1987,1396,256,118569]
[2015,"SJES","Apolo","Juizados","Dezembro",1242,965,393,34381]
[2015,"SJES","Apolo","Turmas Recursais","Dezembro",412,491,0,17796]
[2015,"SJRJ","Apolo","Varas","Janeiro",6285,6974,2493,570184]
[2015,"SJRJ","Apolo","Juizados","Janeiro",7393,6909,3015,103513]
[2015,"SJRJ","Apolo","Turmas Recursais","Janeiro",3109,2924,0,83076]
[2015,"SJRJ","Apolo","Varas","Fevereiro",5785,10568,2859,565229]
[2015,"SJRJ","Apolo","Juizados","Fevereiro",5733,8157,2570,101064]
[2015,"SJRJ","Apolo","Turmas Recursais","Fevereiro",2552,2932,0,83593]
[2015,"SJRJ","Apolo","Varas","Março",10276,11662,3889,563741]
[2015,"SJRJ","Apolo","Juizados","Março",9430,9476,3617,100696]
[2015,"SJRJ","Apolo","Turmas Recursais","Março",3689,5705,0,84786]
[2015,"SJRJ","Apolo","Varas","Abril",11936,8857,3288,563009]
[2015,"SJRJ","Apolo","Juizados","Abril",8270,7319,3083,101918]
[2015,"SJRJ","Apolo","Turmas Recursais","Abril",3002,3927,0,84585]
[2015,"SJRJ","Apolo","Varas","Maio",13640,9092,3204,564757]
[2015,"SJRJ","Apolo","Juizados","Maio",9146,9233,3058,102805]
[2015,"SJRJ","Apolo","Turmas Recursais","Maio",3140,4482,0,83420]
[2015,"SJRJ","Apolo","Varas","Junho",6874,8440,2974,562467]
[2015,"SJRJ","Apolo","Juizados","Junho",9193,8549,3257,103065]
[2015,"SJRJ","Apolo","Turmas Recursais","Junho",3185,4522,0,83474]
[2015,"SJRJ","Apolo","Varas","Julho",6622,8003,2796,560682]
[2015,"SJRJ","Apolo","Juizados","Julho",10580,9771,3128,105482]
[2015,"SJRJ","Apolo","Turmas Recursais","Julho",3203,4626,0,82262]
[2015,"SJRJ","Apolo","Varas","Agosto",10292,7068,2189,563433]
[2015,"SJRJ","Apolo","Juizados","Agosto",8517,8861,3275,105332]
[2015,"SJRJ","Apolo","Turmas Recursais","Agosto",3139,4027,0,82693]
[2015,"SJRJ","Apolo","Varas","Setembro",12666,7041,2638,567285]
[2015,"SJRJ","Apolo","Juizados","Setembro",8496,8919,3339,104897]
[2015,"SJRJ","Apolo","Turmas Recursais","Setembro",3438,4021,0,82609]
[2015,"SJRJ","Apolo","Varas","Outubro",10132,7391,2432,569378]
[2015,"SJRJ","Apolo","Juizados","Outubro",7626,9349,3262,103032]
[2015,"SJRJ","Apolo","Turmas Recursais","Outubro",3163,3703,0,83712]
[2015,"SJRJ","Apolo","Varas","Novembro",7368,7108,2410,570049]
[2015,"SJRJ","Apolo","Juizados","Novembro",7585,9002,3231,101770]
[2015,"SJRJ","Apolo","Turmas Recursais","Novembro",3201,4248,0,83721]
[2015,"SJRJ","Apolo","Varas","Dezembro",7035,5475,1434,571789]
[2015,"SJRJ","Apolo","Juizados","Dezembro",6435,6996,2011,102983]
[2015,"SJRJ","Apolo","Turmas Recursais","Dezembro",2089,2227,0,83891]
[2014,"SJES","Apolo","Varas","Janeiro",1344,1565,458,113372]
[2014,"SJES","Apolo","Juizados","Janeiro",1114,1461,578,24478]
[2014,"SJES","Apolo","Turmas Recursais","Janeiro",579,172,0,16870]
[2014,"SJES","Apolo","Varas","Fevereiro",1501,1777,392,112645]
[2014,"SJES","Apolo","Juizados","Fevereiro",1655,2232,590,23827]
[2014,"SJES","Apolo","Turmas Recursais","Fevereiro",585,497,0,17142]
[2014,"SJES","Apolo","Varas","Março",1655,1475,366,112774]
[2014,"SJES","Apolo","Juizados","Março",2110,1562,576,23897]
[2014,"SJES","Apolo","Turmas Recursais","Março",567,992,0,17605]
[2014,"SJES","Apolo","Varas","Abril",1401,1073,504,112244]
[2014,"SJES","Apolo","Juizados","Abril",1996,1354,560,24913]
[2014,"SJES","Apolo","Turmas Recursais","Abril",564,1167,0,17401]
[2014,"SJES","Apolo","Varas","Maio",1657,1498,334,111522]
[2014,"SJES","Apolo","Juizados","Maio",2439,1609,535,25517]
[2014,"SJES","Apolo","Turmas Recursais","Maio",501,487,0,17488]
[2014,"SJES","Apolo","Varas","Junho",1281,1113,510,110544]
[2014,"SJES","Apolo","Juizados","Junho",2232,1199,497,26680]
[2014,"SJES","Apolo","Turmas Recursais","Junho",482,710,0,17280]
[2014,"SJES","Apolo","Varas","Julho",1181,1399,656,109741]
[2014,"SJES","Apolo","Juizados","Julho",1996,1484,515,27110]
[2014,"SJES","Apolo","Turmas Recursais","Julho",563,486,0,17418]
[2014,"SJES","Apolo","Varas","Agosto",1703,1341,352,109400]
[2014,"SJES","Apolo","Juizados","Agosto",1765,1344,514,27567]
[2014,"SJES","Apolo","Turmas Recursais","Agosto",508,797,0,17696]
[2014,"SJES","Apolo","Varas","Setembro",1531,1333,355,109089]
[2014,"SJES","Apolo","Juizados","Setembro",2145,1261,574,28113]
[2014,"SJES","Apolo","Turmas Recursais","Setembro",547,581,0,17751]
[2014,"SJES","Apolo","Varas","Outubro",2140,1312,509,109170]
[2014,"SJES","Apolo","Juizados","Outubro",2260,1412,482,28721]
[2014,"SJES","Apolo","Turmas Recursais","Outubro",459,1435,0,17834]
[2014,"SJES","Apolo","Varas","Novembro",3656,1307,469,109866]
[2014,"SJES","Apolo","Juizados","Novembro",1527,1273,418,29183]
[2014,"SJES","Apolo","Turmas Recursais","Novembro",392,925,0,17563]
[2014,"SJES","Apolo","Varas","Dezembro",3520,1183,286,112258]
[2014,"SJES","Apolo","Juizados","Dezembro",1435,887,296,30303]
[2014,"SJES","Apolo","Turmas Recursais","Dezembro",278,929,0,17361]
[2014,"SJRJ","Apolo","Varas","Janeiro",9622,7594,2581,587033]
[2014,"SJRJ","Apolo","Juizados","Janeiro",8466,8635,4564,104629]
[2014,"SJRJ","Apolo","Turmas Recursais","Janeiro",4579,4567,0,79657]
[2014,"SJRJ","Apolo","Varas","Fevereiro",13892,12730,3425,590589]
[2014,"SJRJ","Apolo","Juizados","Fevereiro",9553,10633,4063,103300]
[2014,"SJRJ","Apolo","Turmas Recursais","Fevereiro",3740,5961,0,80755]
[2014,"SJRJ","Apolo","Varas","Março",11175,12203,3888,589288]
[2014,"SJRJ","Apolo","Juizados","Março",9839,9889,4363,102725]
[2014,"SJRJ","Apolo","Turmas Recursais","Março",4710,5194,0,81714]
[2014,"SJRJ","Apolo","Varas","Abril",10472,10281,3500,587848]
[2014,"SJRJ","Apolo","Juizados","Abril",9513,8860,4373,102538]
[2014,"SJRJ","Apolo","Turmas Recursais","Abril",4248,7904,0,81809]
[2014,"SJRJ","Apolo","Varas","Maio",6733,10815,5323,580620]
[2014,"SJRJ","Apolo","Juizados","Maio",11631,11408,3951,104538]
[2014,"SJRJ","Apolo","Turmas Recursais","Maio",3873,7937,0,81753]
[2014,"SJRJ","Apolo","Varas","Junho",5842,9294,3415,575706]
[2014,"SJRJ","Apolo","Juizados","Junho",9542,10040,4118,105084]
[2014,"SJRJ","Apolo","Turmas Recursais","Junho",3851,5773,0,81122]
[2014,"SJRJ","Apolo","Varas","Julho",7859,9869,5950,568811]
[2014,"SJRJ","Apolo","Juizados","Julho",11271,11608,5253,104877]
[2014,"SJRJ","Apolo","Turmas Recursais","Julho",5315,6758,0,82597]
[2014,"SJRJ","Apolo","Varas","Agosto",8048,9390,4081,565338]
[2014,"SJRJ","Apolo","Juizados","Agosto",9911,11090,4425,104327]
[2014,"SJRJ","Apolo","Turmas Recursais","Agosto",4435,6924,0,82741]
[2014,"SJRJ","Apolo","Varas","Setembro",11586,8677,3655,566568]
[2014,"SJRJ","Apolo","Juizados","Setembro",9983,9468,4654,104328]
[2014,"SJRJ","Apolo","Turmas Recursais","Setembro",4469,6825,0,82557]
[2014,"SJRJ","Apolo","Varas","Outubro",9227,10030,3602,564944]
[2014,"SJRJ","Apolo","Juizados","Outubro",10050,11360,4099,103593]
[2014,"SJRJ","Apolo","Turmas Recursais","Outubro",4293,6071,0,84205]
[2014,"SJRJ","Apolo","Varas","Novembro",13454,11849,3858,567921]
[2014,"SJRJ","Apolo","Juizados","Novembro",7665,9607,3923,101927]
[2014,"SJRJ","Apolo","Turmas Recursais","Novembro",3743,5311,0,83323]
[2014,"SJRJ","Apolo","Varas","Dezembro",13756,9951,3152,572508]
[2014,"SJRJ","Apolo","Juizados","Dezembro",7431,6819,2644,102785]
[2014,"SJRJ","Apolo","Turmas Recursais","Dezembro",2740,3795,0,83589]
[2013,"SJES","Apolo","Varas","Janeiro",2045,1431,413,117493]
[2013,"SJES","Apolo","Juizados","Janeiro",901,1661,568,30926]
[2013,"SJES","Apolo","Turmas Recursais","Janeiro",573,10,0,12402]
[2013,"SJES","Apolo","Varas","Fevereiro",1185,1963,355,116678]
[2013,"SJES","Apolo","Juizados","Fevereiro",985,1004,655,29877]
[2013,"SJES","Apolo","Turmas Recursais","Fevereiro",723,535,0,12916]
[2013,"SJES","Apolo","Varas","Março",1051,1860,294,115984]
[2013,"SJES","Apolo","Juizados","Março",1167,1754,349,29153]
[2013,"SJES","Apolo","Turmas Recursais","Março",2578,1431,0,13156]
[2013,"SJES","Apolo","Varas","Abril",1952,2023,348,115714]
[2013,"SJES","Apolo","Juizados","Abril",1335,1950,729,29147]
[2013,"SJES","Apolo","Turmas Recursais","Abril",8880,94,0,13144]
[2013,"SJES","Apolo","Varas","Maio",2139,1790,381,115714]
[2013,"SJES","Apolo","Juizados","Maio",1270,1714,781,28558]
[2013,"SJES","Apolo","Turmas Recursais","Maio",3554,433,0,13783]
[2013,"SJES","Apolo","Varas","Junho",1850,2085,531,115555]
[2013,"SJES","Apolo","Juizados","Junho",1185,1438,642,28415]
[2013,"SJES","Apolo","Turmas Recursais","Junho",648,186,0,14409]
[2013,"SJES","Apolo","Varas","Julho",1591,1444,805,114592]
[2013,"SJES","Apolo","Juizados","Julho",1560,1612,747,28043]
[2013,"SJES","Apolo","Turmas Recursais","Julho",1052,556,0,14912]
[2013,"SJES","Apolo","Varas","Agosto",1754,2505,416,113954]
[2013,"SJES","Apolo","Juizados","Agosto",1283,1477,620,27553]
[2013,"SJES","Apolo","Turmas Recursais","Agosto",2628,621,0,15378]
[2013,"SJES","Apolo","Varas","Setembro",1460,2139,889,112944]
[2013,"SJES","Apolo","Juizados","Setembro",1327,1846,670,26727]
[2013,"SJES","Apolo","Turmas Recursais","Setembro",1000,701,0,15911]
[2013,"SJES","Apolo","Varas","Outubro",1894,1665,431,112691]
[2013,"SJES","Apolo","Juizados","Outubro",1312,2315,736,25929]
[2013,"SJES","Apolo","Turmas Recursais","Outubro",838,1527,0,16250]
[2013,"SJES","Apolo","Varas","Novembro",2558,1782,382,113437]
[2013,"SJES","Apolo","Juizados","Novembro",1219,1550,638,25155]
[2013,"SJES","Apolo","Turmas Recursais","Novembro",1719,588,0,16548]
[2013,"SJES","Apolo","Varas","Dezembro",2010,1155,301,114324]
[2013,"SJES","Apolo","Juizados","Dezembro",1015,1406,528,25192]
[2013,"SJES","Apolo","Turmas Recursais","Dezembro",1077,916,0,16755]
[2013,"SJRJ","Apolo","Varas","Janeiro",7183,6954,2454,630804]
[2013,"SJRJ","Apolo","Juizados","Janeiro",6943,8643,2924,111726]
[2013,"SJRJ","Apolo","Turmas Recursais","Janeiro",4259,2060,0,65220]
[2013,"SJRJ","Apolo","Varas","Fevereiro",5764,10433,1942,630632]
[2013,"SJRJ","Apolo","Juizados","Fevereiro",5844,8413,2544,109640]
[2013,"SJRJ","Apolo","Turmas Recursais","Fevereiro",4344,3380,0,66279]
[2013,"SJRJ","Apolo","Varas","Março",5104,10981,2270,628053]
[2013,"SJRJ","Apolo","Juizados","Março",7149,9642,2974,108711]
[2013,"SJRJ","Apolo","Turmas Recursais","Março",3773,3931,0,68039]
[2013,"SJRJ","Apolo","Varas","Abril",5103,8870,3363,618273]
[2013,"SJRJ","Apolo","Juizados","Abril",7281,9020,3765,107676]
[2013,"SJRJ","Apolo","Turmas Recursais","Abril",5164,4296,0,68645]
[2013,"SJRJ","Apolo","Varas","Maio",7754,15386,3944,613560]
[2013,"SJRJ","Apolo","Juizados","Maio",11114,10471,3900,109200]
[2013,"SJRJ","Apolo","Turmas Recursais","Maio",4796,7004,0,70817]
[2013,"SJRJ","Apolo","Varas","Junho",4196,9409,3346,604401]
[2013,"SJRJ","Apolo","Juizados","Junho",6278,9082,3491,107645]
[2013,"SJRJ","Apolo","Turmas Recursais","Junho",4966,5843,0,71880]
[2013,"SJRJ","Apolo","Varas","Julho",5713,10076,4326,595372]
[2013,"SJRJ","Apolo","Juizados","Julho",8177,9565,4029,106121]
[2013,"SJRJ","Apolo","Turmas Recursais","Julho",5715,4122,0,71467]
[2013,"SJRJ","Apolo","Varas","Agosto",10827,14046,3666,592974]
[2013,"SJRJ","Apolo","Juizados","Agosto",14326,12269,4133,110312]
[2013,"SJRJ","Apolo","Turmas Recursais","Agosto",5555,5043,0,72490]
[2013,"SJRJ","Apolo","Varas","Setembro",12946,11090,3775,592307]
[2013,"SJRJ","Apolo","Juizados","Setembro",9905,11739,4571,110376]
[2013,"SJRJ","Apolo","Turmas Recursais","Setembro",5624,5337,0,72462]
[2013,"SJRJ","Apolo","Varas","Outubro",7126,10048,4294,585510]
[2013,"SJRJ","Apolo","Juizados","Outubro",10615,12800,5915,108114]
[2013,"SJRJ","Apolo","Turmas Recursais","Outubro",7129,7517,0,75161]
[2013,"SJRJ","Apolo","Varas","Novembro",5864,8662,3510,581153]
[2013,"SJRJ","Apolo","Juizados","Novembro",10032,11016,4502,107995]
[2013,"SJRJ","Apolo","Turmas Recursais","Novembro",6087,6025,0,76150]
[2013,"SJRJ","Apolo","Varas","Dezembro",10381,6363,2384,584820]
[2013,"SJRJ","Apolo","Juizados","Dezembro",6828,7252,3662,106558]
[2013,"SJRJ","Apolo","Turmas Recursais","Dezembro",6261,4528,0,77659]
[2012,"SJES","Apolo","Varas","Janeiro",3532,1401,223,118588]
[2012,"SJES","Apolo","Juizados","Janeiro",993,1270,161,32925]
[2012,"SJES","Apolo","Turmas Recursais","Janeiro",281,21,0,10043]
[2012,"SJES","Apolo","Varas","Fevereiro",1657,1967,333,118612]
[2012,"SJES","Apolo","Juizados","Fevereiro",1063,1328,327,32539]
[2012,"SJES","Apolo","Turmas Recursais","Fevereiro",369,321,0,10050]
[2012,"SJES","Apolo","Varas","Março",2077,1624,453,118590]
[2012,"SJES","Apolo","Juizados","Março",1803,2024,514,32666]
[2012,"SJES","Apolo","Turmas Recursais","Março",477,1197,0,10288]
[2012,"SJES","Apolo","Varas","Abril",1238,1478,421,118546]
[2012,"SJES","Apolo","Juizados","Abril",1510,1313,327,32929]
[2012,"SJES","Apolo","Turmas Recursais","Abril",372,307,0,10271]
[2012,"SJES","Apolo","Varas","Maio",2259,1319,631,118796]
[2012,"SJES","Apolo","Juizados","Maio",2091,1329,799,33490]
[2012,"SJES","Apolo","Turmas Recursais","Maio",649,360,0,10356]
[2012,"SJES","Apolo","Varas","Junho",1906,1914,455,118916]
[2012,"SJES","Apolo","Juizados","Junho",2155,1184,549,34080]
[2012,"SJES","Apolo","Turmas Recursais","Junho",669,740,0,10330]
[2012,"SJES","Apolo","Varas","Julho",1463,1606,339,118983]
[2012,"SJES","Apolo","Juizados","Julho",2223,2969,473,35153]
[2012,"SJES","Apolo","Turmas Recursais","Julho",470,53,0,10339]
[2012,"SJES","Apolo","Varas","Agosto",1510,1469,792,118305]
[2012,"SJES","Apolo","Juizados","Agosto",1337,2036,493,34761]
[2012,"SJES","Apolo","Turmas Recursais","Agosto",619,6,0,10152]
[2012,"SJES","Apolo","Varas","Setembro",1564,1718,338,118110]
[2012,"SJES","Apolo","Juizados","Setembro",1058,1699,440,33975]
[2012,"SJES","Apolo","Turmas Recursais","Setembro",1656,310,0,10773]
[2012,"SJES","Apolo","Varas","Outubro",1764,2080,479,117860]
[2012,"SJES","Apolo","Juizados","Outubro",1330,2611,741,32773]
[2012,"SJES","Apolo","Turmas Recursais","Outubro",826,513,0,11498]
[2012,"SJES","Apolo","Varas","Novembro",1451,2017,342,117436]
[2012,"SJES","Apolo","Juizados","Novembro",1028,1410,640,31315]
[2012,"SJES","Apolo","Turmas Recursais","Novembro",589,280,0,11845]
[2012,"SJES","Apolo","Varas","Dezembro",1008,1364,244,117094]
[2012,"SJES","Apolo","Juizados","Dezembro",916,1494,430,31171]
[2012,"SJES","Apolo","Turmas Recursais","Dezembro",488,174,0,12128]
[2012,"SJRJ","Apolo","Varas","Janeiro",8095,7039,2305,644095]
[2012,"SJRJ","Apolo","Juizados","Janeiro",5065,7094,3153,137616]
[2012,"SJRJ","Apolo","Turmas Recursais","Janeiro",8610,2918,0,49949]
[2012,"SJRJ","Apolo","Varas","Fevereiro",7259,6536,2395,644026]
[2012,"SJRJ","Apolo","Juizados","Fevereiro",6232,7862,3500,133485]
[2012,"SJRJ","Apolo","Turmas Recursais","Fevereiro",4354,4227,0,52864]
[2012,"SJRJ","Apolo","Varas","Março",9069,8514,2546,643969]
[2012,"SJRJ","Apolo","Juizados","Março",7389,9254,3735,130528]
[2012,"SJRJ","Apolo","Turmas Recursais","Março",3764,6296,0,53900]
[2012,"SJRJ","Apolo","Varas","Abril",6250,6667,2019,643547]
[2012,"SJRJ","Apolo","Juizados","Abril",6524,7164,2850,129436]
[2012,"SJRJ","Apolo","Turmas Recursais","Abril",2820,5097,0,53424]
[2012,"SJRJ","Apolo","Varas","Maio",11491,10959,3732,642465]
[2012,"SJRJ","Apolo","Juizados","Maio",7462,9305,3715,126142]
[2012,"SJRJ","Apolo","Turmas Recursais","Maio",3607,6440,0,53983]
[2012,"SJRJ","Apolo","Varas","Junho",7996,8486,2020,641514]
[2012,"SJRJ","Apolo","Juizados","Junho",6526,7889,3349,123732]
[2012,"SJRJ","Apolo","Turmas Recursais","Junho",3274,5150,0,55184]
[2012,"SJRJ","Apolo","Varas","Julho",10126,8836,3220,639883]
[2012,"SJRJ","Apolo","Juizados","Julho",7387,9121,3822,121662]
[2012,"SJRJ","Apolo","Turmas Recursais","Julho",3775,2938,0,54868]
[2012,"SJRJ","Apolo","Varas","Agosto",7814,9548,3482,635385]
[2012,"SJRJ","Apolo","Juizados","Agosto",8755,8247,3985,119580]
[2012,"SJRJ","Apolo","Turmas Recursais","Agosto",1185,193,0,54439]
[2012,"SJRJ","Apolo","Varas","Setembro",7207,7443,2414,633383]
[2012,"SJRJ","Apolo","Juizados","Setembro",6823,8505,2818,116874]
[2012,"SJRJ","Apolo","Turmas Recursais","Setembro",5892,929,0,60034]
[2012,"SJRJ","Apolo","Varas","Outubro",8289,13259,3310,631321]
[2012,"SJRJ","Apolo","Juizados","Outubro",7853,11462,3267,114469]
[2012,"SJRJ","Apolo","Turmas Recursais","Outubro",4240,7474,0,63423]
[2012,"SJRJ","Apolo","Varas","Novembro",5585,7250,2683,628714]
[2012,"SJRJ","Apolo","Juizados","Novembro",6879,7486,3372,112695]
[2012,"SJRJ","Apolo","Turmas Recursais","Novembro",4655,5278,0,64742]
[2012,"SJRJ","Apolo","Varas","Dezembro",7441,6105,2207,630103]
[2012,"SJRJ","Apolo","Juizados","Dezembro",6144,6058,2248,111759]
[2012,"SJRJ","Apolo","Turmas Recursais","Dezembro",3251,2854,0,65235]
[2011,"SJES","Apolo","Varas","Janeiro",1467,878,239,112363]
[2011,"SJES","Apolo","Juizados","Janeiro",1076,772,258,30199]
[2011,"SJES","Apolo","Turmas Recursais","Janeiro",258,1,0,6094]
[2011,"SJES","Apolo","Varas","Fevereiro",1684,1357,325,112695]
[2011,"SJES","Apolo","Juizados","Fevereiro",1416,1197,509,30185]
[2011,"SJES","Apolo","Turmas Recursais","Fevereiro",302,256,0,7007]
[2011,"SJES","Apolo","Varas","Março",1148,1277,311,112732]
[2011,"SJES","Apolo","Juizados","Março",1537,1179,375,30575]
[2011,"SJES","Apolo","Turmas Recursais","Março",560,333,0,7610]
[2011,"SJES","Apolo","Varas","Abril",1159,760,304,112498]
[2011,"SJES","Apolo","Juizados","Abril",1437,1179,383,31142]
[2011,"SJES","Apolo","Turmas Recursais","Abril",343,204,0,7793]
[2011,"SJES","Apolo","Varas","Maio",2066,1250,322,113599]
[2011,"SJES","Apolo","Juizados","Maio",2095,1607,432,32182]
[2011,"SJES","Apolo","Turmas Recursais","Maio",330,192,0,7968]
[2011,"SJES","Apolo","Varas","Junho",2011,1332,398,114500]
[2011,"SJES","Apolo","Juizados","Junho",1294,1499,391,32409]
[2011,"SJES","Apolo","Turmas Recursais","Junho",496,402,0,8270]
[2011,"SJES","Apolo","Varas","Julho",2242,1284,277,115024]
[2011,"SJES","Apolo","Juizados","Julho",1327,1225,703,32388]
[2011,"SJES","Apolo","Turmas Recursais","Julho",879,318,0,8868]
[2011,"SJES","Apolo","Varas","Agosto",2135,1678,310,115485]
[2011,"SJES","Apolo","Juizados","Agosto",1552,1317,524,32622]
[2011,"SJES","Apolo","Turmas Recursais","Agosto",649,684,0,9174]
[2011,"SJES","Apolo","Varas","Setembro",2800,1305,274,116327]
[2011,"SJES","Apolo","Juizados","Setembro",1131,1329,513,32583]
[2011,"SJES","Apolo","Turmas Recursais","Setembro",506,421,0,9512]
[2011,"SJES","Apolo","Varas","Outubro",1986,1479,790,116663]
[2011,"SJES","Apolo","Juizados","Outubro",1251,1356,718,32568]
[2011,"SJES","Apolo","Turmas Recursais","Outubro",785,415,0,9813]
[2011,"SJES","Apolo","Varas","Novembro",1142,919,331,116429]
[2011,"SJES","Apolo","Juizados","Novembro",1292,973,502,32725]
[2011,"SJES","Apolo","Turmas Recursais","Novembro",410,382,0,9933]
[2011,"SJES","Apolo","Varas","Dezembro",1864,918,166,116456]
[2011,"SJES","Apolo","Juizados","Dezembro",830,766,264,32798]
[2011,"SJES","Apolo","Turmas Recursais","Dezembro",339,196,0,10015]
[2011,"SJRJ","Apolo","Varas","Janeiro",6502,5045,2070,667718]
[2011,"SJRJ","Apolo","Juizados","Janeiro",5788,7231,3454,159944]
[2011,"SJRJ","Apolo","Turmas Recursais","Janeiro",2929,1723,0,43002]
[2011,"SJRJ","Apolo","Varas","Fevereiro",7520,8023,3743,664342]
[2011,"SJRJ","Apolo","Juizados","Fevereiro",10011,10279,3518,160857]
[2011,"SJRJ","Apolo","Turmas Recursais","Fevereiro",3630,4783,0,43882]
[2011,"SJRJ","Apolo","Varas","Março",6108,6777,2805,661478]
[2011,"SJRJ","Apolo","Juizados","Março",7461,9283,3011,160232]
[2011,"SJRJ","Apolo","Turmas Recursais","Março",2522,5081,0,44068]
[2011,"SJRJ","Apolo","Varas","Abril",6117,8715,2993,657655]
[2011,"SJRJ","Apolo","Juizados","Abril",7140,8681,3560,159852]
[2011,"SJRJ","Apolo","Turmas Recursais","Abril",3718,4619,0,45404]
[2011,"SJRJ","Apolo","Varas","Maio",7795,9469,3024,654721]
[2011,"SJRJ","Apolo","Juizados","Maio",9289,10188,3935,158878]
[2011,"SJRJ","Apolo","Turmas Recursais","Maio",4333,6024,0,48604]
[2011,"SJRJ","Apolo","Varas","Junho",12949,9786,2763,657496]
[2011,"SJRJ","Apolo","Juizados","Junho",8804,11254,4232,156550]
[2011,"SJRJ","Apolo","Turmas Recursais","Junho",4598,5424,0,50412]
[2011,"SJRJ","Apolo","Varas","Julho",9161,10184,3727,656167]
[2011,"SJRJ","Apolo","Juizados","Julho",8383,10146,3865,155184]
[2011,"SJRJ","Apolo","Turmas Recursais","Julho",4720,4356,0,51514]
[2011,"SJRJ","Apolo","Varas","Agosto",8351,10977,3696,650804]
[2011,"SJRJ","Apolo","Juizados","Agosto",9984,12277,3700,154911]
[2011,"SJRJ","Apolo","Turmas Recursais","Agosto",4020,5065,0,52414]
[2011,"SJRJ","Apolo","Varas","Setembro",10634,9819,3471,648892]
[2011,"SJRJ","Apolo","Juizados","Setembro",8029,10626,4164,151400]
[2011,"SJRJ","Apolo","Turmas Recursais","Setembro",3955,5114,0,54271]
[2011,"SJRJ","Apolo","Varas","Outubro",7229,11634,2684,646771]
[2011,"SJRJ","Apolo","Juizados","Outubro",6176,10698,3706,146960]
[2011,"SJRJ","Apolo","Turmas Recursais","Outubro",4042,10704,0,55733]
[2011,"SJRJ","Apolo","Varas","Novembro",12257,8624,3009,647018]
[2011,"SJRJ","Apolo","Juizados","Novembro",6198,9118,3302,142911]
[2011,"SJRJ","Apolo","Turmas Recursais","Novembro",3143,4487,0,49977]
[2011,"SJRJ","Apolo","Varas","Dezembro",17867,5289,1646,642936]
[2011,"SJRJ","Apolo","Juizados","Dezembro",6155,5931,2056,141923]
[2011,"SJRJ","Apolo","Turmas Recursais","Dezembro",1864,2652,0,50069]
[2010,"SJES","Apolo","Varas","Janeiro",1946,1011,214,110483]
[2010,"SJES","Apolo","Juizados","Janeiro",893,903,196,29331]
[2010,"SJES","Apolo","Turmas Recursais","Janeiro",274,2,0,5457]
[2010,"SJES","Apolo","Varas","Fevereiro",1463,1159,443,110133]
[2010,"SJES","Apolo","Juizados","Fevereiro",822,900,145,29658]
[2010,"SJES","Apolo","Turmas Recursais","Fevereiro",164,84,0,5256]
[2010,"SJES","Apolo","Varas","Março",1548,1554,514,109678]
[2010,"SJES","Apolo","Juizados","Março",1664,1102,383,29715]
[2010,"SJES","Apolo","Turmas Recursais","Março",372,407,0,4642]
[2010,"SJES","Apolo","Varas","Abril",1928,1127,370,109496]
[2010,"SJES","Apolo","Juizados","Abril",1339,943,309,29889]
[2010,"SJES","Apolo","Turmas Recursais","Abril",318,327,0,4794]
[2010,"SJES","Apolo","Varas","Maio",1836,1781,325,109472]
[2010,"SJES","Apolo","Juizados","Maio",1281,1169,475,30085]
[2010,"SJES","Apolo","Turmas Recursais","Maio",417,248,0,4970]
[2010,"SJES","Apolo","Varas","Junho",1841,1409,462,109280]
[2010,"SJES","Apolo","Juizados","Junho",828,1043,293,30012]
[2010,"SJES","Apolo","Turmas Recursais","Junho",453,290,0,4746]
[2010,"SJES","Apolo","Varas","Julho",2234,1074,360,109979]
[2010,"SJES","Apolo","Juizados","Julho",1280,1365,459,29786]
[2010,"SJES","Apolo","Turmas Recursais","Julho",593,78,0,4940]
[2010,"SJES","Apolo","Varas","Agosto",2240,1339,304,110609]
[2010,"SJES","Apolo","Juizados","Agosto",1422,1643,435,29658]
[2010,"SJES","Apolo","Turmas Recursais","Agosto",429,407,0,5174]
[2010,"SJES","Apolo","Varas","Setembro",1751,1137,390,111026]
[2010,"SJES","Apolo","Juizados","Setembro",994,1246,486,29372]
[2010,"SJES","Apolo","Turmas Recursais","Setembro",531,527,0,5552]
[2010,"SJES","Apolo","Varas","Outubro",1814,1321,392,111504]
[2010,"SJES","Apolo","Juizados","Outubro",985,1173,478,29744]
[2010,"SJES","Apolo","Turmas Recursais","Outubro",511,295,0,5866]
[2010,"SJES","Apolo","Varas","Novembro",1438,1074,410,111385]
[2010,"SJES","Apolo","Juizados","Novembro",1281,1143,238,30075]
[2010,"SJES","Apolo","Turmas Recursais","Novembro",355,890,0,5904]
[2010,"SJES","Apolo","Varas","Dezembro",1048,669,214,111700]
[2010,"SJES","Apolo","Juizados","Dezembro",804,559,303,29945]
[2010,"SJES","Apolo","Turmas Recursais","Dezembro",228,631,0,6002]
[2010,"SJRJ","Apolo","Varas","Janeiro",9683,5470,2000,688635]
[2010,"SJRJ","Apolo","Juizados","Janeiro",6112,6679,3334,153036]
[2010,"SJRJ","Apolo","Turmas Recursais","Janeiro",3347,2730,0,58174]
[2010,"SJRJ","Apolo","Varas","Fevereiro",6842,6051,1931,688298]
[2010,"SJRJ","Apolo","Juizados","Fevereiro",6251,7329,2442,153108]
[2010,"SJRJ","Apolo","Turmas Recursais","Fevereiro",2290,3511,0,57263]
[2010,"SJRJ","Apolo","Varas","Março",10803,9939,2996,688216]
[2010,"SJRJ","Apolo","Juizados","Março",11535,10676,4559,153371]
[2010,"SJRJ","Apolo","Turmas Recursais","Março",4355,5144,0,58320]
[2010,"SJRJ","Apolo","Varas","Abril",6399,7862,2717,685192]
[2010,"SJRJ","Apolo","Juizados","Abril",10658,7166,2686,158386]
[2010,"SJRJ","Apolo","Turmas Recursais","Abril",2805,4023,0,54645]
[2010,"SJRJ","Apolo","Varas","Maio",7754,10647,2971,681223]
[2010,"SJRJ","Apolo","Juizados","Maio",11286,11329,3149,164155]
[2010,"SJRJ","Apolo","Turmas Recursais","Maio",3523,3029,0,48302]
[2010,"SJRJ","Apolo","Varas","Junho",9851,9700,3058,680065]
[2010,"SJRJ","Apolo","Juizados","Junho",9383,8340,2673,164131]
[2010,"SJRJ","Apolo","Turmas Recursais","Junho",2624,2824,0,46362]
[2010,"SJRJ","Apolo","Varas","Julho",8220,7107,3176,676773]
[2010,"SJRJ","Apolo","Juizados","Julho",10915,7420,3843,164898]
[2010,"SJRJ","Apolo","Turmas Recursais","Julho",4093,4245,0,46289]
[2010,"SJRJ","Apolo","Varas","Agosto",7340,10746,3824,672307]
[2010,"SJRJ","Apolo","Juizados","Agosto",12391,10846,4007,167841]
[2010,"SJRJ","Apolo","Turmas Recursais","Agosto",4002,4452,0,42530]
[2010,"SJRJ","Apolo","Varas","Setembro",6469,9537,3263,666460]
[2010,"SJRJ","Apolo","Juizados","Setembro",11400,10546,3524,168903]
[2010,"SJRJ","Apolo","Turmas Recursais","Setembro",3856,3311,0,42028]
[2010,"SJRJ","Apolo","Varas","Outubro",7678,8544,3415,662872]
[2010,"SJRJ","Apolo","Juizados","Outubro",9173,10193,3031,167691]
[2010,"SJRJ","Apolo","Turmas Recursais","Outubro",2918,4252,0,43201]
[2010,"SJRJ","Apolo","Varas","Novembro",7812,10941,3024,660408]
[2010,"SJRJ","Apolo","Juizados","Novembro",9334,9064,3548,164428]
[2010,"SJRJ","Apolo","Turmas Recursais","Novembro",2727,4210,0,43914]
[2010,"SJRJ","Apolo","Varas","Dezembro",15189,5341,2790,666379]
[2010,"SJRJ","Apolo","Juizados","Dezembro",7837,6240,2643,163916]
[2010,"SJRJ","Apolo","Turmas Recursais","Dezembro",2095,2374,0,43631]
[2009,"SJES","Apolo","Varas","Janeiro",2215,1139,181,105202]
[2009,"SJES","Apolo","Juizados","Janeiro",1625,804,261,28488]
[2009,"SJES","Apolo","Turmas Recursais","Janeiro",445,55,0,3722]
[2009,"SJES","Apolo","Varas","Fevereiro",1224,1132,333,105125]
[2009,"SJES","Apolo","Juizados","Fevereiro",1459,1157,327,28843]
[2009,"SJES","Apolo","Turmas Recursais","Fevereiro",254,266,0,3819]
[2009,"SJES","Apolo","Varas","Março",2426,1192,453,105399]
[2009,"SJES","Apolo","Juizados","Março",1476,896,514,29004]
[2009,"SJES","Apolo","Turmas Recursais","Março",300,449,0,3950]
[2009,"SJES","Apolo","Varas","Abril",1238,1011,297,105385]
[2009,"SJES","Apolo","Juizados","Abril",982,813,334,29432]
[2009,"SJES","Apolo","Turmas Recursais","Abril",488,571,0,4294]
[2009,"SJES","Apolo","Varas","Maio",1305,1260,485,104698]
[2009,"SJES","Apolo","Juizados","Maio",1190,1285,336,29109]
[2009,"SJES","Apolo","Turmas Recursais","Maio",239,296,0,4343]
[2009,"SJES","Apolo","Varas","Junho",2438,1139,288,105755]
[2009,"SJES","Apolo","Juizados","Junho",1352,1150,329,29340]
[2009,"SJES","Apolo","Turmas Recursais","Junho",404,363,0,4549]
[2009,"SJES","Apolo","Varas","Julho",3034,1345,425,107278]
[2009,"SJES","Apolo","Juizados","Julho",1183,1233,677,28912]
[2009,"SJES","Apolo","Turmas Recursais","Julho",396,502,0,4680]
[2009,"SJES","Apolo","Varas","Agosto",2080,1473,379,107741]
[2009,"SJES","Apolo","Juizados","Agosto",1044,1168,614,28669]
[2009,"SJES","Apolo","Turmas Recursais","Agosto",761,688,0,5287]
[2009,"SJES","Apolo","Varas","Setembro",1854,1168,453,107449]
[2009,"SJES","Apolo","Juizados","Setembro",1280,901,403,28320]
[2009,"SJES","Apolo","Turmas Recursais","Setembro",397,1421,0,5499]
[2009,"SJES","Apolo","Varas","Outubro",2487,1687,177,108760]
[2009,"SJES","Apolo","Juizados","Outubro",1337,649,368,28367]
[2009,"SJES","Apolo","Turmas Recursais","Outubro",489,806,0,5708]
[2009,"SJES","Apolo","Varas","Novembro",2353,1372,220,109713]
[2009,"SJES","Apolo","Juizados","Novembro",1093,866,330,28479]
[2009,"SJES","Apolo","Turmas Recursais","Novembro",267,841,0,5653]
[2009,"SJES","Apolo","Varas","Dezembro",1564,1072,238,110035]
[2009,"SJES","Apolo","Juizados","Dezembro",918,488,145,29148]
[2009,"SJES","Apolo","Turmas Recursais","Dezembro",211,277,0,5490]
[2009,"SJRJ","Apolo","Varas","Janeiro",11448,4599,1785,681696]
[2009,"SJRJ","Apolo","Juizados","Janeiro",12501,7747,3114,144900]
[2009,"SJRJ","Apolo","Turmas Recursais","Janeiro",3296,3625,0,47158]
[2009,"SJRJ","Apolo","Varas","Fevereiro",10439,5519,1603,686186]
[2009,"SJRJ","Apolo","Juizados","Fevereiro",9866,8968,3434,142716]
[2009,"SJRJ","Apolo","Turmas Recursais","Fevereiro",3385,3315,0,49500]
[2009,"SJRJ","Apolo","Varas","Março",11090,8089,2744,686307]
[2009,"SJRJ","Apolo","Juizados","Março",12490,11453,4474,139814]
[2009,"SJRJ","Apolo","Turmas Recursais","Março",4606,4848,0,52126]
[2009,"SJRJ","Apolo","Varas","Abril",7624,6579,2105,686031]
[2009,"SJRJ","Apolo","Juizados","Abril",11326,8695,2930,142407]
[2009,"SJRJ","Apolo","Turmas Recursais","Abril",2951,4454,0,52274]
[2009,"SJRJ","Apolo","Varas","Maio",9852,8742,2840,685247]
[2009,"SJRJ","Apolo","Juizados","Maio",13246,10647,3644,144176]
[2009,"SJRJ","Apolo","Turmas Recursais","Maio",3693,2772,0,53135]
[2009,"SJRJ","Apolo","Varas","Junho",9051,8349,3070,683588]
[2009,"SJRJ","Apolo","Juizados","Junho",12854,10990,3227,146701]
[2009,"SJRJ","Apolo","Turmas Recursais","Junho",3277,3369,0,54265]
[2009,"SJRJ","Apolo","Varas","Julho",10531,9448,2980,682854]
[2009,"SJRJ","Apolo","Juizados","Julho",14246,11120,4543,148761]
[2009,"SJRJ","Apolo","Turmas Recursais","Julho",4538,2423,0,55134]
[2009,"SJRJ","Apolo","Varas","Agosto",8937,8209,2836,680318]
[2009,"SJRJ","Apolo","Juizados","Agosto",12128,11956,4552,149877]
[2009,"SJRJ","Apolo","Turmas Recursais","Agosto",4527,4820,0,57103]
[2009,"SJRJ","Apolo","Varas","Setembro",9620,8692,2985,677638]
[2009,"SJRJ","Apolo","Juizados","Setembro",12286,12240,4536,150465]
[2009,"SJRJ","Apolo","Turmas Recursais","Setembro",5359,5480,0,58136]
[2009,"SJRJ","Apolo","Varas","Outubro",12127,8515,3005,680077]
[2009,"SJRJ","Apolo","Juizados","Outubro",9785,10690,5567,148903]
[2009,"SJRJ","Apolo","Turmas Recursais","Outubro",5322,4863,0,59065]
[2009,"SJRJ","Apolo","Varas","Novembro",11636,8251,2657,682241]
[2009,"SJRJ","Apolo","Juizados","Novembro",9680,7709,3885,149753]
[2009,"SJRJ","Apolo","Turmas Recursais","Novembro",3349,4888,0,58710]
[2009,"SJRJ","Apolo","Varas","Dezembro",10951,6024,2063,685069]
[2009,"SJRJ","Apolo","Juizados","Dezembro",9001,5521,2133,154408]
[2009,"SJRJ","Apolo","Turmas Recursais","Dezembro",2845,3057,0,58182]
[2008,"SJES","Apolo","Varas","Janeiro",2169,1111,421,100898]
[2008,"SJES","Apolo","Juizados","Janeiro",1153,1088,181,25611]
[2008,"SJES","Apolo","Turmas Recursais","Janeiro",269,138,0,2286]
[2008,"SJES","Apolo","Varas","Fevereiro",1209,1283,389,100356]
[2008,"SJES","Apolo","Juizados","Fevereiro",1057,788,225,25376]
[2008,"SJES","Apolo","Turmas Recursais","Fevereiro",256,164,0,2440]
[2008,"SJES","Apolo","Varas","Março",1230,1134,283,100471]
[2008,"SJES","Apolo","Juizados","Março",1311,992,158,25845]
[2008,"SJES","Apolo","Turmas Recursais","Março",97,234,0,2511]
[2008,"SJES","Apolo","Varas","Abril",1499,1193,315,100309]
[2008,"SJES","Apolo","Juizados","Abril",1419,969,315,25936]
[2008,"SJES","Apolo","Turmas Recursais","Abril",346,392,0,2721]
[2008,"SJES","Apolo","Varas","Maio",1562,1129,548,99971]
[2008,"SJES","Apolo","Juizados","Maio",1093,1038,402,26004]
[2008,"SJES","Apolo","Turmas Recursais","Maio",242,217,0,2434]
[2008,"SJES","Apolo","Varas","Junho",3029,1316,426,101588]
[2008,"SJES","Apolo","Juizados","Junho",1080,1456,284,26482]
[2008,"SJES","Apolo","Turmas Recursais","Junho",503,536,0,2595]
[2008,"SJES","Apolo","Varas","Julho",1735,1197,470,101662]
[2008,"SJES","Apolo","Juizados","Julho",1230,1209,382,26552]
[2008,"SJES","Apolo","Turmas Recursais","Julho",520,302,0,2883]
[2008,"SJES","Apolo","Varas","Agosto",1692,1540,385,101807]
[2008,"SJES","Apolo","Juizados","Agosto",1045,1180,307,26638]
[2008,"SJES","Apolo","Turmas Recursais","Agosto",273,210,0,2904]
[2008,"SJES","Apolo","Varas","Setembro",2114,1675,380,102431]
[2008,"SJES","Apolo","Juizados","Setembro",1285,1334,276,26862]
[2008,"SJES","Apolo","Turmas Recursais","Setembro",322,335,0,2904]
[2008,"SJES","Apolo","Varas","Outubro",1819,1205,303,102688]
[2008,"SJES","Apolo","Juizados","Outubro",1534,1285,330,26910]
[2008,"SJES","Apolo","Turmas Recursais","Outubro",390,333,0,3209]
[2008,"SJES","Apolo","Varas","Novembro",1962,1084,331,102912]
[2008,"SJES","Apolo","Juizados","Novembro",1530,1247,290,27327]
[2008,"SJES","Apolo","Turmas Recursais","Novembro",239,170,0,3269]
[2008,"SJES","Apolo","Varas","Dezembro",1914,716,198,103899]
[2008,"SJES","Apolo","Juizados","Dezembro",2045,1100,362,27972]
[2008,"SJES","Apolo","Turmas Recursais","Dezembro",168,141,0,3319]
[2008,"SJRJ","Apolo","Varas","Janeiro",10514,4921,1579,677034]
[2008,"SJRJ","Apolo","Juizados","Janeiro",9526,11885,3283,167292]
[2008,"SJRJ","Apolo","Turmas Recursais","Janeiro",3184,1817,0,16556]
[2008,"SJRJ","Apolo","Varas","Fevereiro",7560,5324,1219,677391]
[2008,"SJRJ","Apolo","Juizados","Fevereiro",8054,9034,3148,162552]
[2008,"SJRJ","Apolo","Turmas Recursais","Fevereiro",3322,1976,0,19049]
[2008,"SJRJ","Apolo","Varas","Março",8807,5485,1544,679102]
[2008,"SJRJ","Apolo","Juizados","Março",8730,9552,2622,162840]
[2008,"SJRJ","Apolo","Turmas Recursais","Março",2119,2613,0,18666]
[2008,"SJRJ","Apolo","Varas","Abril",8263,5956,1399,679741]
[2008,"SJRJ","Apolo","Juizados","Abril",10034,11087,2546,159880]
[2008,"SJRJ","Apolo","Turmas Recursais","Abril",2493,3710,0,18893]
[2008,"SJRJ","Apolo","Varas","Maio",8460,6209,2297,678637]
[2008,"SJRJ","Apolo","Juizados","Maio",10530,12551,3598,156376]
[2008,"SJRJ","Apolo","Turmas Recursais","Maio",3743,2956,0,20826]
[2008,"SJRJ","Apolo","Varas","Junho",8231,6085,2122,678241]
[2008,"SJRJ","Apolo","Juizados","Junho",11756,14013,5700,152036]
[2008,"SJRJ","Apolo","Turmas Recursais","Junho",5940,4340,0,25575]
[2008,"SJRJ","Apolo","Varas","Julho",10386,7573,2870,678434]
[2008,"SJRJ","Apolo","Juizados","Julho",11425,12525,6898,144994]
[2008,"SJRJ","Apolo","Turmas Recursais","Julho",7635,3872,0,31136]
[2008,"SJRJ","Apolo","Varas","Agosto",8462,6070,2321,677130]
[2008,"SJRJ","Apolo","Juizados","Agosto",11607,10619,6613,141003]
[2008,"SJRJ","Apolo","Turmas Recursais","Agosto",6752,7533,0,36103]
[2008,"SJRJ","Apolo","Varas","Setembro",9619,6681,2404,676325]
[2008,"SJRJ","Apolo","Juizados","Setembro",12265,13553,4775,137048]
[2008,"SJRJ","Apolo","Turmas Recursais","Setembro",5022,7011,0,38976]
[2008,"SJRJ","Apolo","Varas","Outubro",8554,7431,2448,675292]
[2008,"SJRJ","Apolo","Juizados","Outubro",12524,10952,5471,133967]
[2008,"SJRJ","Apolo","Turmas Recursais","Outubro",5510,9707,0,42660]
[2008,"SJRJ","Apolo","Varas","Novembro",7491,6270,2348,674286]
[2008,"SJRJ","Apolo","Juizados","Novembro",12653,9752,3531,134426]
[2008,"SJRJ","Apolo","Turmas Recursais","Novembro",3658,4805,0,44363]
[2008,"SJRJ","Apolo","Varas","Dezembro",11214,4577,1659,677417]
[2008,"SJRJ","Apolo","Juizados","Dezembro",18592,8389,2672,143213]
[2008,"SJRJ","Apolo","Turmas Recursais","Dezembro",2645,3749,0,45288]
[2007,"SJES","Apolo","Varas","Janeiro",1364,1097,286,101013]
[2007,"SJES","Apolo","Juizados","Janeiro",847,757,203,16511]
[2007,"SJES","Apolo","Turmas Recursais","Janeiro",67,435,0,3409]
[2007,"SJES","Apolo","Varas","Fevereiro",984,980,339,100037]
[2007,"SJES","Apolo","Juizados","Fevereiro",806,524,354,15920]
[2007,"SJES","Apolo","Turmas Recursais","Fevereiro",331,172,0,3472]
[2007,"SJES","Apolo","Varas","Março",1586,1254,421,99297]
[2007,"SJES","Apolo","Juizados","Março",1162,733,397,15924]
[2007,"SJES","Apolo","Turmas Recursais","Março",542,340,0,3742]
[2007,"SJES","Apolo","Varas","Abril",2312,1059,314,99862]
[2007,"SJES","Apolo","Juizados","Abril",1236,592,215,16377]
[2007,"SJES","Apolo","Turmas Recursais","Abril",221,340,0,3690]
[2007,"SJES","Apolo","Varas","Maio",2247,1383,368,99931]
[2007,"SJES","Apolo","Juizados","Maio",2146,1172,239,17666]
[2007,"SJES","Apolo","Turmas Recursais","Maio",240,565,0,3527]
[2007,"SJES","Apolo","Varas","Junho",2061,1147,393,100525]
[2007,"SJES","Apolo","Juizados","Junho",4383,802,186,20825]
[2007,"SJES","Apolo","Turmas Recursais","Junho",210,1023,0,3645]
[2007,"SJES","Apolo","Varas","Julho",2584,1229,393,100971]
[2007,"SJES","Apolo","Juizados","Julho",2836,770,226,22723]
[2007,"SJES","Apolo","Turmas Recursais","Julho",298,207,0,3244]
[2007,"SJES","Apolo","Varas","Agosto",1920,1685,483,100843]
[2007,"SJES","Apolo","Juizados","Agosto",2277,927,244,23747]
[2007,"SJES","Apolo","Turmas Recursais","Agosto",290,550,0,2784]
[2007,"SJES","Apolo","Varas","Setembro",1437,1115,363,100343]
[2007,"SJES","Apolo","Juizados","Setembro",1509,685,139,24168]
[2007,"SJES","Apolo","Turmas Recursais","Setembro",146,580,0,2679]
[2007,"SJES","Apolo","Varas","Outubro",1725,1424,630,99935]
[2007,"SJES","Apolo","Juizados","Outubro",1690,945,254,24582]
[2007,"SJES","Apolo","Turmas Recursais","Outubro",286,457,0,2521]
[2007,"SJES","Apolo","Varas","Novembro",1305,1163,424,99727]
[2007,"SJES","Apolo","Juizados","Novembro",1064,643,152,25066]
[2007,"SJES","Apolo","Turmas Recursais","Novembro",120,336,0,2373]
[2007,"SJES","Apolo","Varas","Dezembro",1331,675,303,100047]
[2007,"SJES","Apolo","Juizados","Dezembro",1036,787,144,25345]
[2007,"SJES","Apolo","Turmas Recursais","Dezembro",143,159,0,2261]
[2007,"SJRJ","Apolo","Varas","Janeiro",6872,4533,1806,642091]
[2007,"SJRJ","Apolo","Juizados","Janeiro",9590,8092,2357,142168]
[2007,"SJRJ","Apolo","Turmas Recursais","Janeiro",2600,3740,0,21121]
[2007,"SJRJ","Apolo","Varas","Fevereiro",5893,5440,1839,640605]
[2007,"SJRJ","Apolo","Juizados","Fevereiro",9087,10713,2126,139000]
[2007,"SJRJ","Apolo","Turmas Recursais","Fevereiro",2162,4312,0,21470]
[2007,"SJRJ","Apolo","Varas","Março",12057,7367,2222,642568]
[2007,"SJRJ","Apolo","Juizados","Março",10426,14433,3225,132559]
[2007,"SJRJ","Apolo","Turmas Recursais","Março",3332,4241,0,21838]
[2007,"SJRJ","Apolo","Varas","Abril",8373,5822,1770,642997]
[2007,"SJRJ","Apolo","Juizados","Abril",8938,8532,2449,128295]
[2007,"SJRJ","Apolo","Turmas Recursais","Abril",2259,4371,0,20651]
[2007,"SJRJ","Apolo","Varas","Maio",12728,7054,2441,644920]
[2007,"SJRJ","Apolo","Juizados","Maio",13073,12134,2910,128732]
[2007,"SJRJ","Apolo","Turmas Recursais","Maio",2992,4546,0,19410]
[2007,"SJRJ","Apolo","Varas","Junho",14388,6661,1990,650270]
[2007,"SJRJ","Apolo","Juizados","Junho",34281,9172,2289,152738]
[2007,"SJRJ","Apolo","Turmas Recursais","Junho",2536,3608,0,18901]
[2007,"SJRJ","Apolo","Varas","Julho",14253,6907,2174,654556]
[2007,"SJRJ","Apolo","Juizados","Julho",30703,12379,1895,169240]
[2007,"SJRJ","Apolo","Turmas Recursais","Julho",1902,2083,0,17556]
[2007,"SJRJ","Apolo","Varas","Agosto",10312,6939,2496,655776]
[2007,"SJRJ","Apolo","Juizados","Agosto",30220,15974,1773,182969]
[2007,"SJRJ","Apolo","Turmas Recursais","Agosto",1964,4142,0,16536]
[2007,"SJRJ","Apolo","Varas","Setembro",9235,6156,1951,656325]
[2007,"SJRJ","Apolo","Juizados","Setembro",19151,16254,2295,182980]
[2007,"SJRJ","Apolo","Turmas Recursais","Setembro",2449,2277,0,15732]
[2007,"SJRJ","Apolo","Varas","Outubro",19289,6541,2612,665069]
[2007,"SJRJ","Apolo","Juizados","Outubro",15662,19232,2447,177735]
[2007,"SJRJ","Apolo","Turmas Recursais","Outubro",2667,3162,0,14775]
[2007,"SJRJ","Apolo","Varas","Novembro",9533,5585,2013,666627]
[2007,"SJRJ","Apolo","Juizados","Novembro",9153,13036,2082,173743]
[2007,"SJRJ","Apolo","Turmas Recursais","Novembro",2378,2133,0,14729]
[2007,"SJRJ","Apolo","Varas","Dezembro",11996,3812,1273,672198]
[2007,"SJRJ","Apolo","Juizados","Dezembro",9285,10115,2141,171510]
[2007,"SJRJ","Apolo","Turmas Recursais","Dezembro",2340,1232,0,15098]
[2006,"SJES","Apolo","Varas","Janeiro",1621,725,124,105994]
[2006,"SJES","Apolo","Juizados","Janeiro",718,2309,269,19223]
[2006,"SJES","Apolo","Turmas Recursais","Janeiro",704,9,0,2746]
[2006,"SJES","Apolo","Varas","Fevereiro",1673,1135,248,106356]
[2006,"SJES","Apolo","Juizados","Fevereiro",692,1522,403,18504]
[2006,"SJES","Apolo","Turmas Recursais","Fevereiro",233,459,0,2777]
[2006,"SJES","Apolo","Varas","Março",1577,1259,650,105597]
[2006,"SJES","Apolo","Juizados","Março",1025,1064,267,17474]
[2006,"SJES","Apolo","Turmas Recursais","Março",176,477,0,2890]
[2006,"SJES","Apolo","Varas","Abril",888,1208,207,105186]
[2006,"SJES","Apolo","Juizados","Abril",806,1058,238,17096]
[2006,"SJES","Apolo","Turmas Recursais","Abril",352,285,0,3160]
[2006,"SJES","Apolo","Varas","Maio",1321,1945,415,104469]
[2006,"SJES","Apolo","Juizados","Maio",1194,970,271,17061]
[2006,"SJES","Apolo","Turmas Recursais","Maio",337,360,0,3212]
[2006,"SJES","Apolo","Varas","Junho",1565,1358,225,103710]
[2006,"SJES","Apolo","Juizados","Junho",1258,1341,215,17215]
[2006,"SJES","Apolo","Turmas Recursais","Junho",215,188,0,3283]
[2006,"SJES","Apolo","Varas","Julho",1807,1494,326,103908]
[2006,"SJES","Apolo","Juizados","Julho",1355,920,317,17217]
[2006,"SJES","Apolo","Turmas Recursais","Julho",249,249,0,3389]
[2006,"SJES","Apolo","Varas","Agosto",1463,1453,424,102587]
[2006,"SJES","Apolo","Juizados","Agosto",1415,1167,293,17574]
[2006,"SJES","Apolo","Turmas Recursais","Agosto",326,789,0,3361]
[2006,"SJES","Apolo","Varas","Setembro",1328,1126,443,101998]
[2006,"SJES","Apolo","Juizados","Setembro",1079,1068,358,17175]
[2006,"SJES","Apolo","Turmas Recursais","Setembro",285,282,0,3295]
[2006,"SJES","Apolo","Varas","Outubro",1211,1414,712,101305]
[2006,"SJES","Apolo","Juizados","Outubro",1023,1201,344,16681]
[2006,"SJES","Apolo","Turmas Recursais","Outubro",323,405,0,3370]
[2006,"SJES","Apolo","Varas","Novembro",1211,1222,364,100958]
[2006,"SJES","Apolo","Juizados","Novembro",963,771,353,16393]
[2006,"SJES","Apolo","Turmas Recursais","Novembro",390,585,0,3539]
[2006,"SJES","Apolo","Varas","Dezembro",1431,679,288,101158]
[2006,"SJES","Apolo","Juizados","Dezembro",781,800,181,16435]
[2006,"SJES","Apolo","Turmas Recursais","Dezembro",242,230,0,3493]
[2006,"SJRJ","Apolo","Varas","Janeiro",5973,3876,968,612825]
[2006,"SJRJ","Apolo","Juizados","Janeiro",31624,35000,1896,201587]
[2006,"SJRJ","Apolo","Turmas Recursais","Janeiro",2001,971,0,14817]
[2006,"SJRJ","Apolo","Varas","Fevereiro",8382,5192,1679,613446]
[2006,"SJRJ","Apolo","Juizados","Fevereiro",35380,26927,2177,200649]
[2006,"SJRJ","Apolo","Turmas Recursais","Fevereiro",1734,1820,0,15218]
[2006,"SJRJ","Apolo","Varas","Março",19861,6374,2151,624819]
[2006,"SJRJ","Apolo","Juizados","Março",17214,18972,2641,192977]
[2006,"SJRJ","Apolo","Turmas Recursais","Março",2994,1836,0,14959]
[2006,"SJRJ","Apolo","Varas","Abril",14122,4622,1503,613525]
[2006,"SJRJ","Apolo","Juizados","Abril",12297,13732,2466,188856]
[2006,"SJRJ","Apolo","Turmas Recursais","Abril",2133,1586,0,15282]
[2006,"SJRJ","Apolo","Varas","Maio",15131,6836,1726,637767]
[2006,"SJRJ","Apolo","Juizados","Maio",13731,19031,3350,182423]
[2006,"SJRJ","Apolo","Turmas Recursais","Maio",3508,2205,0,16353]
[2006,"SJRJ","Apolo","Varas","Junho",11389,5624,1609,642194]
[2006,"SJRJ","Apolo","Juizados","Junho",11736,14080,2504,178191]
[2006,"SJRJ","Apolo","Turmas Recursais","Junho",2758,1680,0,17303]
[2006,"SJRJ","Apolo","Varas","Julho",9270,6368,1741,644140]
[2006,"SJRJ","Apolo","Juizados","Julho",11236,14777,2659,172751]
[2006,"SJRJ","Apolo","Turmas Recursais","Julho",2528,2204,0,17171]
[2006,"SJRJ","Apolo","Varas","Agosto",10454,7687,2471,643603]
[2006,"SJRJ","Apolo","Juizados","Agosto",11188,15716,3506,163206]
[2006,"SJRJ","Apolo","Turmas Recursais","Agosto",3096,3005,0,17851]
[2006,"SJRJ","Apolo","Varas","Setembro",9017,6016,2287,643989]
[2006,"SJRJ","Apolo","Juizados","Setembro",11307,12647,3184,157252]
[2006,"SJRJ","Apolo","Turmas Recursais","Setembro",3163,2995,0,18765]
[2006,"SJRJ","Apolo","Varas","Outubro",8030,7901,2446,641538]
[2006,"SJRJ","Apolo","Juizados","Outubro",10952,13230,3755,149414]
[2006,"SJRJ","Apolo","Turmas Recursais","Outubro",3918,3157,0,19469]
[2006,"SJRJ","Apolo","Varas","Novembro",6670,5981,2286,639676]
[2006,"SJRJ","Apolo","Juizados","Novembro",10337,10682,2784,143680]
[2006,"SJRJ","Apolo","Turmas Recursais","Novembro",2850,3791,0,20112]
[2006,"SJRJ","Apolo","Varas","Dezembro",9414,4089,1634,642234]
[2006,"SJRJ","Apolo","Juizados","Dezembro",10584,6828,1922,143456]
[2006,"SJRJ","Apolo","Turmas Recursais","Dezembro",1899,1926,0,20495]