{"text_format":"1","workbook":"xlsx","n_sheets":18,"sheets":["Plan1","TD","PaMT","GTDJaMS","GTvM2B","GTvM3B18","GDaM2B","GDaM3B18","GJaM2B","GJaM3B18","PvAT","GP3AT","GTvAT","GDvAT","GJvAT","TA","Dados","DadosTD"],"not_rendered":{"charts":51,"images":21,"macros":1,"external_links":0,"defined_names":35,"comments":1,"pivot_tables":1},"unopened":[],"bounds":{"document_bytes":16777216,"sheet_cells":100000,"rows_first":2000,"rows_last":500,"rows_between":2000,"halvings":0,"cell_chars":16384,"cell_head_chars":4096},"cells_cut":0,"cells_raw":0,"read":"whole","date_system":"1900"}

{"sheet":"Plan1","index":0,"n_rows":8,"n_cols":2,"rows_kept":8,"cut":false,"hidden":false,"merged":[[5,1,5,12],[7,1,7,12]]}
[]
[]
[]
[]
[]
[null,"Se for apresentado um Aviso de Segurança dizendo que  \"As macros foram desabilitadas.\" :\n  Clique em Opções e a seguir clicar na opção Habilitar este conteúdo."]
[]
[null,"Para melhor visualização deste Painel Dashboards, em qualquer Tabela ou Gráfico, pode-se utilizar o recurso de:\nPressionar a tecla Ctrl + Roda de Rolagem do mouse (Botão Scroll), ajustando para cima ou para baixo."]

{"sheet":"TD","index":1,"n_rows":47,"n_cols":13,"rows_kept":47,"cut":false,"hidden":true,"merged":[[3,9,3,14],[4,9,4,14],[6,9,7,14],[23,9,23,14],[25,9,25,11],[8,9,8,14],[45,1,45,9],[46,1,46,9],[40,9,40,14],[41,9,41,14],[42,9,42,14],[42,1,42,8],[44,1,44,9]]}
[null,"Ano",2019]
[]
[null,null,"Valores"]
[null,"Mês","1ª Distribuição no TRF\n(A)","Distribuídos por Migração\n(M)","Distribuídos por Virtualização\n(V)"," Total Distribuídos (A+M+V)","Julgados\n(TJI)","Saldo Atual\n(TRAM)","Tramitação Ajustada\n(TA)","Mapa Geral Judicial do TRF2R"]
[null,"Janeiro",3692,0,7,3699,2301,83228,76954,"Orientações para a utilização da \"Tabela Dinâmica\"."]
[null,"Eproc",1464,0,0,1464,86,5594,5587]
[null,"Apolo",2228,0,7,2235,2215,77634,71367,"No campo de filtro \"Ano\" da tabela ao lado, dentre as opções:"]
[null,"Fevereiro",3975,0,23,3998,6878,82672,75983]
[null,"Eproc",2070,0,0,2070,368,7517,7502,"    Selecione um \"Ano\" :"]
[null,"Apolo",1905,0,23,1928,6510,75155,68481]
[null,"Março",2914,0,15,2929,3994,81060,73895]
[null,"Eproc",1711,0,0,1711,327,9051,9035]
[null,"Apolo",1203,0,15,1218,3667,72009,64860]
[null,"Abril",3553,0,15,3568,4867,82691,75495]
[null,"Eproc",2261,0,0,2261,540,11181,11162]
[null,"Apolo",1292,0,15,1307,4327,71510,64333]
[null,"Maio",4609,0,15,4624,5675,82595,75095]
[null,"Eproc",3218,0,0,3218,601,13949,13919]
[null,"Apolo",1391,0,15,1406,5074,68646,61176]
[null,"Junho",3716,0,9,3725,6077,83074,75409]
[null,"Eproc",2876,0,0,2876,822,16463,16417]
[null,"Apolo",840,0,9,849,5255,66611,58992]
[null,"Julho",4705,0,11,4716,6602,83762,75599]
[null,"Eproc",3792,0,0,3792,1590,19629,19571,"Nos campos de coluna \"Mês e Base\"  da tabela ao lado, dentre as opções:"]
[null,"Apolo",913,0,11,924,5012,64133,56028]
[null,"Agosto",4667,0,23,4690,5867,83971,75342,"     Selecione um \"Mês\" :",null,null,"Selecione uma \"Base de Dados\" :"]
[null,"Eproc",3935,0,0,3935,1757,22759,22681]
[null,"Apolo",732,0,23,755,4110,61212,52661]
[null,"Setembro",4597,0,13,4610,6597,84161,75121]
[null,"Eproc",4039,0,0,4039,2270,25722,25586]
[null,"Apolo",558,0,13,571,4327,58439,49535]
[null,"Outubro",4691,0,14,4705,6535,83961,74760]
[null,"Eproc",4139,0,0,4139,2992,28482,28257]
[null,"Apolo",552,0,14,566,3543,55479,46503]
[null,"Novembro",3874,2,17,3893,6407,83911,74078]
[null,"Eproc",3517,2,0,3519,2839,30663,30373]
[null,"Apolo",357,0,17,374,3568,53248,43705]
[null,"Dezembro",2880,0,10,2890,6253,83221,73260]
[null,"Eproc",2598,0,0,2598,2907,31489,31131]
[null,"Apolo",282,0,10,292,3346,51732,42129]
[null,"Total geral",47873,2,172,48047,68053,998307,900991,"  Obs. 1: (TRAM) = Tramitação de Processos no Final do Período (final do Mês)."]
[null,null,null,null,null,null,null,null,null,"  Obs. 2: (TA) Eproc e Apolo = TRAM - O (Suspensos)."]
[null,"OBS.: Os valores poderão ser alterados, em função de modificações na base de dados, por parte do usuário.",null,null,null,null,null,null,null,"  Obs. 3: (TA) Siapro = TRAM - O (Suspensos) - P (Aguardando Julg do Agravo)."]
[]
[null,"_ Desde DEZ/2013, o sistema processual \"Apolo\" está em funcionamento no Tribunal."]
[null,"_ Na semana de 19 a 23/03/2018, iniciou-se a Migração de TODOS os processos do sistema Siapro para o sistema Apolo."]
[null,"_ Desde o dia 27 de Abril de 2018, o NOVO sistema processual \"Eproc\" está em funcionamento no Tribunal, descontinuando o sistema Apolo."]

{"sheet":"PaMT","index":2,"n_rows":59,"n_cols":42,"rows_kept":59,"cut":false,"hidden":true,"merged":[[7,7,8,7],[7,8,8,8],[7,13,8,13],[7,11,8,11],[7,12,8,12],[7,9,8,9],[57,0,57,16],[58,0,58,16],[6,3,6,4],[7,10,8,10],[18,1,19,1],[12,1,13,1],[15,1,16,1],[6,5,6,8],[5,9,6,10],[7,2,8,2],[7,3,8,3],[7,4,8,4],[7,14,8,14],[7,15,8,15],[7,5,8,5],[53,0,53,16],[56,0,56,16],[0,1,2,5],[0,12,2,14],[48,1,50,1],[36,1,37,1],[21,1,22,1],[24,1,25,1],[27,1,28,1],[30,1,31,1],[33,1,34,1],[39,1,40,1],[42,1,43,1],[45,1,46,1],[4,4,4,5],[54,0,54,16],[7,6,8,6]]}
[]
[]
[]
[]
[null,"Ano",null,null,"Tipo Processo",null,"Judicial"]
[null,null,null,null,null,null,null,null,null,"Total de Distribuídos\nnas Bases de Dados"]
[null,null,null,"(*) 1ª Distribuição no TRF",null,"(*) Distribuídos para o Apolo (Origem: Sistema Siapro)"]
[null,null,"Base de Dados do Processo","(A)","Acum.\nMensal","Por Migração (M)","Acum.\nMensal","Por Virtualização (V)","Acum.\nMensal","(A)+(M)+(V)","Acum.\nMensal","Julgados\n(TJI)","Acum.\nMensal","Saldo Atual\n(TRAM)","% Variação Mensal da\nTramitação","(*) Tram. Ajustada\n(TA)"]
[null,"Mês"]
[null,"Dezembro","Siapro",{"$f":"VLOOKUP(TA!$C$20&$B10,Dados!$A$2:$K$171,4,0)","v":1256},{"$f":"VLOOKUP(TA!$C$20&$B10,Dados!$A$2:$L$171,12,0)","v":4244},null,null,null,null,{"$f":"D10+F10+H10","v":1256},4244,{"$f":"VLOOKUP(TA!$C$20&$B10,Dados!$A$2:$K$171,5,0)","v":254},{"$f":"VLOOKUP(TA!$C$20&$B10,Dados!$A$2:$M$171,13,0)","v":480},{"$f":"VLOOKUP(TA!$C$20&$B10,Dados!$A$2:$K$171,6,0)","v":4154},null,{"$f":"VLOOKUP(TA!$C$20&$B10,Dados!$A$2:$K$171,7,0)","v":4149}]
[null,null,"Apolo",{"$f":"VLOOKUP(TA!$C$20&$B10,Dados!$A$2:$K$171,8,0)","v":2099},{"$f":"VLOOKUP(TA!$C$20&$B10,Dados!$A$2:$N$171,14,0)","v":36881},{"$f":"VLOOKUP(TA!$C$20&$B10,Dados!$A$2:$P$171,16,0)","v":0},{"$f":"VLOOKUP(TA!$C$20&$B10,Dados!$A$2:$Q$171,17,0)","v":7984},{"$f":"VLOOKUP(TA!$C$20&$B10,Dados!$A$2:$R$171,18,0)","v":14},{"$f":"VLOOKUP(TA!$C$20&$B10,Dados!$A$2:$S$171,19,0)","v":540},2113,45405,{"$f":"VLOOKUP(TA!$C$20&$B10,Dados!$A$2:$K$171,9,0)","v":4177},{"$f":"VLOOKUP(TA!$C$20&$B10,Dados!$A$2:$O$171,15,0)","v":64352},{"$f":"VLOOKUP(TA!$C$20&$B10,Dados!$A$2:$K$171,10,0)","v":77849},null,{"$f":"VLOOKUP(TA!$C$20&$B10,Dados!$A$2:$K$171,11,0)","v":71773}]
[null,"Total",null,{"$f":"D10+D11","v":3355},41125,0,7984,14,540,3369,49649,{"$f":"L10+L11","v":4431},{"$f":"M10+M11","v":64832},{"$f":"N10+N11","v":82003},null,{"$f":"P10+P11","v":75922}]
[null,"Janeiro",{"$f":"TA!$D$20","v":"Eproc"},{"$f":"VLOOKUP(TA!$A$20&$B13,Dados!$A$2:$K$171,4,0)","v":1464},{"$f":"VLOOKUP(TA!$A$20&$B13,Dados!$A$2:$L$171,12,0)","v":1464},null,null,null,null,{"$f":"D13+F13+H13","v":1464},{"$f":"E13+G13+I13","v":1464},{"$f":"VLOOKUP(TA!$A$20&$B13,Dados!$A$2:$K$171,5,0)","v":86},{"$f":"VLOOKUP(TA!$A$20&$B13,Dados!$A$2:$M$171,13,0)","v":86},{"$f":"VLOOKUP(TA!$A$20&$B13,Dados!$A$2:$K$171,6,0)","v":5594},{"$f":"IF($N13=0,\"\",($N13/$N10)-1)","v":0.34665382763601338},{"$f":"VLOOKUP(TA!$A$20&$B13,Dados!$A$2:$K$171,7,0)","v":5587},null,null,null,null,null,null,null,null,null,null,null,null,null,null,null,null,null,null,null,"S",null,null,null,null,"e"]
[null,null,"Apolo",{"$f":"VLOOKUP(TA!$A$20&$B13,Dados!$A$2:$K$171,8,0)","v":2228},{"$f":"VLOOKUP(TA!$A$20&$B13,Dados!$A$2:$N$171,14,0)","v":2228},{"$f":"VLOOKUP(TA!$A$20&$B13,Dados!$A$2:$P$171,16,0)","v":0},{"$f":"VLOOKUP(TA!$A$20&$B13,Dados!$A$2:$Q$171,17,0)","v":0},{"$f":"VLOOKUP(TA!$A$20&$B13,Dados!$A$2:$R$171,18,0)","v":7},{"$f":"VLOOKUP(TA!$A$20&$B13,Dados!$A$2:$S$171,19,0)","v":7},{"$f":"D14+F14+H14","v":2235},{"$f":"E14+G14+I14","v":2235},{"$f":"VLOOKUP(TA!$A$20&$B13,Dados!$A$2:$K$171,9,0)","v":2215},{"$f":"VLOOKUP(TA!$A$20&$B13,Dados!$A$2:$O$171,15,0)","v":2215},{"$f":"VLOOKUP(TA!$A$20&$B13,Dados!$A$2:$K$171,10,0)","v":77634},{"$f":"IF($N11=0,\"\",($N14/$N11)-1)","v":-2.7617567341905458E-3},{"$f":"VLOOKUP(TA!$A$20&$B13,Dados!$A$2:$K$171,11,0)","v":71367},null,null,null,null,null,null,null,null,null,null,null,null,null,null,null,null,null,null,null,"0","4jd",null,null,null,"0",1]
[null,"Total",null,{"$f":"D13+D14","v":3692},{"$f":"E13+E14","v":3692},0,0,7,7,{"$f":"D15+F15+H15","v":3699},{"$f":"E15+G15+I15","v":3699},{"$f":"L13+L14","v":2301},{"$f":"M13+M14","v":2301},{"$f":"N13+N14","v":83228},{"$f":"IF($N15=0,\"\",($N15/$N12)-1)","v":1.4938477860566124E-2},{"$f":"P13+P14","v":76954},null,null,null,null,null,null,null,null,null,null,null,null,null,null,null,null,null,null,null,"0",null,null,null,null,"0"]
[null,"Fevereiro",{"$f":"TA!$D$20","v":"Eproc"},{"$f":"VLOOKUP(TA!$A$20&$B16,Dados!$A$2:$K$171,4,0)","v":2070},{"$f":"VLOOKUP(TA!$A$20&$B16,Dados!$A$2:$L$171,12,0)","v":3534},null,null,null,null,2070,{"$f":"E16+G16+I16","v":3534},{"$f":"VLOOKUP(TA!$A$20&$B16,Dados!$A$2:$K$171,5,0)","v":368},{"$f":"VLOOKUP(TA!$A$20&$B16,Dados!$A$2:$M$171,13,0)","v":454},{"$f":"VLOOKUP(TA!$A$20&$B16,Dados!$A$2:$K$171,6,0)","v":7517},{"$f":"IF($N16=0,\"\",($N16/$N13)-1)","v":0.3437611726850196},{"$f":"VLOOKUP(TA!$A$20&$B16,Dados!$A$2:$K$171,7,0)","v":7502},null,null,null,null,null,null,null,null,null,null,null,null,null,null,null,null,null,null,null,"0",null,null,null,null,"0"]
[null,null,"Apolo",{"$f":"VLOOKUP(TA!$A$20&$B16,Dados!$A$2:$K$171,8,0)","v":1905},{"$f":"VLOOKUP(TA!$A$20&$B16,Dados!$A$2:$N$171,14,0)","v":4133},{"$f":"VLOOKUP(TA!$A$20&$B16,Dados!$A$2:$P$171,16,0)","v":0},{"$f":"VLOOKUP(TA!$A$20&$B16,Dados!$A$2:$Q$171,17,0)","v":0},{"$f":"VLOOKUP(TA!$A$20&$B16,Dados!$A$2:$R$171,18,0)","v":23},{"$f":"VLOOKUP(TA!$A$20&$B16,Dados!$A$2:$S$171,19,0)","v":30},1928,4163,{"$f":"VLOOKUP(TA!$A$20&$B16,Dados!$A$2:$K$171,9,0)","v":6510},{"$f":"VLOOKUP(TA!$A$20&$B16,Dados!$A$2:$O$171,15,0)","v":8725},{"$f":"VLOOKUP(TA!$A$20&$B16,Dados!$A$2:$K$171,10,0)","v":75155},{"$f":"IF($N17=0,\"\",IF($N14=0,\"\",($N17/$N14)-1))","v":-3.1931885514078884E-2},{"$f":"VLOOKUP(TA!$A$20&$B16,Dados!$A$2:$K$171,11,0)","v":68481},null,null,null,null,null,null,null,null,null,null,null,null,null,null,null,null,null,null,null,"0",null,null,null,null,"0"]
[null,"Total",null,{"$f":"D16+D17","v":3975},{"$f":"E16+E17","v":7667},0,0,23,30,3998,7697,{"$f":"L16+L17","v":6878},{"$f":"M16+M17","v":9179},{"$f":"N16+N17","v":82672},{"$f":"IF($N18=0,\"\",($N18/$N15)-1)","v":-6.6804440813187371E-3},{"$f":"P16+P17","v":75983},null,null,null,null,null,null,null,null,null,null,null,null,null,null,null,null,null,null,null,"0",null,null,null,null,"0"]
[null,"Março",{"$f":"TA!$D$20","v":"Eproc"},{"$f":"VLOOKUP(TA!$A$20&$B19,Dados!$A$2:$K$171,4,0)","v":1711},{"$f":"VLOOKUP(TA!$A$20&$B19,Dados!$A$2:$L$171,12,0)","v":5245},null,null,null,null,1711,5245,{"$f":"VLOOKUP(TA!$A$20&$B19,Dados!$A$2:$K$171,5,0)","v":327},{"$f":"VLOOKUP(TA!$A$20&$B19,Dados!$A$2:$M$171,13,0)","v":781},{"$f":"VLOOKUP(TA!$A$20&$B19,Dados!$A$2:$K$171,6,0)","v":9051},{"$f":"IF($N19=0,\"\",($N19/$N16)-1)","v":0.20407077291472664},{"$f":"VLOOKUP(TA!$A$20&$B19,Dados!$A$2:$K$171,7,0)","v":9035},null,null,null,null,null,null,null,null,null,null,null,null,null,null,null,null,null,null,null,"0",null,null,null,null,"0"]
[null,null,"Apolo",{"$f":"VLOOKUP(TA!$A$20&$B19,Dados!$A$2:$K$171,8,0)","v":1203},{"$f":"VLOOKUP(TA!$A$20&$B19,Dados!$A$2:$N$171,14,0)","v":5336},{"$f":"VLOOKUP(TA!$A$20&$B19,Dados!$A$2:$P$171,16,0)","v":0},{"$f":"VLOOKUP(TA!$A$20&$B19,Dados!$A$2:$Q$171,17,0)","v":0},{"$f":"VLOOKUP(TA!$A$20&$B19,Dados!$A$2:$R$171,18,0)","v":15},{"$f":"VLOOKUP(TA!$A$20&$B19,Dados!$A$2:$S$171,19,0)","v":45},1218,5381,{"$f":"VLOOKUP(TA!$A$20&$B19,Dados!$A$2:$K$171,9,0)","v":3667},{"$f":"VLOOKUP(TA!$A$20&$B19,Dados!$A$2:$O$171,15,0)","v":12392},{"$f":"VLOOKUP(TA!$A$20&$B19,Dados!$A$2:$K$171,10,0)","v":72009},{"$f":"IF($N20=0,\"\",IF($N17=0,\"\",($N20/$N17)-1))","v":-4.1860155678264954E-2},{"$f":"VLOOKUP(TA!$A$20&$B19,Dados!$A$2:$K$171,11,0)","v":64860},null,null,null,null,null,null,null,null,null,null,null,null,null,null,null,null,null,null,null,"0"]
[null,"Total",null,{"$f":"D19+D20","v":2914},{"$f":"E19+E20","v":10581},0,0,15,45,2929,10626,{"$f":"L19+L20","v":3994},{"$f":"M19+M20","v":13173},{"$f":"N19+N20","v":81060},{"$f":"IF($N21=0,\"\",($N21/$N18)-1)","v":-1.9498742016644033E-2},{"$f":"P19+P20","v":73895},null,null,null,null,null,null,null,null,null,null,null,null,null,null,null,null,null,null,null,"0"]
[null,"Abril",{"$f":"TA!$D$19","v":"Eproc"},{"$f":"VLOOKUP(TA!$A$20&$B22,Dados!$A$2:$K$171,4,0)","v":2261},{"$f":"VLOOKUP(TA!$A$20&$B22,Dados!$A$2:$L$171,12,0)","v":7506},null,null,null,null,2261,7506,{"$f":"VLOOKUP(TA!$A$20&$B22,Dados!$A$2:$K$171,5,0)","v":540},{"$f":"VLOOKUP(TA!$A$20&$B22,Dados!$A$2:$M$171,13,0)","v":1321},{"$f":"VLOOKUP(TA!$A$20&$B22,Dados!$A$2:$K$171,6,0)","v":11181},{"$f":"IF($N22=0,\"\",($N22/$N19)-1)","v":0.2353331123632747},{"$f":"VLOOKUP(TA!$A$20&$B22,Dados!$A$2:$K$171,7,0)","v":11162},null,null,null,null,null,null,null,null,null,null,null,null,null,null,null,null,null,null,null,"0"]
[null,null,"Apolo",{"$f":"VLOOKUP(TA!$A$20&$B22,Dados!$A$2:$K$171,8,0)","v":1292},{"$f":"VLOOKUP(TA!$A$20&$B22,Dados!$A$2:$N$171,14,0)","v":6628},{"$f":"VLOOKUP(TA!$A$20&$B22,Dados!$A$2:$P$171,16,0)","v":0},{"$f":"VLOOKUP(TA!$A$20&$B22,Dados!$A$2:$Q$171,17,0)","v":0},{"$f":"VLOOKUP(TA!$A$20&$B22,Dados!$A$2:$R$171,18,0)","v":15},{"$f":"VLOOKUP(TA!$A$20&$B22,Dados!$A$2:$S$171,19,0)","v":60},1307,6688,{"$f":"VLOOKUP(TA!$A$20&$B22,Dados!$A$2:$K$171,9,0)","v":4327},{"$f":"VLOOKUP(TA!$A$20&$B22,Dados!$A$2:$O$171,15,0)","v":16719},{"$f":"VLOOKUP(TA!$A$20&$B22,Dados!$A$2:$K$171,10,0)","v":71510},{"$f":"IF($N23=0,\"\",IF($N20=0,\"\",($N23/$N20)-1))","v":-6.9296893443875351E-3},{"$f":"VLOOKUP(TA!$A$20&$B22,Dados!$A$2:$K$171,11,0)","v":64333}]
[null,"Total",null,{"$f":"D22+D23","v":3553},{"$f":"E22+E23","v":14134},0,0,15,60,3568,{"$f":"E24+G24+I24","v":14194},{"$f":"L22+L23","v":4867},{"$f":"M22+M23","v":18040},{"$f":"N22+N23","v":82691},{"$f":"IF($N24=0,\"\",($N24/$N21)-1)","v":2.0120898100172813E-2},{"$f":"P22+P23","v":75495}]
[null,"Maio",{"$f":"TA!$D$19","v":"Eproc"},{"$f":"VLOOKUP(TA!$A$20&$B25,Dados!$A$2:$K$171,4,0)","v":3218},{"$f":"VLOOKUP(TA!$A$20&$B25,Dados!$A$2:$L$171,12,0)","v":10724},null,null,null,null,3218,10724,{"$f":"VLOOKUP(TA!$A$20&$B25,Dados!$A$2:$K$171,5,0)","v":601},{"$f":"VLOOKUP(TA!$A$20&$B25,Dados!$A$2:$M$171,13,0)","v":1922},{"$f":"VLOOKUP(TA!$A$20&$B25,Dados!$A$2:$K$171,6,0)","v":13949},{"$f":"IF($N25=0,\"\",IF($N22=0,\"100,00%\",($N25/$N22)-1))","v":0.24756282980055455},{"$f":"VLOOKUP(TA!$A$20&$B25,Dados!$A$2:$K$171,7,0)","v":13919}]
[null,null,"Apolo",{"$f":"VLOOKUP(TA!$A$20&$B25,Dados!$A$2:$K$171,8,0)","v":1391},{"$f":"VLOOKUP(TA!$A$20&$B25,Dados!$A$2:$N$171,14,0)","v":8019},{"$f":"VLOOKUP(TA!$A$20&$B25,Dados!$A$2:$P$171,16,0)","v":0},{"$f":"VLOOKUP(TA!$A$20&$B25,Dados!$A$2:$Q$171,17,0)","v":0},{"$f":"VLOOKUP(TA!$A$20&$B25,Dados!$A$2:$R$171,18,0)","v":15},{"$f":"VLOOKUP(TA!$A$20&$B25,Dados!$A$2:$S$171,19,0)","v":75},1406,8094,{"$f":"VLOOKUP(TA!$A$20&$B25,Dados!$A$2:$K$171,9,0)","v":5074},{"$f":"VLOOKUP(TA!$A$20&$B25,Dados!$A$2:$O$171,15,0)","v":21793},{"$f":"VLOOKUP(TA!$A$20&$B25,Dados!$A$2:$K$171,10,0)","v":68646},{"$f":"IF($N26=0,\"\",IF($N23=0,\"\",($N26/$N23)-1))","v":-4.0050342609425305E-2},{"$f":"VLOOKUP(TA!$A$20&$B25,Dados!$A$2:$K$171,11,0)","v":61176}]
[null,"Total",null,{"$f":"D25+D26","v":4609},18743,0,0,15,75,4624,18818,{"$f":"L25+L26","v":5675},{"$f":"M25+M26","v":23715},{"$f":"N25+N26","v":82595},{"$f":"IF($N27=0,\"\",($N27/$N24)-1)","v":-1.1609485917452034E-3},{"$f":"P25+P26","v":75095},null,null,null,null,null,null,null,null,null,null,null,null,null,null,null,null,null,null,null,"NÃO POSSO OCULTAR ESSAS COLUNAS"]
[null,"Junho",{"$f":"TA!$D$19","v":"Eproc"},{"$f":"VLOOKUP(TA!$A$20&$B28,Dados!$A$2:$K$171,4,0)","v":2876},{"$f":"VLOOKUP(TA!$A$20&$B28,Dados!$A$2:$L$171,12,0)","v":13600},null,null,null,null,2876,13600,{"$f":"VLOOKUP(TA!$A$20&$B28,Dados!$A$2:$K$171,5,0)","v":822},{"$f":"VLOOKUP(TA!$A$20&$B28,Dados!$A$2:$M$171,13,0)","v":2744},{"$f":"VLOOKUP(TA!$A$20&$B28,Dados!$A$2:$K$171,6,0)","v":16463},{"$f":"IF($N28=0,\"\",($N28/$N25)-1)","v":0.1802279733314216},{"$f":"VLOOKUP(TA!$A$20&$B28,Dados!$A$2:$K$171,7,0)","v":16417}]
[null,null,"Apolo",{"$f":"VLOOKUP(TA!$A$20&$B28,Dados!$A$2:$K$171,8,0)","v":840},{"$f":"VLOOKUP(TA!$A$20&$B28,Dados!$A$2:$N$171,14,0)","v":8859},{"$f":"VLOOKUP(TA!$A$20&$B28,Dados!$A$2:$P$171,16,0)","v":0},{"$f":"VLOOKUP(TA!$A$20&$B28,Dados!$A$2:$Q$171,17,0)","v":0},{"$f":"VLOOKUP(TA!$A$20&$B28,Dados!$A$2:$R$171,18,0)","v":9},{"$f":"VLOOKUP(TA!$A$20&$B28,Dados!$A$2:$S$171,19,0)","v":84},849,8943,{"$f":"VLOOKUP(TA!$A$20&$B28,Dados!$A$2:$K$171,9,0)","v":5255},{"$f":"VLOOKUP(TA!$A$20&$B28,Dados!$A$2:$O$171,15,0)","v":27048},{"$f":"VLOOKUP(TA!$A$20&$B28,Dados!$A$2:$K$171,10,0)","v":66611},-2.9644844564869044E-2,{"$f":"VLOOKUP(TA!$A$20&$B28,Dados!$A$2:$K$171,11,0)","v":58992}]
[null,"Total",null,{"$f":"D28+D29","v":3716},22459,0,0,9,84,3725,22543,{"$f":"L28+L29","v":6077},{"$f":"M28+M29","v":29792},{"$f":"N28+N29","v":83074},5.799382529208863E-3,{"$f":"P28+P29","v":75409}]
[null,"Julho",{"$f":"TA!$D$19","v":"Eproc"},{"$f":"VLOOKUP(TA!$A$20&$B31,Dados!$A$2:$K$171,4,0)","v":3792},{"$f":"VLOOKUP(TA!$A$20&$B31,Dados!$A$2:$L$171,12,0)","v":17392},null,null,null,null,3792,17392,{"$f":"VLOOKUP(TA!$A$20&$B31,Dados!$A$2:$K$171,5,0)","v":1590},{"$f":"VLOOKUP(TA!$A$20&$B31,Dados!$A$2:$M$171,13,0)","v":4334},{"$f":"VLOOKUP(TA!$A$20&$B31,Dados!$A$2:$K$171,6,0)","v":19629},0.19231002854886725,{"$f":"VLOOKUP(TA!$A$20&$B31,Dados!$A$2:$K$171,7,0)","v":19571}]
[null,null,"Apolo",{"$f":"VLOOKUP(TA!$A$20&$B31,Dados!$A$2:$K$171,8,0)","v":913},{"$f":"VLOOKUP(TA!$A$20&$B31,Dados!$A$2:$N$171,14,0)","v":9772},{"$f":"VLOOKUP(TA!$A$20&$B31,Dados!$A$2:$P$171,16,0)","v":0},{"$f":"VLOOKUP(TA!$A$20&$B31,Dados!$A$2:$Q$171,17,0)","v":0},{"$f":"VLOOKUP(TA!$A$20&$B31,Dados!$A$2:$R$171,18,0)","v":11},{"$f":"VLOOKUP(TA!$A$20&$B31,Dados!$A$2:$S$171,19,0)","v":95},924,9867,{"$f":"VLOOKUP(TA!$A$20&$B31,Dados!$A$2:$K$171,9,0)","v":5012},{"$f":"VLOOKUP(TA!$A$20&$B31,Dados!$A$2:$O$171,15,0)","v":32060},{"$f":"VLOOKUP(TA!$A$20&$B31,Dados!$A$2:$K$171,10,0)","v":64133},-3.7201062887511127E-2,{"$f":"VLOOKUP(TA!$A$20&$B31,Dados!$A$2:$K$171,11,0)","v":56028}]
[null,"Total",null,{"$f":"D31+D32","v":4705},27164,0,0,11,95,4716,27259,{"$f":"L31+L32","v":6602},{"$f":"M31+M32","v":36394},{"$f":"N31+N32","v":83762},8.2817728771937826E-3,{"$f":"P31+P32","v":75599}]
[null,"Agosto",{"$f":"TA!$D$19","v":"Eproc"},{"$f":"VLOOKUP(TA!$A$20&$B34,Dados!$A$2:$K$171,4,0)","v":3935},{"$f":"VLOOKUP(TA!$A$20&$B34,Dados!$A$2:$L$171,12,0)","v":21327},null,null,null,null,3935,21327,{"$f":"VLOOKUP(TA!$A$20&$B34,Dados!$A$2:$K$171,5,0)","v":1757},{"$f":"VLOOKUP(TA!$A$20&$B34,Dados!$A$2:$M$171,13,0)","v":6091},{"$f":"VLOOKUP(TA!$A$20&$B34,Dados!$A$2:$K$171,6,0)","v":22759},0.15945794487747711,{"$f":"VLOOKUP(TA!$A$20&$B34,Dados!$A$2:$K$171,7,0)","v":22681}]
[null,null,"Apolo",{"$f":"VLOOKUP(TA!$A$20&$B34,Dados!$A$2:$K$171,8,0)","v":732},{"$f":"VLOOKUP(TA!$A$20&$B34,Dados!$A$2:$N$171,14,0)","v":10504},{"$f":"VLOOKUP(TA!$A$20&$B34,Dados!$A$2:$P$171,16,0)","v":0},{"$f":"VLOOKUP(TA!$A$20&$B34,Dados!$A$2:$Q$171,17,0)","v":0},{"$f":"VLOOKUP(TA!$A$20&$B34,Dados!$A$2:$R$171,18,0)","v":23},{"$f":"VLOOKUP(TA!$A$20&$B34,Dados!$A$2:$S$171,19,0)","v":118},755,10622,{"$f":"VLOOKUP(TA!$A$20&$B34,Dados!$A$2:$K$171,9,0)","v":4110},{"$f":"VLOOKUP(TA!$A$20&$B34,Dados!$A$2:$O$171,15,0)","v":36170},{"$f":"VLOOKUP(TA!$A$20&$B34,Dados!$A$2:$K$171,10,0)","v":61212},-4.554597477117861E-2,{"$f":"VLOOKUP(TA!$A$20&$B34,Dados!$A$2:$K$171,11,0)","v":52661}]
[null,"Total",null,{"$f":"D34+D35","v":4667},31831,0,0,23,118,4690,31949,{"$f":"L34+L35","v":5867},{"$f":"M34+M35","v":42261},{"$f":"N34+N35","v":83971},2.4951648718989361E-3,{"$f":"P34+P35","v":75342}]
[null,"Setembro",{"$f":"TA!$D$19","v":"Eproc"},{"$f":"VLOOKUP(TA!$A$20&$B37,Dados!$A$2:$K$171,4,0)","v":4039},{"$f":"VLOOKUP(TA!$A$20&$B37,Dados!$A$2:$L$171,12,0)","v":25366},null,null,null,null,4039,{"$f":"E37+G37+I37","v":25366},{"$f":"VLOOKUP(TA!$A$20&$B37,Dados!$A$2:$K$171,5,0)","v":2270},{"$f":"VLOOKUP(TA!$A$20&$B37,Dados!$A$2:$M$171,13,0)","v":8361},{"$f":"VLOOKUP(TA!$A$20&$B37,Dados!$A$2:$K$171,6,0)","v":25722},0.13019025440485077,{"$f":"VLOOKUP(TA!$A$20&$B37,Dados!$A$2:$K$171,7,0)","v":25586}]
[null,null,"Apolo",{"$f":"VLOOKUP(TA!$A$20&$B37,Dados!$A$2:$K$171,8,0)","v":558},{"$f":"VLOOKUP(TA!$A$20&$B37,Dados!$A$2:$N$171,14,0)","v":11062},{"$f":"VLOOKUP(TA!$A$20&$B37,Dados!$A$2:$P$171,16,0)","v":0},{"$f":"VLOOKUP(TA!$A$20&$B37,Dados!$A$2:$Q$171,17,0)","v":0},{"$f":"VLOOKUP(TA!$A$20&$B37,Dados!$A$2:$R$171,18,0)","v":13},{"$f":"VLOOKUP(TA!$A$20&$B37,Dados!$A$2:$S$171,19,0)","v":131},571,11193,{"$f":"VLOOKUP(TA!$A$20&$B37,Dados!$A$2:$K$171,9,0)","v":4327},{"$f":"VLOOKUP(TA!$A$20&$B37,Dados!$A$2:$O$171,15,0)","v":40497},{"$f":"VLOOKUP(TA!$A$20&$B37,Dados!$A$2:$K$171,10,0)","v":58439},-4.5301574854603621E-2,{"$f":"VLOOKUP(TA!$A$20&$B37,Dados!$A$2:$K$171,11,0)","v":49535}]
[null,"Total",null,{"$f":"D37+D38","v":4597},36428,0,0,13,131,4610,36559,{"$f":"L37+L38","v":6597},{"$f":"M37+M38","v":48858},{"$f":"N37+N38","v":84161},2.2626859272845135E-3,{"$f":"P37+P38","v":75121}]
[null,"Outubro",{"$f":"TA!$D$19","v":"Eproc"},{"$f":"VLOOKUP(TA!$A$20&$B40,Dados!$A$2:$K$171,4,0)","v":4139},{"$f":"VLOOKUP(TA!$A$20&$B40,Dados!$A$2:$L$171,12,0)","v":29505},null,null,null,null,4139,29505,{"$f":"VLOOKUP(TA!$A$20&$B40,Dados!$A$2:$K$171,5,0)","v":2992},{"$f":"VLOOKUP(TA!$A$20&$B40,Dados!$A$2:$M$171,13,0)","v":11353},{"$f":"VLOOKUP(TA!$A$20&$B40,Dados!$A$2:$K$171,6,0)","v":28482},0.10730114299043625,{"$f":"VLOOKUP(TA!$A$20&$B40,Dados!$A$2:$K$171,7,0)","v":28257}]
[null,null,"Apolo",{"$f":"VLOOKUP(TA!$A$20&$B40,Dados!$A$2:$K$171,8,0)","v":552},{"$f":"VLOOKUP(TA!$A$20&$B40,Dados!$A$2:$N$171,14,0)","v":11614},{"$f":"VLOOKUP(TA!$A$20&$B40,Dados!$A$2:$P$171,16,0)","v":0},{"$f":"VLOOKUP(TA!$A$20&$B40,Dados!$A$2:$Q$171,17,0)","v":0},{"$f":"VLOOKUP(TA!$A$20&$B40,Dados!$A$2:$R$171,18,0)","v":14},{"$f":"VLOOKUP(TA!$A$20&$B40,Dados!$A$2:$S$171,19,0)","v":145},566,11759,{"$f":"VLOOKUP(TA!$A$20&$B40,Dados!$A$2:$K$171,9,0)","v":3543},{"$f":"VLOOKUP(TA!$A$20&$B40,Dados!$A$2:$O$171,15,0)","v":44040},{"$f":"VLOOKUP(TA!$A$20&$B40,Dados!$A$2:$K$171,10,0)","v":55479},-5.0651106281763836E-2,{"$f":"VLOOKUP(TA!$A$20&$B40,Dados!$A$2:$K$171,11,0)","v":46503}]
[null,"Total",null,{"$f":"D40+D41","v":4691},41119,0,0,14,145,4705,41264,{"$f":"L40+L41","v":6535},{"$f":"M40+M41","v":55393},{"$f":"N40+N41","v":83961},-2.3763976188495572E-3,{"$f":"P40+P41","v":74760}]
[null,"Novembro",{"$f":"TA!$D$19","v":"Eproc"},{"$f":"VLOOKUP(TA!$A$20&$B43,Dados!$A$2:$K$171,4,0)","v":3517},{"$f":"VLOOKUP(TA!$A$20&$B43,Dados!$A$2:$L$171,12,0)","v":33022},{"$f":"VLOOKUP(TA!$A$20&$B43,Dados!$A$2:$U$171,21,0)","v":2},{"$f":"VLOOKUP(TA!$A$20&$B43,Dados!$A$2:$V$171,22,0)","v":2},null,null,3519,33024,{"$f":"VLOOKUP(TA!$A$20&$B43,Dados!$A$2:$K$171,5,0)","v":2839},{"$f":"VLOOKUP(TA!$A$20&$B43,Dados!$A$2:$M$171,13,0)","v":14192},{"$f":"VLOOKUP(TA!$A$20&$B43,Dados!$A$2:$K$171,6,0)","v":30663},7.6574678744470104E-2,{"$f":"VLOOKUP(TA!$A$20&$B43,Dados!$A$2:$K$171,7,0)","v":30373}]
[null,null,"Apolo",{"$f":"VLOOKUP(TA!$A$20&$B43,Dados!$A$2:$K$171,8,0)","v":357},{"$f":"VLOOKUP(TA!$A$20&$B43,Dados!$A$2:$N$171,14,0)","v":11971},{"$f":"VLOOKUP(TA!$A$20&$B43,Dados!$A$2:$P$171,16,0)","v":0},{"$f":"VLOOKUP(TA!$A$20&$B43,Dados!$A$2:$Q$171,17,0)","v":0},{"$f":"VLOOKUP(TA!$A$20&$B43,Dados!$A$2:$R$171,18,0)","v":17},{"$f":"VLOOKUP(TA!$A$20&$B43,Dados!$A$2:$S$171,19,0)","v":162},374,12133,{"$f":"VLOOKUP(TA!$A$20&$B43,Dados!$A$2:$K$171,9,0)","v":3568},{"$f":"VLOOKUP(TA!$A$20&$B43,Dados!$A$2:$O$171,15,0)","v":47608},{"$f":"VLOOKUP(TA!$A$20&$B43,Dados!$A$2:$K$171,10,0)","v":53248},-4.0213414084608545E-2,{"$f":"VLOOKUP(TA!$A$20&$B43,Dados!$A$2:$K$171,11,0)","v":43705}]
[null,"Total",null,{"$f":"D43+D44","v":3874},{"$f":"E43+E44","v":44993},2,2,17,162,3893,45157,{"$f":"L43+L44","v":6407},{"$f":"M43+M44","v":61800},{"$f":"N43+N44","v":83911},-5.9551458415219027E-4,{"$f":"P43+P44","v":74078}]
[null,"Dezembro",{"$f":"TA!$D$19","v":"Eproc"},{"$f":"VLOOKUP(TA!$A$20&$B46,Dados!$A$2:$K$171,4,0)","v":2598},{"$f":"VLOOKUP(TA!$A$20&$B46,Dados!$A$2:$L$171,12,0)","v":35620},null,{"$f":"VLOOKUP(TA!$A$20&$B46,Dados!$A$2:$V$171,22,0)","v":2},null,null,2598,35622,{"$f":"VLOOKUP(TA!$A$20&$B46,Dados!$A$2:$K$171,5,0)","v":2907},{"$f":"VLOOKUP(TA!$A$20&$B46,Dados!$A$2:$M$171,13,0)","v":17099},{"$f":"VLOOKUP(TA!$A$20&$B46,Dados!$A$2:$K$171,6,0)","v":31489},2.6938003456935089E-2,{"$f":"VLOOKUP(TA!$A$20&$B46,Dados!$A$2:$K$171,7,0)","v":31131}]
[null,null,"Apolo",{"$f":"VLOOKUP(TA!$A$20&$B46,Dados!$A$2:$K$171,8,0)","v":282},{"$f":"VLOOKUP(TA!$A$20&$B46,Dados!$A$2:$N$171,14,0)","v":12253},{"$f":"VLOOKUP(TA!$A$20&$B46,Dados!$A$2:$P$171,16,0)","v":0},{"$f":"VLOOKUP(TA!$A$20&$B46,Dados!$A$2:$Q$171,17,0)","v":0},{"$f":"VLOOKUP(TA!$A$20&$B46,Dados!$A$2:$R$171,18,0)","v":10},{"$f":"VLOOKUP(TA!$A$20&$B46,Dados!$A$2:$S$171,19,0)","v":172},292,12425,{"$f":"VLOOKUP(TA!$A$20&$B46,Dados!$A$2:$K$171,9,0)","v":3346},{"$f":"VLOOKUP(TA!$A$20&$B46,Dados!$A$2:$O$171,15,0)","v":50954},{"$f":"VLOOKUP(TA!$A$20&$B46,Dados!$A$2:$K$171,10,0)","v":51732},{"$f":"IF($N47=0,\"\",IF($N44=0,\"\",($N47/$N44)-1))","v":-2.8470552884615419E-2},{"$f":"VLOOKUP(TA!$A$20&$B46,Dados!$A$2:$K$171,11,0)","v":42129}]
[null,"Total",null,{"$f":"D46+D47","v":2880},{"$f":"E46+E47","v":47873},0,2,10,172,2890,48047,{"$f":"L46+L47","v":6253},{"$f":"M46+M47","v":68053},{"$f":"N46+N47","v":83221},{"$f":"IF($N48=0,\"\",($N48/$N45)-1)","v":-8.2229981766395177E-3},{"$f":"P46+P47","v":73260}]
[null,"Consolidado","Siapro",{"$f":"IF(TA!$A$20<2018,D13+D16+D19+D22+D25+D28+D31+D34+D37+D40+D43+D46,IF(TA!$A$20=2018,D13+D16+D19,\"\"))","v":""},null,null,null,null,null,{"$f":"IF(TA!$A$20<2018,J13+J16+J19+J22+J25+J28+J31+J34+J37+J40+J43+J46,IF(TA!$A$20=2018,J13+J16+J19,\"\"))","v":""},null,{"$f":"IF(TA!$A$20<2018,L13+L16+L19+L22+L25+L28+L31+L34+L37+L40+L43+L46,IF(TA!$A$20=2018,L13+L16+L19,\"\"))","v":""}]
[null,null,"Apolo",{"$f":"D14+D17+D20+D23+D26+D29+D32+D35+D38+D41+D44+D47","v":12253},null,{"$f":"F14+F17+F20+F23+F26+F29+F32+F35+F38+F41+F44+F47","v":0},null,{"$f":"H14+H17+H20+H23+H26+H29+H32+H35+H38+H41+H44+H47","v":172},null,{"$f":"J14+J17+J20+J23+J26+J29+J32+J35+J38+J41+J44+J47","v":12425},null,{"$f":"L14+L17+L20+L23+L26+L29+L32+L35+L38+L41+L44+L47","v":50954}]
[null,null,"Eproc",{"$f":"IF(TA!$A$20<2018,\"\",IF(TA!$A$20=2018,D22+D25+D28+D31+D34+D37+D40+D43+D46,IF(TA!$A$20>2018,D13+D16+D19+D22+D25+D28+D31+D34+D37+D40+D43+D46,\"\")))","v":35620},null,{"$f":"IF(TA!$A$20<2018,\"\",IF(TA!$A$20=2018,F22+F25+F28+F31+F34+F37+F40+F43+F46,IF(TA!$A$20>2018,F13+F16+F19+F22+F25+F28+F31+F34+F37+F40+F43+F46,\"\")))","v":2},null,null,null,{"$f":"IF(TA!$A$20<2018,\"\",IF(TA!$A$20=2018,J22+J25+J28+J31+J34+J37+J40+J43+J46,IF(TA!$A$20>2018,J13+J16+J19+J22+J25+J28+J31+J34+J37+J40+J43+J46,\"\")))","v":35622},null,{"$f":"IF(TA!$A$20<2018,\"\",IF(TA!$A$20=2018,L22+L25+L28+L31+L34+L37+L40+L43+L46,IF(TA!$A$20>2018,L13+L16+L19+L22+L25+L28+L31+L34+L37+L40+L43+L46,\"\")))","v":17099}]
[null,"Total",null,{"$f":"SUM(D49:D51)","v":47873},null,{"$f":"SUM(F49:F51)","v":2},null,{"$f":"SUM(H49:H51)","v":172},null,{"$f":"SUM(J49:J51)","v":48047},null,{"$f":"SUM(L49:L51)","v":68053}]
[]
["Legenda: Tramitação Ajustada (TA) do Siapro = TRAM - O (Suspensos) - P (Aguardando o Julgamento do Agravo)                    (*) Tram. Ajustada (TA) do Apolo  = TRAM - O (Suspensos)"]
["OBS.: Os valores poderão ser alterados, em função de modificações na base de dados, por parte do usuário."]
[]
["(*) 1ª Distribuição no TRF = CASOS NOVOS para o TRF    (*) Distribuídos para o Apolo (Origem: Sistema Siapro) = Com a implantação do Sistema Apolo (DEZ/2013), o Sistema Siapro passou a ser descontinuado."]
["_ Na semana de 19 a 23/03/2018, iniciou-se a Migração de TODOS os processos do sistema Siapro para o Sistema Apolo ."]
["_ Desde o dia 27 de Abril de 2018, o NOVO sistema processual \"Eproc\" está em funcionamento no Tribunal, o Sistema Apolo passou a ser descontinuado."]

{"sheet":"GTDJaMS","index":3,"n_rows":1,"n_cols":11,"rows_kept":1,"cut":false,"hidden":true,"merged":[[1,1,24,15],[26,1,49,7],[26,9,49,15],[0,0,0,9],[0,10,0,11],[0,14,0,15]]}
["TRF2 - Processos Siapro - Série Histórica",null,null,null,null,null,null,null,null,null,"no Ano de:  "]

{"sheet":"GTvM2B","index":4,"n_rows":2,"n_cols":36,"rows_kept":2,"cut":false,"hidden":true,"merged":[[26,1,49,7],[26,9,49,15],[1,1,24,7],[1,9,24,15],[0,10,0,11],[0,14,0,15],[0,0,0,9]]}
[{"$f":"TA!$A$24 & \" (% Variação Mensal)\"","v":"TRF2 - Processos em TRAMITAÇÃO em 2019 (% Variação Mensal)"},null,null,null,null,null,null,null,null,null,"no Ano de:  "]
[null,null,null,null,null,null,null,null,null,null,null,null,null,null,null,null,null,null,null,null,null,null,null,null,null,null,null,null,null,null,null,null,null,null,null,"certo geral"]

{"sheet":"GTvM3B18","index":5,"n_rows":2,"n_cols":36,"rows_kept":2,"cut":false,"hidden":true,"merged":[[26,1,49,7],[26,9,49,15],[0,0,0,9],[0,10,0,11],[0,14,0,15],[1,1,24,7],[1,9,24,15]]}
[{"$f":"TA!$A$24 & \" (% Variação Mensal)\"","v":"TRF2 - Processos em TRAMITAÇÃO em 2019 (% Variação Mensal)"},null,null,null,null,null,null,null,null,null,"no Ano de:  "]
[null,null,null,null,null,null,null,null,null,null,null,null,null,null,null,null,null,null,null,null,null,null,null,null,null,null,null,null,null,null,null,null,null,null,null,"certo geral"]

{"sheet":"GDaM2B","index":6,"n_rows":2,"n_cols":36,"rows_kept":2,"cut":false,"hidden":true,"merged":[[0,0,0,9],[0,10,0,11],[0,14,0,15],[26,1,49,7],[26,9,49,15],[1,1,24,7],[1,9,24,15]]}
[{"$f":"TA!$A$25 & \" (Acumulado Mensal)\"","v":"TRF2 - Processos DISTRIBUÍDOS (1ª Distribuição) em 2019 (Acumulado Mensal)"},null,null,null,null,null,null,null,null,null,"no Ano de:  "]
[null,null,null,null,null,null,null,null,null,null,null,null,null,null,null,null,null,null,null,null,null,null,null,null,null,null,null,null,null,null,null,null,null,null,null,"errado para 2018"]

{"sheet":"GDaM3B18","index":7,"n_rows":2,"n_cols":36,"rows_kept":2,"cut":false,"hidden":true,"merged":[[26,1,49,7],[26,9,49,15],[0,0,0,9],[0,10,0,11],[0,14,0,15],[1,1,24,7],[1,9,24,15]]}
[{"$f":"TA!$A$25 & \" (Acumulado Mensal)\"","v":"TRF2 - Processos DISTRIBUÍDOS (1ª Distribuição) em 2019 (Acumulado Mensal)"},null,null,null,null,null,null,null,null,null,"no Ano de:  "]
[null,null,null,null,null,null,null,null,null,null,null,null,null,null,null,null,null,null,null,null,null,null,null,null,null,null,null,null,null,null,null,null,null,null,null,"certo só para 2018"]

{"sheet":"GJaM2B","index":8,"n_rows":2,"n_cols":36,"rows_kept":2,"cut":false,"hidden":true,"merged":[[26,1,49,7],[26,9,49,15],[1,1,24,7],[1,9,24,15],[0,0,0,9],[0,10,0,11],[0,14,0,15]]}
[{"$f":"TA!$A$26 & \" (Acumulado Mensal)\"","v":"TRF2 - Processos JULGADOS em 2019 (Acumulado Mensal)"},null,null,null,null,null,null,null,null,null,"no Ano de:  "]
[null,null,null,null,null,null,null,null,null,null,null,null,null,null,null,null,null,null,null,null,null,null,null,null,null,null,null,null,null,null,null,null,null,null,null,"errado para 2018"]

{"sheet":"GJaM3B18","index":9,"n_rows":2,"n_cols":36,"rows_kept":2,"cut":false,"hidden":true,"merged":[[26,1,49,7],[26,9,49,15],[0,0,0,9],[0,10,0,11],[0,14,0,15],[1,1,24,7],[1,9,24,15]]}
[{"$f":"TA!$A$26 & \" (Acumulado Mensal)\"","v":"TRF2 - Processos JULGADOS em 2019 (Acumulado Mensal)"},null,null,null,null,null,null,null,null,null,"no Ano de:  "]
[null,null,null,null,null,null,null,null,null,null,null,null,null,null,null,null,null,null,null,null,null,null,null,null,null,null,null,null,null,null,null,null,null,null,null,"certo só para 2018"]

{"sheet":"PvAT","index":10,"n_rows":51,"n_cols":43,"rows_kept":51,"cut":false,"hidden":true,"merged":[[49,0,49,16],[50,0,50,16],[40,1,42,1],[48,0,48,16],[45,0,45,16],[46,0,46,16],[0,1,2,5],[0,12,2,14],[8,2,9,2],[33,1,35,1],[21,1,22,1],[8,11,9,11],[8,12,9,12],[27,1,28,1],[30,1,31,1],[8,10,9,10],[24,1,25,1],[7,5,7,8],[6,9,7,10],[8,9,9,9],[8,13,9,13],[37,1,38,1],[8,14,9,14],[8,15,9,15],[6,3,7,4],[4,4,4,5],[6,5,6,8],[8,3,9,3],[8,4,9,4],[8,5,9,5],[8,6,9,6],[8,7,9,7],[8,8,9,8],[18,1,19,1]]}
[]
[]
[]
[]
[null,null,null,null,"Tipo Processo",null,"Judicial"]
[]
[null,null,null,"(*) 1ª Distribuição no TRF",null,"(*) Distribuídos para o Apolo (Origem: Sistema Siapro)",null,null,null,"Total de Distribuídos\nnas Bases de Dados"]
[null,null,null,null,null,"(*) Migrados para o Eproc (Origem: Sistema Apolo)"]
[null,null,"Base de Dados do Processo","(A)","% Variação Anual","Por Migração (M)","% Variação Anual","Por Virtualização (V)","% Variação Anual","(A)+(M)+(V)","% Variação Anual","Julgados\n(TJI)","% Variação Anual","Saldo Atual\n(TRAM)","% Variação Anual da\nTramitação","(*) Tram. Ajustada\n(TA)",null,null,null,null,null,null,null,null,null,null,null,null,null,null,null,null,null,null,null,"A",null,null,null,null,"E"]
[null,"Ano",null,null,null,null,null,null,null,null,null,null,null,null,null,null,null,null,null,null,null,null,null,null,null,null,null,null,null,null,null,null,null,null,null,"A","J","TR",null,null,"A","J","TR"]
[null,2005,"Siapro",{"$f":"SUMIF(Dados!$A$86:$G$171,$B11,Dados!$C$86:$C$171)","v":34979},null,null,null,null,null,{"$f":"D11","v":34979},null,{"$f":"SUMIF(Dados!$A$86:$G$171,$B11,Dados!$D$86:$D$171)","v":47264},null,{"$f":"VLOOKUP($B11&\"Dezembro\",Dados!$A$86:$G$171,6,0)","v":115794},null,{"$f":"VLOOKUP($B11&\"Dezembro\",Dados!$A$86:$G$171,7,0)","v":115688}]
[null,2006,"Siapro",{"$f":"SUMIF(Dados!$A$86:$G$171,$B12,Dados!$C$86:$C$171)","v":37963},{"$f":"IF($D11=0,\"\",($D12/$D11)-1)","v":8.5308327853855115E-2},null,null,null,null,{"$f":"D12","v":37963},{"$f":"IF($J11=0,\"\",($J12/$J11)-1)","v":8.5308327853855115E-2},{"$f":"SUMIF(Dados!$A$86:$G$171,$B12,Dados!$D$86:$D$171)","v":61131},{"$f":"IF($L11=0,\"\",($L12/$L11)-1)","v":0.29339454976303325},{"$f":"VLOOKUP($B12&\"Dezembro\",Dados!$A$86:$G$171,6,0)","v":105290},{"$f":"IF($N11=0,\"\",($N12/$N11)-1)","v":-9.071281758985783E-2},{"$f":"VLOOKUP($B12&\"Dezembro\",Dados!$A$86:$G$171,7,0)","v":105185},null,null,null,null,null,null,null,null,null,null,null,null,null,null,null,null,null,null,null,"0","0","0",null,null,"0","0","0"]
[null,2007,"Siapro",{"$f":"SUMIF(Dados!$A$86:$G$171,$B13,Dados!$C$86:$C$171)","v":42394},0.1167189105181361,null,null,null,null,{"$f":"D13","v":42394},{"$f":"IF($J12=0,\"\",($J13/$J12)-1)","v":0.1167189105181361},{"$f":"SUMIF(Dados!$A$86:$G$171,$B13,Dados!$D$86:$D$171)","v":63812},4.3856635749456085E-2,{"$f":"VLOOKUP($B13&\"Dezembro\",Dados!$A$86:$G$171,6,0)","v":99861},-5.1562351600341949E-2,{"$f":"VLOOKUP($B13&\"Dezembro\",Dados!$A$86:$G$171,7,0)","v":99790},null,null,null,null,null,null,null,null,null,null,null,null,null,null,null,null,null,null,null,"0","0","0",null,null,"0","0","0"]
[null,2008,"Siapro",{"$f":"SUMIF(Dados!$A$86:$G$171,$B14,Dados!$C$86:$C$171)","v":47906},0.1300183988300232,null,null,null,null,47906,{"$f":"IF($J13=0,\"\",($J14/$J13)-1)","v":0.1300183988300232},{"$f":"SUMIF(Dados!$A$86:$G$171,$B14,Dados!$D$86:$D$171)","v":68405},7.1977057606719796E-2,{"$f":"VLOOKUP($B14&\"Dezembro\",Dados!$A$86:$G$171,6,0)","v":93504},-6.3658485294559419E-2,{"$f":"VLOOKUP($B14&\"Dezembro\",Dados!$A$86:$G$171,7,0)","v":92985},null,null,null,null,null,null,null,null,null,null,null,null,null,null,null,null,null,null,null,"0","0","0",null,null,"0","0","0"]
[null,2009,"Siapro",{"$f":"SUMIF(Dados!$A$86:$G$171,$B15,Dados!$C$86:$C$171)","v":48724},1.7075105414770642E-2,null,null,null,null,48724,1.7075105414770642E-2,{"$f":"SUMIF(Dados!$A$86:$G$171,$B15,Dados!$D$86:$D$171)","v":73000},6.7173452233023845E-2,{"$f":"VLOOKUP($B15&\"Dezembro\",Dados!$A$86:$G$171,6,0)","v":90849},-2.839450718685832E-2,{"$f":"VLOOKUP($B15&\"Dezembro\",Dados!$A$86:$G$171,7,0)","v":89584},null,null,null,null,null,null,null,null,null,null,null,null,null,null,null,null,null,null,null,"0","0","0",null,null,"0","0","0"]
[null,2010,"Siapro",{"$f":"SUMIF(Dados!$A$86:$G$171,$B16,Dados!$C$86:$C$171)","v":50640},3.9323536655446967E-2,null,null,null,null,50640,3.9323536655446967E-2,{"$f":"SUMIF(Dados!$A$86:$G$171,$B16,Dados!$D$86:$D$171)","v":69325},-5.0342465753424603E-2,{"$f":"VLOOKUP($B16&\"Dezembro\",Dados!$A$86:$G$171,6,0)","v":96543},6.2675428458210947E-2,{"$f":"VLOOKUP($B16&\"Dezembro\",Dados!$A$86:$G$171,7,0)","v":92589},null,null,null,null,null,null,null,null,null,null,null,null,null,null,null,null,null,null,null,"0","0","0",null,null,"0","0","0"]
[null,2011,"Siapro",{"$f":"SUMIF(Dados!$A$86:$G$171,$B17,Dados!$C$86:$C$171)","v":52243},3.1654818325434375E-2,null,null,null,null,52243,3.1654818325434375E-2,{"$f":"SUMIF(Dados!$A$86:$G$171,$B17,Dados!$D$86:$D$171)","v":79119},0.14127659574468088,{"$f":"VLOOKUP($B17&\"Dezembro\",Dados!$A$86:$G$171,6,0)","v":97050},5.2515459432584954E-3,{"$f":"VLOOKUP($B17&\"Dezembro\",Dados!$A$86:$G$171,7,0)","v":93519},null,null,null,null,null,null,null,null,null,null,null,null,null,null,null,null,null,null,null,"0","0","0",null,null,"0","0","0"]
[null,2012,"Siapro",{"$f":"SUMIF(Dados!$A$86:$G$171,$B18,Dados!$C$86:$C$171)","v":53335},2.0902321842160676E-2,null,null,null,null,53335,2.0902321842160676E-2,{"$f":"SUMIF(Dados!$A$86:$G$171,$B18,Dados!$D$86:$D$171)","v":81295},2.7502875415513328E-2,{"$f":"VLOOKUP($B18&\"Dezembro\",Dados!$A$86:$G$171,6,0)","v":96397},-6.7284904688305058E-3,{"$f":"VLOOKUP($B18&\"Dezembro\",Dados!$A$86:$G$171,7,0)","v":92676},null,null,null,null,null,null,null,null,null,null,null,null,null,null,null,null,null,null,null,"0","0","0",null,null,"0","0","0"]
[null,2013,"Siapro",{"$f":"SUMIF(Dados!$A$2:$G$85,$B19,Dados!$C$2:$C$85)","v":61160},0.14671416518233804,null,null,null,null,{"$f":"D19+F19+H19","v":61160},0.14671416518233804,{"$f":"SUMIF(Dados!$A$2:$G$85,$B19,Dados!$D$2:$D$85)","v":81874},7.1222092379605861E-3,{"$f":"VLOOKUP($B19&\"Dezembro\",Dados!$A$2:$G$85,6,0)","v":108814},0.12881106258493524,{"$f":"VLOOKUP($B19&\"Dezembro\",Dados!$A$2:$G$85,7,0)","v":105131},null,null,null,null,null,null,null,null,null,null,null,null,null,null,null,null,null,null,null,{"$f":"D20","v":308},"0",{"$f":"N20","v":308},null,null,"0","0","0"]
[null,null,"Apolo",{"$f":"SUMIF(Dados!$A$2:$G$85,$B19,Dados!$G$2:$G$85)","v":308},null,null,null,null,null,308,null,null,null,{"$f":"VLOOKUP($B19&\"Dezembro\",Dados!$A$2:$K$85,10,0)","v":308},null,{"$f":"VLOOKUP($B19&\"Dezembro\",Dados!$A$2:$K$85,11,0)","v":308},null,null,null,null,null,null,null,null,null,null,null,null,null,null,null,null,null,null,null,{"$f":"D23","v":49299},{"$f":"L23","v":26557},{"$f":"N23","v":44255},null,null,"0","0","0"]
[null,"Total",null,{"$f":"D19+D20","v":61468},{"$f":"IF($D21=0,\"\",($D21/$D18)-1)","v":0.15248898471922745},{"$f":"F19+F20","v":0},{"$f":"IF($F21=0,\"\",($F21/#REF!)-1)","v":""},{"$f":"H19+H20","v":0},{"$f":"IF($H21=0,\"\",($H21/#REF!)-1)","v":""},61468,{"$f":"IF($J21=0,\"\",($J21/$J18)-1)","v":0.15248898471922745},{"$f":"L19+L20","v":81874},{"$f":"IF($L21=0,\"\",($L21/$L18)-1)","v":7.1222092379605861E-3},{"$f":"N19+N20","v":109122},{"$f":"IF($N21=0,\"\",($N21/$N18)-1)","v":0.13200618276502385},{"$f":"P19+P20","v":105439},null,null,null,null,null,null,null,null,null,null,null,null,null,null,null,null,null,null,null,{"$f":"D26","v":51618},{"$f":"L26","v":47157},{"$f":"N26","v":75365},null,null,"0","0","0"]
[null,2014,"Siapro",{"$f":"SUMIF(Dados!$A$2:$G$85,$B22,Dados!$C$2:$C$85)","v":19733},{"$f":"IF($D19=0,\"\",($D22/$D19)-1)","v":-0.67735448005232179},null,null,null,null,19733,{"$f":"IF($J19=0,\"\",($J22/$J19)-1)","v":-0.67735448005232179},{"$f":"SUMIF(Dados!$A$2:$G$85,$B22,Dados!$D$2:$D$85)","v":59685},{"$f":"IF($L19=0,\"\",($L22/$L19)-1)","v":-0.27101399711752205},{"$f":"VLOOKUP($B22&\"Dezembro\",Dados!$A$2:$G$85,6,0)","v":77078},{"$f":"IF($N22=0,\"\",($N22/$N19)-1)","v":-0.29165364750859268},{"$f":"VLOOKUP($B22&\"Dezembro\",Dados!$A$2:$G$85,7,0)","v":72977},null,null,null,null,null,null,null,null,null,null,null,null,null,null,null,null,null,null,null,{"$f":"D29","v":44813},{"$f":"L29","v":50058},{"$f":"N29","v":80830},null,null,"0","0","0"]
[null,null,"Apolo",{"$f":"SUMIF(Dados!$A$2:$G$85,$B22,Dados!$G$2:$G$85)","v":49299},{"$f":"IF($D20=0,\"\",($D23/$D20)-1)","v":159.0616883116883},{"$f":"SUMIF(Dados!$A$2:$P$85,$B22,Dados!$O$2:$O$85)","v":0},{"$f":"IF($F20=0,\"\",($F23/$F20)-1)","v":""},{"$f":"SUMIF(Dados!$A$2:$R$85,$B22,Dados!$Q$2:$Q$85)","v":1763},{"$f":"IF($H20=0,\"\",($H23/$H20)-1)","v":""},51062,{"$f":"IF($J20=0,\"\",($J23/$J20)-1)","v":164.78571428571428},{"$f":"SUMIF(Dados!$A$2:$G$85,$B22,Dados!$H$2:$H$85)","v":26557},1,{"$f":"VLOOKUP($B22&\"Dezembro\",Dados!$A$2:$K$85,10,0)","v":44255},{"$f":"IF($N23=0,\"\",IF($N20=0,\"\",($N23/$N20)-1))","v":142.68506493506493},{"$f":"VLOOKUP($B22&\"Dezembro\",Dados!$A$2:$K$85,11,0)","v":44232},null,null,null,null,null,null,null,null,null,null,null,null,null,null,null,null,null,null,null,{"$f":"D32","v":42008},{"$f":"L32","v":57866},{"$f":"N32","v":80525},null,null,"0","0","0"]
[null,"Total",null,{"$f":"D22+D23","v":69032},{"$f":"IF($D24=0,\"\",($D24/$D21)-1)","v":0.12305589900435998},{"$f":"F22+F23","v":0},{"$f":"IF($F24=0,\"\",($F24/$F21)-1)","v":""},{"$f":"H22+H23","v":1763},null,70795,{"$f":"IF($J24=0,\"\",($J24/$J21)-1)","v":0.151737489425392},{"$f":"L22+L23","v":86242},{"$f":"IF($L24=0,\"\",($L24/$L21)-1)","v":5.3350269926961014E-2},{"$f":"N22+N23","v":121333},{"$f":"IF($N24=0,\"\",($N24/$N21)-1)","v":0.11190227451842882},{"$f":"P22+P23","v":117209},null,null,null,null,null,null,null,null,null,null,null,null,null,null,null,null,null,null,null,{"$f":"D35","v":36881},{"$f":"L35","v":64352},{"$f":"N35","v":77849},null,null,{"$f":"D36","v":4244},{"$f":"L36","v":480},{"$f":"N36","v":4154}]
[null,2015,"Siapro",{"$f":"SUMIF(Dados!$A$2:$G$85,$B25,Dados!$C$2:$C$85)","v":1164},{"$f":"IF($D22=0,\"\",($D25/$D22)-1)","v":-0.94101251710332945},null,null,null,null,1164,{"$f":"IF($J22=0,\"\",($J25/$J22)-1)","v":-0.94101251710332945},{"$f":"SUMIF(Dados!$A$2:$G$85,$B25,Dados!$D$2:$D$85)","v":22493},{"$f":"IF($L22=0,\"\",($L25/$L22)-1)","v":-0.62313814191170303},{"$f":"VLOOKUP($B25&\"Dezembro\",Dados!$A$2:$G$85,6,0)","v":39179},{"$f":"IF($N25=0,\"\",($N25/$N22)-1)","v":-0.49169672280028021},{"$f":"VLOOKUP($B25&\"Dezembro\",Dados!$A$2:$G$85,7,0)","v":36665},null,null,null,null,null,null,null,null,null,null,null,null,null,null,null,null,null,null,null,{"$f":"D38","v":12253},{"$f":"L38","v":50954},{"$f":"N38","v":51732},null,null,{"$f":"D39","v":35620},{"$f":"L39","v":17099},{"$f":"N39","v":31489}]
[null,null,"Apolo",{"$f":"SUMIF(Dados!$A$2:$G$85,$B25,Dados!$G$2:$G$85)","v":51618},{"$f":"IF($D23=0,\"\",($D26/$D23)-1)","v":4.7039493701697799E-2},{"$f":"SUMIF(Dados!$A$2:$P$85,$B25,Dados!$O$2:$O$85)","v":7588},{"$f":"IF($F23=0,\"\",($F26/$F23)-1)","v":""},{"$f":"SUMIF(Dados!$A$2:$Q$85,$B25,Dados!$Q$2:$Q$85)","v":4145},{"$f":"IF($H23=0,\"\",($H26/$H23)-1)","v":1.351106069200227},63351,{"$f":"IF($J23=0,\"\",($J26/$J23)-1)","v":0.24066820727742755},{"$f":"SUMIF(Dados!$A$2:$G$85,$B25,Dados!$H$2:$H$85)","v":47157},{"$f":"IF($L23=0,\"\",($L26/$L23)-1)","v":0.7756900252287533},{"$f":"VLOOKUP($B25&\"Dezembro\",Dados!$A$2:$K$85,10,0)","v":75365},{"$f":"IF($N26=0,\"\",IF($N23=0,\"\",($N26/$N23)-1))","v":0.70297141565924748},{"$f":"VLOOKUP($B25&\"Dezembro\",Dados!$A$2:$K$85,11,0)","v":72256}]
[null,"Total",null,{"$f":"D25+D26","v":52782},{"$f":"IF($D27=0,\"\",($D27/$D24)-1)","v":-0.23539807625449072},{"$f":"F25+F26","v":7588},null,{"$f":"H25+H26","v":4145},{"$f":"IF($H27=0,\"\",($H27/$H24)-1)","v":1.351106069200227},64515,{"$f":"IF($J27=0,\"\",($J27/$J24)-1)","v":-8.8706829578360069E-2},{"$f":"L25+L26","v":69650},{"$f":"IF($L27=0,\"\",($L27/$L24)-1)","v":-0.19238885925651072},{"$f":"N25+N26","v":114544},{"$f":"IF($N27=0,\"\",($N27/$N24)-1)","v":-5.5953450421567075E-2},{"$f":"P25+P26","v":108921},null,null,null,null,null,null,null,null,null,null,null,null,null,null,null,null,null,null,null,2017,"TPJ","TJ2G",null,2017,"TPAll","TJAll","#"]
[null,2016,"Siapro",{"$f":"SUMIF(Dados!$A$2:$G$85,$B28,Dados!$C$2:$C$85)","v":2},{"$f":"IF($D28=0,\"\",IF($D25=0,\"\",($D28/$D25)-1))","v":-0.99828178694158076},null,null,null,null,2,{"$f":"IF($J28=0,\"\",IF($J25=0,\"\",($J28/$J25)-1))","v":-0.99828178694158076},{"$f":"SUMIF(Dados!$A$2:$G$85,$B28,Dados!$D$2:$D$85)","v":9684},{"$f":"IF($L25=0,\"\",($L28/$L25)-1)","v":-0.56946605610634426},{"$f":"VLOOKUP($B28&\"Dezembro\",Dados!$A$2:$G$85,6,0)","v":16985},{"$f":"IF($N28=0,\"\",($N28/$N25)-1)","v":-0.56647693917659969},{"$f":"VLOOKUP($B28&\"Dezembro\",Dados!$A$2:$G$85,7,0)","v":15697},null,null,null,null,null,null,null,null,null,null,null,null,null,null,null,null,null,null,null,"(PE)","A=",41972,null,"(RelAtiv)","A=",42008,{"$f":"AL28-AP28","v":-36}]
[null,null,"Apolo",{"$f":"SUMIF(Dados!$A$2:$G$85,$B28,Dados!$G$2:$G$85)","v":44813},{"$f":"IF($D26=0,\"\",($D29/$D26)-1)","v":-0.13183385640667988},{"$f":"SUMIF(Dados!$A$2:$P$85,$B28,Dados!$O$2:$O$85)","v":208},{"$f":"IF($F26=0,\"\",($F29/$F26)-1)","v":-0.9725882973115445},{"$f":"SUMIF(Dados!$A$2:$Q$85,$B28,Dados!$Q$2:$Q$85)","v":85},{"$f":"IF($H29=0,\"\",IF($H26=0,\"\",($H29/$H26)-1))","v":-0.97949336550060317},45106,{"$f":"IF($J26=0,\"\",($J29/$J26)-1)","v":-0.28799861091379775},{"$f":"SUMIF(Dados!$A$2:$G$85,$B28,Dados!$H$2:$H$85)","v":50058},{"$f":"IF($L26=0,\"\",($L29/$L26)-1)","v":6.1517908263884369E-2},{"$f":"VLOOKUP($B28&\"Dezembro\",Dados!$A$2:$K$85,10,0)","v":80830},{"$f":"IF($N29=0,\"\",IF($N26=0,\"\",($N29/$N26)-1))","v":7.2513766337159113E-2},{"$f":"VLOOKUP($B28&\"Dezembro\",Dados!$A$2:$K$85,11,0)","v":75705},null,null,null,null,null,null,null,null,null,null,null,null,null,null,null,null,null,null,null,null,"M=",227,null,"(AQUI)","M=",227,"0"]
[null,"Total",null,{"$f":"D28+D29","v":44815},{"$f":"IF($D30=0,\"\",($D30/$D27)-1)","v":-0.15094160888181574},{"$f":"F28+F29","v":208},{"$f":"IF($F27=0,\"\",($F30/$F27)-1)","v":-0.9725882973115445},{"$f":"H28+H29","v":85},{"$f":"IF($H30=0,\"\",($H30/$H27)-1)","v":-0.97949336550060317},45108,{"$f":"IF($J30=0,\"\",($J30/$J27)-1)","v":-0.30081376424087425},{"$f":"L28+L29","v":59742},{"$f":"IF($L30=0,\"\",($L30/$L27)-1)","v":-0.14225412778176594},{"$f":"N28+N29","v":97815},{"$f":"IF($N30=0,\"\",($N30/$N27)-1)","v":-0.14604867998323789},{"$f":"P28+P29","v":91402},null,null,null,null,null,null,null,null,null,null,null,null,null,null,null,null,null,null,null,null,"V=",702,null,null,"V=",726,{"$f":"AL30-AP30","v":-24}]
[null,2017,"Siapro","0",{"$f":"IF($D31=0,\"\",IF($D28=0,\"\",($D31/$D28)-1))","v":-1},null,null,null,null,"0",{"$f":"IF($J31=0,\"\",IF($J28=0,\"\",($J31/$J28)-1))","v":-1},{"$f":"SUMIF(Dados!$A$2:$G$85,$B31,Dados!$D$2:$D$85)","v":7604},{"$f":"IF($L28=0,\"\",($L31/$L28)-1)","v":-0.21478727798430397},{"$f":"VLOOKUP($B31&\"Dezembro\",Dados!$A$2:$G$85,6,0)","v":8724},{"$f":"IF($N31=0,\"\",($N31/$N28)-1)","v":-0.4863703267589049},{"$f":"VLOOKUP($B31&\"Dezembro\",Dados!$A$2:$G$85,7,0)","v":8246},null,null,null,null,null,null,null,null,null,null,null,null,null,null,null,null,null,null,null,null,"TJI=",57847,null,null,"TJI=",57866,-19]
[null,null,"Apolo",{"$f":"SUMIF(Dados!$A$2:$G$85,$B31,Dados!$G$2:$G$85)","v":42008},{"$f":"IF($D29=0,\"\",($D32/$D29)-1)","v":-6.2593443866735154E-2},{"$f":"SUMIF(Dados!$A$2:$P$85,$B31,Dados!$O$2:$O$85)","v":227},{"$f":"IF($F29=0,\"\",($F32/$F29)-1)","v":9.1346153846153744E-2},{"$f":"SUMIF(Dados!$A$2:$Q$85,$B31,Dados!$Q$2:$Q$85)","v":726},{"$f":"IF($H32=0,\"\",IF($H29=0,\"\",($H32/$H29)-1))","v":7.5411764705882351},{"$f":"D32+F32+H32","v":42961},{"$f":"IF($J29=0,\"\",($J32/$J29)-1)","v":-4.7554649048907049E-2},{"$f":"SUMIF(Dados!$A$2:$G$85,$B31,Dados!$H$2:$H$85)","v":57866},{"$f":"IF($L29=0,\"\",($L32/$L29)-1)","v":0.15597906428542885},{"$f":"VLOOKUP($B31&\"Dezembro\",Dados!$A$2:$K$85,10,0)","v":80525},{"$f":"IF($N32=0,\"\",IF($N29=0,\"\",($N32/$N29)-1))","v":-3.773351478411513E-3},{"$f":"VLOOKUP($B31&\"Dezembro\",Dados!$A$2:$K$85,11,0)","v":76077},null,null,null,null,null,null,null,null,null,null,null,null,null,null,null,null,null,null,null,null,"TRAM=",80464,null,null,"TRAM=",80525,-61]
[null,"Total",null,{"$f":"D31+D32","v":42008},{"$f":"IF($D33=0,\"\",($D33/$D30)-1)","v":-6.2635278366618308E-2},{"$f":"F31+F32","v":227},{"$f":"IF($F30=0,\"\",($F33/$F30)-1)","v":9.1346153846153744E-2},{"$f":"H31+H32","v":726},{"$f":"IF($H33=0,\"\",($H33/$H30)-1)","v":7.5411764705882351},42961,{"$f":"IF($J33=0,\"\",($J33/$J30)-1)","v":-4.7596878602465198E-2},{"$f":"L31+L32","v":65470},{"$f":"IF($L33=0,\"\",($L33/$L30)-1)","v":9.5878946135047327E-2},{"$f":"N31+N32","v":89249},{"$f":"IF($N33=0,\"\",($N33/$N30)-1)","v":-8.7573480550017901E-2},{"$f":"P31+P32","v":84323},null,null,null,null,null,null,null,null,null,null,null,null,null,null,null,null,null,null,null,null,"TA=",76016,null,null,"TA=",76077,-61]
[null,2018,"Siapro",{"$f":"SUMIF(Dados!$A$14:$G$16,$B34,Dados!$C$14:$C$16)","v":1},1,null,null,null,null,1,1,{"$f":"SUMIF(Dados!$A$14:$G$16,$B34,Dados!$D$14:$D$16)","v":1421},{"$f":"IF($L31=0,\"\",($L34/$L31)-1)","v":-0.81312467122567067},"0",{"$f":"IF($N34=0,\"\",($N34/$N31)-1)","v":-1},"0",null,null,null,null,null,null,null,null,null,null,null,null,null,null,null,null,null,null,null," => No 2º semestre de 2018 identifiquei Processos TRU no Apolo"]
[null,null,"Apolo",{"$f":"SUMIF(Dados!$A$2:$G$85,$B34,Dados!$G$2:$G$85)","v":36881},{"$f":"IF($D32=0,\"\",($D35/$D32)-1)","v":-0.12204818129880024},{"$f":"SUMIF(Dados!$A$2:$P$85,$B34,Dados!$O$2:$O$85)","v":7984},{"$f":"IF($F32=0,\"\",($F35/$F32)-1)","v":34.171806167400881},{"$f":"SUMIF(Dados!$A$2:$Q$85,$B34,Dados!$Q$2:$Q$85)","v":540},{"$f":"IF($H35=0,\"\",IF($H32=0,\"\",($H35/$H32)-1))","v":-0.25619834710743805},45405,{"$f":"IF($J32=0,\"\",($J35/$J32)-1)","v":5.6888806126486724E-2},{"$f":"SUMIF(Dados!$A$2:$G$85,$B34,Dados!$H$2:$H$85)","v":64352},{"$f":"IF($L32=0,\"\",($L35/$L32)-1)","v":0.11208654477586144},{"$f":"VLOOKUP($B34&\"Dezembro\",Dados!$A$2:$K$85,10,0)","v":77849},{"$f":"IF($N35=0,\"\",IF($N32=0,\"\",($N35/$N32)-1))","v":-3.3231915554175706E-2},{"$f":"VLOOKUP($B34&\"Dezembro\",Dados!$A$2:$K$85,11,0)","v":71773},null,null,null,null,null,null,null,null,null,null,null,null,null,null,null,null,null,null,null," => RelAtiv 2017 já tinha sido publicado (2017 ñ foi republicado)"]
[null,null,"Eproc",{"$f":"SUMIF(Dados!$A$17:$V$25,$B34,Dados!$C$17:$C$25)","v":4244},1,{"$f":"SUMIF(Dados!$A$17:$V$25,$B34,Dados!$T$17:$T$25)","v":0},null,null,null,4244,1,{"$f":"SUMIF(Dados!$A$17:$V$25,$B34,Dados!$D$17:$D$25)","v":480},1,{"$f":"VLOOKUP($B34&\"Dezembro\",Dados!$A$17:$V$25,6,0)","v":4154},1,{"$f":"VLOOKUP($B34&\"Dezembro\",Dados!$A$17:$V$25,7,0)","v":4149},null,null,null,null,null,null,null,null,null,null,null,null,null,null,null,null,null,null,null,null,null,null," 2018 (TJI) S+e"]
[null,"Total",null,{"$f":"SUM(D34:D36)","v":41126},{"$f":"IF($D37=0,\"\",($D37/$D33)-1)","v":-2.099600076175967E-2},{"$f":"SUM(F34:F36)","v":7984},{"$f":"IF($F33=0,\"\",($F37/$F33)-1)","v":34.171806167400881},{"$f":"SUM(H34:H36)","v":540},{"$f":"IF($H37=0,\"\",($H37/$H33)-1)","v":-0.25619834710743805},49650,{"$f":"IF($J37=0,\"\",($J37/$J33)-1)","v":0.15569935522916123},{"$f":"SUM(L34:L36)","v":66253},{"$f":"IF($L37=0,\"\",($L37/$L33)-1)","v":1.1959676187566881E-2},{"$f":"SUM(N34:N36)","v":82003},{"$f":"IF($N37=0,\"\",($N37/$N33)-1)","v":-8.1188584746047621E-2},{"$f":"SUM(P34:P36)","v":75922},null,null,null,null,null,null,null,null,null,null,null,null,null,null,null,null,null,null,null,{"$f":"D34+D36","v":4245}," 2018 (A) S+e",null,{"$f":"L34+L36","v":1901},{"$f":"IF($L31=0,\"\",($AM37/$L31)-1)","v":-0.75}]
[null,2019,"Apolo",{"$f":"SUMIF(Dados!$A$2:$G$85,$B38,Dados!$G$2:$G$85)","v":12253},{"$f":"IF($D35=0,\"\",($D38/$D35)-1)","v":-0.66776931211192747},{"$f":"SUMIF(Dados!$A$2:$P$85,$B38,Dados!$O$2:$O$85)","v":0},{"$f":"IF($F38=0,\"\",($F38/$F35)-1)","v":""},{"$f":"SUMIF(Dados!$A$2:$Q$85,$B38,Dados!$Q$2:$Q$85)","v":172},{"$f":"IF($H38=0,\"\",IF($H35=0,\"\",($H38/$H35)-1))","v":-0.68148148148148147},12425,{"$f":"IF($J35=0,\"\",($J38/$J35)-1)","v":-0.72635172337848253},{"$f":"SUMIF(Dados!$A$2:$G$85,$B38,Dados!$H$2:$H$85)","v":50954},{"$f":"IF($L35=0,\"\",($L38/$L35)-1)","v":-0.20819865738438592},{"$f":"VLOOKUP($B38&TA!$F$4,Dados!$A$2:$K$85,10,0)","v":51732},{"$f":"IF($N38=0,\"\",IF($N35=0,\"\",($N38/$N35)-1))","v":-0.33548279361327693},{"$f":"VLOOKUP($B38&TA!$F$4,Dados!$A$2:$K$85,11,0)","v":42129}]
[null,null,"Eproc",{"$f":"SUMIF(Dados!$A$2:$V$85,$B38,Dados!$C$2:$C$85)","v":35620},{"$f":"IF($D36=0,\"\",($D39/$D36)-1)","v":7.3930254476908583},{"$f":"SUMIF(Dados!$A$2:$V$85,$B38,Dados!$T$2:$T$85)","v":2},null,null,null,35622,{"$f":"IF($J36=0,\"\",($J39/$J36)-1)","v":7.3934967012252599},{"$f":"SUMIF(Dados!$A$2:$V$85,$B38,Dados!$D$2:$D$85)","v":17099},{"$f":"IF($L36=0,\"\",($L39/$L36)-1)","v":34.622916666666669},{"$f":"VLOOKUP($B38&TA!$F$4,Dados!$A$2:$K$85,6,0)","v":31489},{"$f":"IF($N39=0,\"\",IF($N36=0,\"\",($N39/$N36)-1))","v":6.5804044294655757},{"$f":"VLOOKUP($B38&TA!$F$4,Dados!$A$2:$K$85,7,0)","v":31131}]
[null,"Total",null,{"$f":"D38+D39","v":47873},{"$f":"IF($D40=0,\"\",($D40/$D37)-1)","v":0.16405680105043041},{"$f":"F38+F39","v":2},null,{"$f":"H38+H39","v":172},{"$f":"IF($H37=0,\"\",($H40/$H37)-1)","v":-0.68148148148148147},48047,{"$f":"IF($J37=0,\"\",($J40/$J37)-1)","v":-3.2286002014098703E-2},{"$f":"L38+L39","v":68053},{"$f":"IF($L37=0,\"\",($L40/$L37)-1)","v":2.7168581045386553E-2},{"$f":"N38+N39","v":83221},{"$f":"IF($N37=0,\"\",($N40/$N37)-1)","v":1.4853115129934258E-2},{"$f":"P38+P39","v":73260}]
[null,"Consolidado","Siapro",{"$f":"SUM(D12:D19)+D22+D25+D28+D31+D34","v":415265},null,null,null,null,null,{"$f":"SUM(J12:J19)+J22+J25+J28+J31+J34","v":415265},null,{"$f":"SUM(L12:L19)+L22+L25+L28+L31+L34","v":678848}]
[null,null,"Apolo",{"$f":"D20+D23+D26+D29+D32+D35+D38","v":237180},null,{"$f":"F20+F23+F26+F29+F32+F35+F38","v":16007},null,{"$f":"H20+H23+H26+H29+H32+H35+H38","v":7431},null,{"$f":"J20+J23+J26+J29+J32+J35+J38","v":260618},null,{"$f":"L20+L23+L26+L29+L32+L35+L38","v":296944}]
[null,null,"Eproc",{"$f":"D36+D39","v":39864},null,{"$f":"F36+F39","v":2},null,{"$f":"H36+H39","v":0},null,{"$f":"J36+J39","v":39866},null,{"$f":"L36+L39","v":17579}]
[null,"Total",null,{"$f":"SUM(D41:D43)","v":692309},null,{"$f":"F42+F43","v":16009},null,{"$f":"H42+H43","v":7431},null,{"$f":"SUM(J41:J43)","v":715749},null,{"$f":"SUM(L41:L43)","v":993371}]
[]
["Legenda: Tramitação Ajustada (TA) do Siapro = TRAM - O (Suspensos) - P (Aguardando o Julgamento do Agravo)                    (*) Tram. Ajustada (TA) do Apolo  = TRAM - O (Suspensos)"]
["OBS.: Os valores poderão ser alterados, em função de modificações na base de dados, por parte do usuário."]
[]
["(*) 1ª Distribuição no TRF = CASOS NOVOS para o TRF    (*) Distribuídos para o Apolo (Origem: Sistema Siapro) = Com a implantação do Sistema Apolo (DEZ/2013), o Sistema Siapro passou a ser descontinuado."]
["_ Na semana de 19 a 23/03/2018, iniciou-se a Migração de TODOS os processos do sistema Siapro para o Sistema Apolo ."]
["_ Desde o dia 27 de Abril de 2018, o NOVO sistema processual \"Eproc\" está em funcionamento no Tribunal, o Sistema Apolo passou a ser descontinuado."]

{"sheet":"GP3AT","index":11,"n_rows":2,"n_cols":7,"rows_kept":2,"cut":false,"hidden":true,"merged":[[18,1,32,5],[18,7,32,11],[18,13,32,17],[34,1,48,5],[34,7,48,11],[34,13,48,17],[2,1,16,5],[2,7,16,11],[2,13,16,17],[1,6,1,12],[0,0,0,18]]}
["TRF2 - Gráficos de Pizza Comparativo Anual entre Processos Siapro, Apolo e Eproc"]
[null,null,null,null,null,null,"Selecione o Triênio"]

{"sheet":"GTvAT","index":12,"n_rows":1,"n_cols":1,"rows_kept":1,"cut":false,"hidden":true,"merged":[[0,0,0,13],[1,1,24,7],[1,9,24,15],[26,1,49,7],[26,9,49,15]]}
[{"$f":"TA!$F$24","v":"TRF2 - Série HISTÓRICA da TRAMITAÇÃO (DEZEMBRO)"}]

{"sheet":"GDvAT","index":13,"n_rows":1,"n_cols":1,"rows_kept":1,"cut":false,"hidden":true,"merged":[[0,0,0,13],[1,1,24,7],[1,9,24,15],[26,1,49,7],[26,9,49,15]]}
[{"$f":"TA!$F$25","v":"TRF2 - Série HISTÓRICA da 1ª DISTRIBUICÃO (TOTAL)"}]

{"sheet":"GJvAT","index":14,"n_rows":1,"n_cols":1,"rows_kept":1,"cut":false,"hidden":true,"merged":[[0,0,0,13],[1,1,24,7],[1,9,24,15],[26,1,49,7],[26,9,49,15]]}
[{"$f":"TA!$F$26","v":"TRF2 - Série HISTÓRICA de JULGADOS (TOTAL)"}]

{"sheet":"TA","index":15,"n_rows":69,"n_cols":13,"rows_kept":69,"cut":false,"hidden":true,"merged":[[0,5,0,6],[17,5,17,6],[17,7,17,8],[17,9,17,10],[8,5,10,5],[11,5,13,5],[14,5,16,5]]}
["Anos","AnosSA","Meses","Meses Abrev","Trienio","IPC",null,null,null,null,"VER CÉLULAS AJ (all)",null,1]
[2006,2013,"JANEIRO","Jan","2013 | 2014 | 2015","Mês Public","Ano Public",null,null,null,null,null,2]
[2007,2014,"FEVEREIRO","Fev","2014 | 2015 | 2016",12,2019,null,null,null,null,null,3]
[2008,2015,"MARÇO","Mar","2015 | 2016 | 2017",{"$f":"INDEX(ListaMeses,F3)","v":"Dezembro"},"F5, G23 a G25 | PvAnualT no AnoAtual ident MêsAtual E pesq TRAM e TA",null,null,null,null,null,4]
[2009,2016,"ABRIL","Abr","2016 | 2017 | 2018",{"$f":"IF($E$7<5,\"Dezembro\",$F$4)","v":"Dezembro"},"J15, J16, K15 e K16 (TRAM e TA último ano abaixo)",null,null,null,null,null,5]
[2010,2017,"MAIO","Mai","2017 | 2018 | 2019",{"$f":"IF($E$7<5,\"Dezembro/\",F5&\"/\")","v":"Dezembro/"},"F7 (Texto TRAM último ano abaixo)",null,null,null,null,null,6]
[2011,2018,"JUNHO","Jun",5,{"$f":"IF($E$7<5,\"em \",\"até \"&F6)","v":"até Dezembro/"},"L16 e L17 (Texto DISTR e JULG último ano abaixo)",null,null,null,null,null,7]
[2012,2019,"JULHO","Jul","only Tram (pcausa2018)",null,null,"D","J","TR","TA",null,8]
[null,null,"AGOSTO","Ago",{"$f":"IF($F$9>2017,\"Eproc\",\"Siapro\")","v":"Siapro"},{"$f":"INDEX(ListaAnosSA,$E$7)","v":2017},{"$f":"IF($F$9>2018,\"Eproc\",IF($F$9=2018,\"Eproc + Siapro\",\"Siapro\"))","v":"Siapro"},{"$f":"SUMIF(Dados!$A$2:$G$171,$F$9,Dados!$C$2:$C$171)","v":0},{"$f":"SUMIF(Dados!$A$2:$G$171,$F$9,Dados!$D$2:$D$171)","v":7604},{"$f":"VLOOKUP($F$9&\"Dezembro\",Dados!$A$2:$G$171,6,0)","v":8724},{"$f":"VLOOKUP($F$9&\"Dezembro\",Dados!$A$2:$G$171,7,0)","v":8246},{"$f":"TEXT(J11,\"#.##0\")&\"  Processos em TRAMITAÇÃO em Dezembro/\"&F9","v":"89.249  Processos em TRAMITAÇÃO em Dezembro/2017"}]
[null,null,"SETEMBRO","Set","Apolo",null,"Apolo",{"$f":"SUMIF(Dados!$A$2:$G$171,$F$9,Dados!$G$2:$G$171)","v":42008},{"$f":"SUMIF(Dados!$A$2:$G$171,$F$9,Dados!$H$2:$H$171)","v":57866},{"$f":"VLOOKUP($F$9&\"Dezembro\",Dados!$A$2:$K$171,10,0)","v":80525},{"$f":"VLOOKUP($F$9&\"Dezembro\",Dados!$A$2:$K$171,11,0)","v":76077},{"$f":"TEXT(H11,\"#.##0\")&\"  Processos 1ª DISTRIBUIÇÃO em \"&F9","v":"42.008  Processos 1ª DISTRIBUIÇÃO em 2017"}]
[null,null,"OUTUBRO","Out","Total",null,"Total",{"$f":"H9+H10","v":42008},{"$f":"I9+I10","v":65470},{"$f":"J9+J10","v":89249},{"$f":"K9+K10","v":84323},{"$f":"TEXT(I11,\"#.##0\")&\"  Processos JULGADOS em \"&F9","v":"65.470  Processos JULGADOS em 2017"}]
[null,null,"NOVEMBRO","Nov",{"$f":"IF($F$12>2017,\"Eproc\",\"Siapro\")","v":"Eproc"},{"$f":"$F$9+1","v":2018},{"$f":"IF($F$12>2018,\"Eproc\",IF($F$12=2018,\"Eproc + Siapro\",\"Siapro\"))","v":"Eproc + Siapro"},{"$f":"SUMIF(Dados!$A$2:$G$171,$F$12,Dados!$C$2:$C$171)","v":4245},{"$f":"SUMIF(Dados!$A$2:$G$171,$F$12,Dados!$D$2:$D$171)","v":1901},{"$f":"VLOOKUP($F$12&\"Dezembro\",Dados!$A$2:$G$171,6,0)","v":4154},{"$f":"VLOOKUP($F$12&\"Dezembro\",Dados!$A$2:$G$171,7,0)","v":4149},{"$f":"TEXT(J14,\"#.##0\")&\"  Processos em TRAMITAÇÃO em Dezembro/\"&F12","v":"82.003  Processos em TRAMITAÇÃO em Dezembro/2018"}]
[null,null,"Dezembro","Dez","Apolo",null,"Apolo",{"$f":"SUMIF(Dados!$A$2:$G$171,$F$12,Dados!$G$2:$G$171)","v":36881},{"$f":"SUMIF(Dados!$A$2:$G$171,$F$12,Dados!$H$2:$H$171)","v":64352},{"$f":"VLOOKUP($F$12&\"Dezembro\",Dados!$A$2:$K$171,10,0)","v":77849},{"$f":"VLOOKUP($F$12&\"Dezembro\",Dados!$A$2:$K$171,11,0)","v":71773},{"$f":"TEXT(H14,\"#.##0\")&\"  Processos 1ª DISTRIBUIÇÃO em \"&F12","v":"41.126  Processos 1ª DISTRIBUIÇÃO em 2018"}]
[null,null,null,null,"Total",null,"Total",{"$f":"H12+H13","v":41126},{"$f":"I12+I13","v":66253},{"$f":"J12+J13","v":82003},{"$f":"K12+K13","v":75922},{"$f":"TEXT(I14,\"#.##0\")&\"  Processos JULGADOS em \"&F12","v":"66.253  Processos JULGADOS em 2018"}]
[null,null,null,null,{"$f":"IF($F$15>2017,\"Eproc\",\"Siapro\")","v":"Eproc"},{"$f":"$F$9+2","v":2019},{"$f":"IF($F$15>2018,\"Eproc\",IF($F$15=2018,\"Eproc + Siapro\",\"Siapro\"))","v":"Eproc"},{"$f":"SUMIF(Dados!$A$2:$G$171,$F$15,Dados!$C$2:$C$171)","v":35620},{"$f":"SUMIF(Dados!$A$2:$G$171,$F$15,Dados!$D$2:$D$171)","v":17099},{"$f":"VLOOKUP($F$15&$F$5,Dados!$A$2:$G$171,6,0)","v":31489},{"$f":"VLOOKUP($F$15&$F$5,Dados!$A$2:$G$171,7,0)","v":31131},{"$f":"TEXT(J17,\"#.##0\")&\"  Processos em TRAMITAÇÃO em Dezembro/\"&F15","v":"83.221  Processos em TRAMITAÇÃO em Dezembro/2019"}]
[null,null,null,null,"Apolo",null,"Apolo",{"$f":"SUMIF(Dados!$A$2:$G$171,$F$15,Dados!$G$2:$G$171)","v":12253},{"$f":"SUMIF(Dados!$A$2:$G$171,$F$15,Dados!$H$2:$H$171)","v":50954},{"$f":"VLOOKUP($F$15&$F$5,Dados!$A$2:$K$171,10,0)","v":51732},{"$f":"VLOOKUP($F$15&$F$5,Dados!$A$2:$K$171,11,0)","v":42129},{"$f":"TEXT(H17,\"#.##0\")&\"  Processos 1ª DISTRIBUIÇÃO em \"&F15","v":"47.873  Processos 1ª DISTRIBUIÇÃO em 2019"}]
[7,"usedM2B",{"$f":"A17-1","v":6},"for PaMT","Total",null,"Total",{"$f":"H15+H16","v":47873},{"$f":"I15+I16","v":68053},{"$f":"J15+J16","v":83221},{"$f":"K15+K16","v":73260},{"$f":"TEXT(I17,\"#.##0\")&\"  Processos JULGADOS em \"&F15","v":"68.053  Processos JULGADOS em 2019"}]
[{"$f":"INDEX(ListaAnosSA,A17)","v":2019},null,{"$f":"IF(C17=0,2012,INDEX(ListaAnosSA,C17))","v":2018},null,null,"Tramitação",null,"Distribuídos",null,"Julgados",null,null,18]
[14,"Apolo",{"$f":"A19-1","v":13},{"$f":"IF($A$20<2018,\"Siapro\",\"Eproc\")","v":"Eproc"},"201804->","Dezembro","Novembro","Dezembro","Novembro","Dezembro","Novembro",null,19]
[{"$f":"INDEX(ListaAnosG,A19)","v":2019},"Eproc",{"$f":"IF(C19=0,2005,INDEX(ListaAnosG,C19))","v":2018},{"$f":"IF($A$20>2018,\"Eproc\",\"Siapro\")","v":"Eproc"},"010203",{"$f":"VLOOKUP($C$18&\"Dezembro\",Dados!$A$2:$G$171,6,0)","v":4154},{"$f":"VLOOKUP($C$18&\"Novembro\",Dados!$A$2:$G$171,6,0)","v":2930},{"$f":"VLOOKUP($C$18&\"Dezembro\",Dados!$A$2:$G$171,4,0)","v":1256},{"$f":"VLOOKUP($C$18&\"Novembro\",Dados!$A$2:$G$171,4,0)","v":638},{"$f":"VLOOKUP($C$18&\"Dezembro\",Dados!$A$2:$G$171,5,0)","v":254},{"$f":"VLOOKUP($C$18&\"Novembro\",Dados!$A$2:$G$171,5,0)","v":94},null,20]
[null,null,null,null,null,null,null,null,null,null,null,null,21]
[null,null,null,{"$f":"IF(TA!$A$20<2018,\"Siapro\",\"Eproc\")","v":"Eproc"},null,null,null,null,null,null,null,null,22]
[null,null,null,null,null,null,null,null,null,null,null,null,23]
[{"$f":"\"TRF2 - Processos em TRAMITAÇÃO em \" & $A$20","v":"TRF2 - Processos em TRAMITAÇÃO em 2019"},null,null,null,"tpTM2B_TM3B18",{"$f":"\"TRF2 - Série HISTÓRICA da TRAMITAÇÃO (DEZEMBRO)\"","v":"TRF2 - Série HISTÓRICA da TRAMITAÇÃO (DEZEMBRO)"},null,null,null,"tpTAT",null,"AnosG",24]
[{"$f":"\"TRF2 - Processos DISTRIBUÍDOS (1ª Distribuição) em \" & $A$20","v":"TRF2 - Processos DISTRIBUÍDOS (1ª Distribuição) em 2019"},null,null,null,"tpDM2B_DM3B18",{"$f":"\"TRF2 - Série HISTÓRICA da 1ª DISTRIBUICÃO (TOTAL)\"","v":"TRF2 - Série HISTÓRICA da 1ª DISTRIBUICÃO (TOTAL)"},null,null,null,"tpDAT",null,2006,25]
[{"$f":"\"TRF2 - Processos JULGADOS em \" & $A$20","v":"TRF2 - Processos JULGADOS em 2019"},null,null,null,"tpJM2B_JM3B18",{"$f":"\"TRF2 - Série HISTÓRICA de JULGADOS (TOTAL)\"","v":"TRF2 - Série HISTÓRICA de JULGADOS (TOTAL)"},null,null,null,"tpJAT",null,2007,26]
[null,null,null,null,null,null,null,null,null,null,null,2008,27]
[{"$f":"\"TRF2 / \" & $A$20 & \" - Tramitação no \" & $D$22","v":"TRF2 / 2019 - Tramitação no Eproc"},null,null,null,"TM2B",{"$f":"\"TRF2 - Tramitação no Siapro\"","v":"TRF2 - Tramitação no Siapro"},null,null,null,"TAT",null,2009,28]
[{"$f":"\"TRF2 / \" & $A$20 & \" - Tramitação no Apolo\"","v":"TRF2 / 2019 - Tramitação no Apolo"},null,null,null,null,{"$f":"\"TRF2 - Tramitação no Apolo (A partir de Dez/2013)\"","v":"TRF2 - Tramitação no Apolo (A partir de Dez/2013)"},null,null,null,null,null,2010,29]
[{"$f":"\"TRF2 / \" & $A$20 & \" - TOTAL da Tramitação (\" & $D$22 & \" e Apolo)\"","v":"TRF2 / 2019 - TOTAL da Tramitação (Eproc e Apolo)"},null,null,null,null,{"$f":"\"TRF2 - TOTAL da Tramitação (Siapro, Apolo e Eproc)\"","v":"TRF2 - TOTAL da Tramitação (Siapro, Apolo e Eproc)"},null,null,null,null,null,2011,30]
[{"$f":"\"TRF2 / \" & $A$20 & \" - Tramitação \" & $D$22 & \" + Apolo\"","v":"TRF2 / 2019 - Tramitação Eproc + Apolo"},null,null,null,null,{"$f":"\"TRF2 - Tramitação no Eproc (A partir de Mai/2018)\"","v":"TRF2 - Tramitação no Eproc (A partir de Mai/2018)"},null,null,null,null,null,2012,31]
[null,null,null,null,null,null,null,null,null,null,null,2013,32]
[{"$f":"IF($A$20=2017,$A$49,$A$48)","v":"TRF2 / 2019 - Distribuídos para o Eproc"},null,null,null,"DM2B",{"$f":"\"TRF2 - 1ª Distribuição para o Siapro (Somente até Mar/2018)\"","v":"TRF2 - 1ª Distribuição para o Siapro (Somente até Mar/2018)"},null,null,null,"DAT",null,2014,33]
[{"$f":"\"TRF2 / \" & $A$20 & \" - Distribuídos para o Apolo\"","v":"TRF2 / 2019 - Distribuídos para o Apolo"},null,null,null,null,{"$f":"\"TRF2 - 1ª Distribuição para o Apolo (A partir de Dez/2013)\"","v":"TRF2 - 1ª Distribuição para o Apolo (A partir de Dez/2013)"},null,null,null,null,null,2015,34]
[{"$f":"\"TRF2 / \" & $A$20 & \" - TOTAL de Distribuídos (\" & $D$22 & \" e Apolo)\"","v":"TRF2 / 2019 - TOTAL de Distribuídos (Eproc e Apolo)"},null,null,null,null,{"$f":"\"TRF2 - TOTAL da 1ª Distribuição (Siapro, Apolo e Eproc)\"","v":"TRF2 - TOTAL da 1ª Distribuição (Siapro, Apolo e Eproc)"},null,null,null,null,null,2016,35]
[{"$f":"\"TRF2 / \" & $A$20 & \" - Distribuídos \" & $D$22 & \" + Apolo\"","v":"TRF2 / 2019 - Distribuídos Eproc + Apolo"},null,null,null,null,{"$f":"\"TRF2 - 1ª Distribuição para o Eproc (A partir de Mai/2018)\"","v":"TRF2 - 1ª Distribuição para o Eproc (A partir de Mai/2018)"},null,null,null,null,null,2017,36]
[null,null,null,null,null,null,null,null,null,null,null,2018,37]
[{"$f":"\"TRF2 / \" & $A$20 & \" - Julgados no \" & $D$22","v":"TRF2 / 2019 - Julgados no Eproc"},null,null,null,"JM2B",{"$f":"\"TRF2 - Julgados no Siapro (Somente até Mar/2018)\"","v":"TRF2 - Julgados no Siapro (Somente até Mar/2018)"},null,null,null,"JAT",null,2019,38]
[{"$f":"IF($A$20=2013,$A$52,$A$51)","v":"TRF2 / 2019 - Julgados no Apolo"},null,null,null,null,{"$f":"\"TRF2 - Julgados no Apolo (A partir de Jan/2014)\"","v":"TRF2 - Julgados no Apolo (A partir de Jan/2014)"},null,null,null,null,null,null,39]
[{"$f":"\"TRF2 / \" & $A$20 & \" - TOTAL de Julgados (\" & $D$22 & \" e Apolo)\"","v":"TRF2 / 2019 - TOTAL de Julgados (Eproc e Apolo)"},null,null,null,null,{"$f":"\"TRF2 - TOTAL de Julgados (Siapro, Apolo e Eproc)\"","v":"TRF2 - TOTAL de Julgados (Siapro, Apolo e Eproc)"},null,null,null,null,null,null,40]
[{"$f":"\"TRF2 / \" & $A$20 & \" - Julgados \" & $D$22 & \" + Apolo\"","v":"TRF2 / 2019 - Julgados Eproc + Apolo"},null,null,null,null,{"$f":"\"TRF2 - Julgados no Eproc (Somente a partir de Jul/2018)\"","v":"TRF2 - Julgados no Eproc (Somente a partir de Jul/2018)"},null,null,null,null,null,null,41]
[null,null,null,null,null,null,null,null,null,null,null,null,42]
[{"$f":"\"TRAMITAÇÃO no Siapro em \" & $A$20 & \"   (% Variação Mensal)\"","v":"TRAMITAÇÃO no Siapro em 2019   (% Variação Mensal)"},null,null,null,"TMS",null,null,null,null,null,null,null,43]
[{"$f":"\"DISTRIBUÍDOS para o Siapro em \" & $A$20 & \"   (Acumulado Mensal)\"","v":"DISTRIBUÍDOS para o Siapro em 2019   (Acumulado Mensal)"},null,null,null,"DMS",null,null,null,null,null,null,null,44]
[{"$f":"\"JULGADOS no Siapro em \" & $A$20 & \"   (Acumulado Mensal)\"","v":"JULGADOS no Siapro em 2019   (Acumulado Mensal)"},null,null,null,"JMS",null,null,null,null,null,null,null,45]
["A","B","C","D","E","F","G","H","I","J","K","L",46]
["ESCOLHAS:",null,null,null,null,null,null,null,null,null,null,null,47]
[{"$f":"\"TRF2 / \" & $A$20 & \" - Distribuídos para o \" & $D$22","v":"TRF2 / 2019 - Distribuídos para o Eproc"},null,null,null,null,null,null,null,null,null,null,null,48]
[{"$f":"\"TRF2 / \" & $A$20 & \" - NÃO HOUVE Distribuídos para o \" & $D$22","v":"TRF2 / 2019 - NÃO HOUVE Distribuídos para o Eproc"},null,null,null,null,null,null,null,null,null,null,null,49]
[null,null,null,null,null,null,null,null,null,null,null,null,50]
[{"$f":"\"TRF2 / \" & $A$20 & \" - Julgados no Apolo\"","v":"TRF2 / 2019 - Julgados no Apolo"},null,null,null,null,null,null,null,null,null,null,null,51]
[{"$f":"\"TRF2 / \" & $A$20 & \" - Julgados no Apolo (A partir de Jan/2014)\"","v":"TRF2 / 2019 - Julgados no Apolo (A partir de Jan/2014)"},null,null,null,null,null,null,null,null,null,null,null,52]
[null,null,null,null,null,null,null,null,null,null,null,null,53]
[null,null,null,null,null,null,null,null,null,null,null,null,54]
["Modificações:",null,null,null,null,null,null,null,null,null,null,null,55]
["Até",201505,"2015-06-11","GP3AT(3)",null,null,null,null,null,null,null,null,56]
["Em","2015/07","2015-08-21","GP3AT(9)","pwdatu",null,null,null,null,null,null,null,57]
["Até","2015/07","2015-09-01","(A+V+M) juntos",null,null,null,null,null,null,null,null,58]
["Depois",null,null,"(A)(M)(V)",null,null,null,null,null,null,null,null,59]
["Em","2018/10","2018-11-28","Apolo TP=JUD e TJ=2ºGrau para 2018",null,null,null,null,null,null,null,null,60]
[null,null,null,null,null,null,null,null,null,null,null,null,61]
[null,null,null,null,null,null,null,null,null,null,null,null,62]
[null,null,null,null,null,null,null,null,null,null,null,null,63]
[null,null,null,null,null,null,null,null,null,null,null,null,64]
[null,null,null,null,null,null,null,null,null,null,null,null,65]
[null,null,null,null,null,null,null,null,null,null,null,null,66]
[null,null,null,null,null,null,null,null,null,null,null,null,67]
["GJaM2B","destiny"," <=used by Sub ig_AnoGM3B18 when any G??M3B18 <>2018 (Initiate for G??M2B)",null,null,null,null,null,null,null,null,null,68]
["GJaM3B18","destiny"," <=used by Sub ig_AnoGM2B when any G??M2B=2018 (Initiate for G??M2B)",null,null,null,null,null,null,null,null,null,69]

{"sheet":"Dados","index":16,"n_rows":191,"n_cols":30,"rows_kept":191,"cut":false,"hidden":true,"merged":[]}
["Coluna Auxiliar1","Ano","Mês","Dist._sE\n","Julg._sE\n","TRAM_sE\n","TA_sE\n","Dist._A\n","Julg._A\n","TRAM_A\n","TA_A\n","Dist._sE\nAcum","Julg._sE\nAcum","Dist._A\nAcum","Julg._A\nAcum","M_A\n","M_A Acum","V_A\n","V_A Acum","D+M+V\nAcum","M_E\n","M_E Acum","Dse","Jse","TRSe","TASe","DA","JA ","TRA","TAA"]
[{"$f":"B2&C2","v":"2019Janeiro"},2019,"Janeiro",1464,86,5594,5587,2228,{"$f":"2216-1","v":2215},77634,71367,{"$f":"D2","v":1464},{"$f":"E2","v":86},{"$f":"H2","v":2228},{"$f":"I2","v":2215},0,{"$f":"P2","v":0},7,{"$f":"R2","v":7},{"$f":"N2+Q2+S2","v":2235},0,{"$f":"U2","v":0}]
["2019Fevereiro",2019,"Fevereiro",2070,368,7517,7502,1905,{"$f":"6509+1","v":6510},75155,68481,{"$f":"L2+D3","v":3534},{"$f":"M2+E3","v":454},{"$f":"N2+H3","v":4133},8725,0,{"$f":"Q2+P3","v":0},23,{"$f":"S2+R3","v":30},4163,0,{"$f":"V2+U3","v":0}]
["2019Março",2019,"Março",1711,327,9051,{"$f":"9033+2","v":9035},1203,{"$f":"3666+1","v":3667},72009,64860,5245,781,5336,12392,0,0,15,45,5381,0,0]
["2019Abril",2019,"Abril",2261,540,{"$f":"11183-2","v":11181},11162,1292,4327,71510,64333,7506,1321,6628,16719,0,0,15,60,6688,0,0]
["2019Maio",2019,"Maio",3218,{"$f":"602-1","v":601},13949,13919,1391,{"$f":"5071+3","v":5074},68646,61176,10724,1922,8019,21793,0,0,15,75,8094,0,0]
["2019Junho",2019,"Junho",2876,822,16463,16417,840,{"$f":"5255-1+1","v":5255},66611,58992,13600,2744,8859,27048,0,0,9,84,8943,0,0]
["2019Julho",2019,"Julho",{"$f":"3793-1","v":3792},{"$f":"1591-1","v":1590},{"$f":"19627+2","v":19629},{"$f":"19569+2","v":19571},913,{"$f":"5011+1+1-1","v":5012},{"$f":"64135-2","v":64133},{"$f":"56030-2","v":56028},17392,4334,9772,32060,0,0,11,95,9867,0,0]
["2019Agosto",2019,"Agosto",3935,{"$f":"1759-2","v":1757},{"$f":"22758+1","v":22759},{"$f":"22680+1","v":22681},732,{"$f":"4115+1-6","v":4110},{"$f":"61220-8","v":61212},{"$f":"52669-8","v":52661},21327,6091,10504,36170,0,0,23,118,10622,0,0]
["2019Setembro",2019,"Setembro",{"$f":"4041-2","v":4039},2270,{"$f":"25723-1","v":25722},{"$f":"25587-1","v":25586},558,4327,{"$f":"58452-13","v":58439},{"$f":"49548-13","v":49535},25366,8361,11062,40497,0,0,13,131,11193,0,0]
["2019Outubro",2019,"Outubro",{"$f":"4141-2","v":4139},{"$f":"2995-3","v":2992},{"$f":"28484-2","v":28482},{"$f":"28259-2","v":28257},552,{"$f":"3549-1-5","v":3543},{"$f":"55492-13","v":55479},{"$f":"46516-13","v":46503},29505,11353,11614,44040,0,0,14,145,11759,0,0]
["2019Novembro",2019,"Novembro",{"$f":"3519-2","v":3517},{"$f":"2840-1","v":2839},{"$f":"30667-4","v":30663},{"$f":"30377-4","v":30373},357,{"$f":"3568+1+1-2","v":3568},{"$f":"53256-8","v":53248},{"$f":"43713-8","v":43705},33022,14192,11971,47608,0,0,17,162,12133,2,2]
["2019Dezembro",2019,"Dezembro",{"$f":"2599-1","v":2598},2907,{"$f":"31494-5","v":31489},{"$f":"31136-5","v":31131},282,3346,{"$f":"51740-8","v":51732},{"$f":"42137-8","v":42129},35620,17099,12253,50954,0,0,10,172,12425,0,2,{"$f":"SUM(D2:D13)","v":35620},{"$f":"SUM(E2:E13)","v":17099},{"$f":"SUM(F2:F13)","v":222499},{"$f":"SUM(G2:G13)","v":221221},{"$f":"SUM(H2:H13)","v":12253},{"$f":"SUM(I2:I13)","v":50954},{"$f":"SUM(J2:J13)","v":775808},{"$f":"SUM(K2:K13)","v":679770}]
[{"$f":"B14&C14","v":"2018Janeiro"},2018,"Janeiro",0,360,8523,8045,2629,2110,81555,77335,{"$f":"D14","v":0},{"$f":"E14","v":360},{"$f":"H14","v":2629},{"$f":"I14","v":2110},4,{"$f":"P14","v":4},327,{"$f":"R14","v":327},{"$f":"N14+Q14+S14","v":2960}]
["2018Fevereiro",2018,"Fevereiro",0,755,8115,7646,2845,4617,81439,77175,{"$f":"L14+D15","v":0},{"$f":"M14+E15","v":1115},{"$f":"N14+H15","v":5474},{"$f":"O14+I15","v":6727},35,{"$f":"Q14+P15","v":39},98,{"$f":"S14+R15","v":425},5938]
["2018Março",2018,"Março",1,306,160,160,2732,5330,87839,83086,{"$f":"L15+D16","v":1},1421,8206,12057,7823,7862,38,463,16531]
["2018Abril",2018,"Abril",0,0,0,0,3126,5785,86634,81788,{"$f":"D17","v":0},{"$f":"E17","v":0},11332,17842,103,7965,8,471,19768,0,{"$f":"U17","v":0}]
["2018Maio",2018,"Maio",26,0,26,26,3430,6809,85050,80433,{"$f":"L17+D18","v":26},{"$f":"M17+E18","v":0},14762,24651,12,7977,2,473,23212,0,{"$f":"V17+U18","v":0}]
["2018Junho",2018,"Junho",102,0,128,128,2937,5708,83934,79461,{"$f":"L18+D19","v":128},{"$f":"M18+E19","v":0},17699,30359,5,7982,3,476,26157,0,0]
["2018Julho",2018,"Julho",221,2,349,349,3696,5797,82900,78255,349,2,21395,36156,2,7984,3,479,29858,0,0]
["2018Agosto",2018,"Agosto",441,12,787,787,3792,6060,82869,78167,790,14,25187,42216,0,7984,1,480,33651,0,0]
["2018Setembro",2018,"Setembro",450,41,1226,1225,2809,6273,80805,75916,1240,55,27996,48489,0,7984,13,493,36473,0,0]
["2018Outubro",2018,"Outubro",1110,77,2314,2311,3041,6292,79116,73907,2350,132,31037,54781,0,7984,13,506,39527,0,0]
[{"$f":"B24&C24","v":"2018Novembro"},2018,"Novembro",638,94,2930,2926,3745,5394,79405,73934,2988,226,34782,60175,0,7984,20,526,43292,0,0]
[{"$f":"B25&C25","v":"2018Dezembro"},2018,"Dezembro",1256,254,4154,4149,2099,4177,77849,71773,4244,480,36881,64352,0,7984,14,540,45405,null,null,{"$f":"SUM(D14:D25)","v":4245},{"$f":"SUM(E14:E25)","v":1901},{"$f":"SUM(F14:F25)","v":28712},{"$f":"SUM(G14:G25)","v":27752},36881,64352,989395,931230]
[{"$f":"B26&C26","v":"2017Janeiro"},2017,"Janeiro",0,180,16135,14955,2164,1153,80666,75463,{"$f":"D26","v":0},{"$f":"E26","v":180},{"$f":"H26","v":2164},{"$f":"I26","v":1153},9,{"$f":"P26","v":9},6,{"$f":"R26","v":6},{"$f":"N26+Q26+S26","v":2179}]
[{"$f":"B27&C27","v":"2017Fevereiro"},2017,"Fevereiro",0,475,15152,14005,2887,5075,79927,74573,{"$f":"L26+D27","v":0},655,{"$f":"N26+H27","v":5051},6228,15,{"$f":"Q26+P27","v":24},67,{"$f":"S26+R27","v":73},{"$f":"N27+Q27+S27","v":5148}]
["2017Março",2017,"Março",0,735,12778,11842,3892,5110,78756,73274,0,1390,8943,11338,10,34,24,97,9074]
["2017Abril",2017,"Abril",0,700,12105,11260,3022,4481,79139,73830,0,2090,11965,15819,1,35,1,98,12098]
["2017Maio",2017,"Maio",0,733,11377,10556,4262,5892,79110,73710,0,2823,16227,21711,16,51,27,125,16403]
["2017Junho",2017,"Junho",0,668,10766,10101,3635,5491,79461,74030,0,3491,{"$f":"N30+H31","v":19862},27202,16,67,21,146,{"$f":"N31+Q31+S31","v":20075}]
["2017Julho",2017,"Julho",0,663,10262,9643,3913,5533,79894,74403,0,4154,23775,32735,21,88,11,157,24020]
["2017Agosto",2017,"Agosto",0,890,9752,9251,4248,6063,80079,74548,0,5044,28023,38798,6,94,50,207,28324]
["2017Setembro",2017,"Setembro",0,632,9373,8868,3957,5401,80978,75369,0,5676,31980,44199,44,138,2,209,32327]
["2017Outubro",2017,"Outubro",0,803,9497,9018,4194,5180,81450,77255,0,6479,36174,49379,7,145,3,212,36531]
["2017Novembro",2017,"Novembro",0,707,9144,8663,3220,4700,81954,77604,0,7186,39394,54079,22,167,256,468,40029]
["2017Dezembro",2017,"Dezembro",0,418,8724,8246,2614,3787,80525,76077,0,7604,42008,57866,60,227,258,726,42961,null,null,{"$f":"SUM(D26:D37)","v":0},{"$f":"SUM(E26:E37)","v":7604},{"$f":"SUM(F26:F37)","v":135065},{"$f":"SUM(G26:G37)","v":126408},{"$f":"SUM(H26:H37)","v":42008},{"$f":"SUM(I26:I37)","v":57866},{"$f":"SUM(J26:J37)","v":961939},{"$f":"SUM(K26:K37)","v":900136}]
[{"$f":"B38&C38","v":"2016Janeiro"},2016,"Janeiro",0,825,37599,35000,3413,2946,76839,73708,{"$f":"D38","v":0},{"$f":"E38","v":825},{"$f":"H38","v":3413},{"$f":"I38","v":2946},10,{"$f":"P38","v":10},0,{"$f":"R38","v":0},{"$f":"N38+Q38+S38","v":3423}]
[{"$f":"B39&C39","v":"2016Fevereiro"},2016,"Fevereiro",0,983,36419,33459,3395,3374,78079,74939,{"$f":"L38+D39","v":0},{"$f":"M38+E39","v":1808},{"$f":"N38+H39","v":6808},{"$f":"O38+I39","v":6320},18,{"$f":"Q38+P39","v":28},9,{"$f":"S38+R39","v":9},{"$f":"N39+Q39+S39","v":6845}]
["2016Março",2016,"Março",2,1296,35215,32465,4348,4527,74366,71192,2,3104,11156,10847,39,67,3,12,11235]
["2016Abril",2016,"Abril",0,1034,32994,30402,4166,4552,76202,72981,2,4138,15322,15399,19,86,11,23,15431]
["2016Maio",2016,"Maio",0,909,29689,27149,4050,3890,78084,74767,2,5047,19372,19289,9,95,23,46,19513]
["2016Junho",2016,"Junho",0,722,27798,25575,4395,5403,79893,76530,{"$f":"L42+D43","v":2},{"$f":"M42+E43","v":5769},{"$f":"N42+H43","v":23767},{"$f":"O42+I43","v":24692},17,{"$f":"Q42+P43","v":112},7,53,{"$f":"N43+Q43+S43","v":23932}]
["2016Julho",2016,"Julho",0,713,26931,24718,4153,5445,81557,78182,2,6482,27920,30137,18,130,1,54,28104]
["2016Agosto",2016,"Agosto",0,292,25788,23697,2673,2153,82918,79442,2,6774,30593,32290,1,131,2,56,30780]
["2016Setembro",2016,"Setembro",0,762,22327,20717,4338,3945,83598,79818,2,7536,34931,{"$f":"O45+I46","v":36235},11,142,6,62,35135]
["2016Outubro",2016,"Outubro",0,757,20445,18862,3755,5822,83662,78932,2,8293,38686,{"$f":"O46+I47","v":42057},27,169,9,71,38926]
["2016Novembro",2016,"Novembro",0,814,18663,17216,3530,3695,81676,76704,2,9107,42216,{"$f":"O47+I48","v":45752},25,194,13,84,42494]
["2016Dezembro",2016,"Dezembro",0,577,16985,15697,2597,4306,80830,75705,2,9684,44813,50058,14,208,1,85,45106,null,null,{"$f":"SUM(D38:D49)","v":2},9684,330853,304957,44813,50058,{"$f":"SUM(J38:J49)","v":957704},{"$f":"SUM(K38:K49)","v":912900}]
[{"$f":"B50&C50","v":"2015Janeiro"},2015,"Janeiro",610,1630,74019,69960,2803,2774,49003,48967,{"$f":"D50","v":610},{"$f":"E50","v":1630},{"$f":"H50","v":2803},{"$f":"I50","v":2774},null,null,3409,{"$f":"R50","v":3409},{"$f":"N50+Q50+S50","v":6212}]
[{"$f":"B51&C51","v":"2015Fevereiro"},2015,"Fevereiro",503,2492,72305,68291,3432,2815,50153,50103,{"$f":"L50+D51","v":1113},4122,{"$f":"N50+H51","v":6235},5589,null,null,76,{"$f":"S50+R51","v":3485},{"$f":"N51+Q51+S51","v":9720}]
["2015Março",2015,"Março",12,2749,69119,67511,5951,3805,54273,54179,1125,6871,12186,9394,60,{"$f":"P52","v":60},17,{"$f":"S51+R52","v":3502},15748]
["2015Abril",2015,"Abril",13,2586,62012,61073,4223,4150,59703,57683,1138,9457,16409,13544,4329,{"$f":"Q52+P53","v":4389},88,3590,24388]
["2015Maio",2015,"Maio",13,2326,56600,55654,5246,3553,64869,61970,1151,11783,21655,17097,2270,6659,130,3720,32034]
["2015Junho",2015,"Junho",0,2094,53918,52971,5209,4550,67107,64128,1151,13877,26864,21647,362,7021,247,3967,37852]
["2015Julho",2015,"Julho",1,1956,51132,50055,4921,4915,68642,65629,1152,15833,31785,26562,221,7242,41,4008,43035]
["2015Agosto",2015,"Agosto",1,1595,48962,47250,3778,3967,69072,66041,1153,17428,35563,30529,238,7480,50,4058,47101]
["2015Setembro",2015,"Setembro",0,1374,46557,44498,4012,4075,70376,67338,1153,18802,39575,34604,57,7537,45,4103,51215]
["2015Outubro",2015,"Outubro",1,1585,43858,41471,4745,4418,72864,69806,1154,20387,44320,39022,32,7569,8,4111,56000]
["2015Novembro",2015,"Novembro",6,952,41779,39069,4365,4360,74381,71292,1160,21339,48685,43382,14,7583,5,4116,60384]
["2015Dezembro",2015,"Dezembro",4,1154,39179,36665,2933,3775,75365,72256,1164,22493,51618,47157,5,7588,29,4145,63351,null,null,{"$f":"SUM(D50:D61)","v":1164},{"$f":"SUM(E50:E61)","v":22493},659440,634468,51618,47157,{"$f":"SUM(J50:J61)","v":775808},{"$f":"SUM(K50:K61)","v":749392}]
[{"$f":"B62&C62","v":"2014Janeiro"},2014,"Janeiro",3152,4628,108747,105267,1258,1,1567,1567,{"$f":"D62","v":3152},{"$f":"E62","v":4628},{"$f":"H62","v":1258},{"$f":"I62","v":1},null,null,1,{"$f":"R62","v":1},{"$f":"N62+Q62+S62","v":1259}]
[{"$f":"B63&C63","v":"2014Fevereiro"},2014,"Fevereiro",2562,7698,107149,103719,2591,67,4158,4158,{"$f":"L62+D63","v":5714},{"$f":"M62+E63","v":12326},{"$f":"N62+H63","v":3849},{"$f":"O62+I63","v":68},null,null,null,{"$f":"S62+R63","v":1},{"$f":"N63+Q63+S63","v":3850}]
["2014Março",2014,"Março",2508,5829,105188,101641,2136,151,6294,6294,8222,18155,5985,219,null,null,null,{"$f":"S63+R64","v":1},{"$f":"N64+Q64+S64","v":5986}]
["2014Abril",2014,"Abril",1798,5421,102976,99367,4945,536,11230,11230,10020,23576,10930,755,null,null,null,1,10931]
["2014Maio",2014,"Maio",1723,5522,100335,96533,4400,721,15482,15482,11743,29098,15330,1476,null,null,null,1,15331]
["2014Junho",2014,"Junho",1570,4287,97366,93448,3306,1607,18657,18657,13313,33385,18636,3083,null,null,115,116,18752]
["2014Julho",2014,"Julho",1282,5251,94078,89973,5753,3359,24466,24466,14595,38636,24389,6442,null,null,271,387,24776]
["2014Agosto",2014,"Agosto",1312,4970,91091,87015,6870,3543,31093,31091,15907,43606,31259,9985,null,null,32,419,31678]
["2014Setembro",2014,"Setembro",1572,4552,88449,84401,4579,5164,34938,34931,17479,48158,35838,15149,null,null,null,419,36257]
["2014Outubro",2014,"Outubro",1030,4570,85008,81001,4598,4729,37676,37665,18509,52728,40436,19878,null,null,3,422,40858]
["2014Novembro",2014,"Novembro",669,4117,83096,79111,4538,3830,40463,40448,19178,56845,44974,23708,null,null,68,490,45464]
["2014Dezembro",2014,"Dezembro",555,2840,77078,72977,4325,2849,44255,44232,19733,59685,49299,26557,null,null,1273,1763,51062,null,null,{"$f":"SUM(D62:D73)","v":19733},59685,1140561,1094453,49299,26557,{"$f":"SUM(J62:J73)","v":270279},{"$f":"SUM(K62:K73)","v":270221}]
["2013Janeiro",2013,"Janeiro",5046,4660,97846,94106,null,null,null,null,{"$f":"D74","v":5046},{"$f":"E74","v":4660}]
["2013Fevereiro",2013,"Fevereiro",3768,4862,98157,94534,null,null,null,null,{"$f":"L74+D75","v":8814},{"$f":"M74+E75","v":9522},null,null,null,null,null,null,null,null,null,"TA FOI AJUSTADO, no Portal está 94.534"]
["2013Março",2013,"Março",4410,6505,97814,94109,null,null,null,null,13224,16027,null,null,null,null,null,null,null,null,null,"TA FOI AJUSTADO, no Portal está 94.109"]
["2013Abril",2013,"Abril",3953,7103,97193,93581,null,null,null,null,17177,23130]
["2013Maio",2013,"Maio",4538,7269,97774,94220,null,null,null,null,21715,30399]
["2013Junho",2013,"Junho",3691,6477,97866,94291,null,null,null,null,25406,36876]
["2013Julho",2013,"Julho",6117,6848,99401,95774,null,null,null,null,31523,43724]
["2013Agosto",2013,"Agosto",6703,7651,101525,97754,null,null,null,null,38226,51375]
["2013Setembro",2013,"Setembro",7245,7173,104414,100491,null,null,null,null,45471,58548]
["2013Outubro",2013,"Outubro",6410,9079,105963,102278,null,null,null,null,51881,67627]
["2013Novembro",2013,"Novembro",5031,7656,107690,104040,null,null,null,null,56912,75283]
["2013Dezembro",2013,"Dezembro",4248,6591,108814,105131,308,null,308,308,61160,81874,{"$f":"H85","v":308},null,null,null,null,null,{"$f":"N85+Q85+S85","v":308}]
["2012Janeiro",2012,"Janeiro",3979,3750,98544,94955,null,null,null,null,{"$f":"D86","v":3979},{"$f":"E86","v":3750}]
["2012Fevereiro",2012,"Fevereiro",2872,6007,96739,93286,null,null,null,null,{"$f":"L86+D87","v":6851},{"$f":"M86+E87","v":9757}]
["2012Março",2012,"Março",4312,7586,95266,91840,null,null,null,null,11163,17343]
["2012Abril",2012,"Abril",3408,6790,94420,91048,null,null,null,null,14571,24133]
["2012Maio",2012,"Maio",4426,9561,94705,91371,null,null,null,null,18997,33694]
["2012Junho",2012,"Junho",3612,6695,94066,90731,null,null,null,null,22609,40389]
["2012Julho",2012,"Julho",4888,6956,93938,90372,null,null,null,null,27497,47345]
["2012Agosto",2012,"Agosto",6044,9410,93922,90416,null,null,null,null,33541,56755]
["2012Setembro",2012,"Setembro",4510,6783,94091,90589,null,null,null,null,38051,63538]
["2012Outubro",2012,"Outubro",5539,7451,93776,90529,null,null,null,null,43590,70989]
["2012Novembro",2012,"Novembro",5432,5774,95294,91739,null,null,null,null,49022,76763]
["2012Dezembro",2012,"Dezembro",4313,4532,96397,92676,null,null,null,null,53335,81295]
["2011Janeiro",2011,"Janeiro",5162,2700,98919,94563,null,null,null,null,{"$f":"D98","v":5162},{"$f":"E98","v":2700}]
["2011Fevereiro",2011,"Fevereiro",4193,6633,98202,93766,null,null,null,null,{"$f":"L98+D99","v":9355},{"$f":"M98+E99","v":9333}]
["2011Março",2011,"Março",3156,7409,97824,93026,null,null,null,null,12511,16742]
["2011Abril",2011,"Abril",3842,5361,98030,92911,null,null,null,null,16353,22103]
["2011Maio",2011,"Maio",4433,7466,97951,92529,null,null,null,null,20786,29569]
["2011Junho",2011,"Junho",4239,7325,96580,93006,null,null,null,null,25025,36894]
["2011Julho",2011,"Julho",4344,7627,97234,93779,null,null,null,null,29369,44521]
["2011Agosto",2011,"Agosto",4751,7652,96841,93857,null,null,null,null,34120,52173]
["2011Setembro",2011,"Setembro",5629,7096,97744,94437,null,null,null,null,39749,59269]
["2011Outubro",2011,"Outubro",4472,7078,97344,94315,null,null,null,null,44221,66347]
["2011Novembro",2011,"Novembro",4790,7654,96978,93435,null,null,null,null,49011,74001]
["2011Dezembro",2011,"Dezembro",3232,5118,97050,93519,null,null,null,null,52243,79119]
["2010Janeiro",2010,"Janeiro",3432,2293,91617,90244,null,null,null,null,{"$f":"D110","v":3432},{"$f":"E110","v":2293}]
["2010Fevereiro",2010,"Fevereiro",3222,4066,91577,90208,null,null,null,null,{"$f":"L110+D111","v":6654},{"$f":"M110+E111","v":6359}]
["2010Março",2010,"Março",4120,7558,91773,90314,null,null,null,null,10774,13917]
["2010Abril",2010,"Abril",3773,6013,92131,90667,null,null,null,null,14547,19930]
["2010Maio",2010,"Maio",3902,7352,92448,90894,null,null,null,null,18449,27282]
["2010Junho",2010,"Junho",4471,6788,92914,91241,null,null,null,null,22920,34070]
["2010Julho",2010,"Julho",4838,3639,93093,91562,null,null,null,null,27758,37709]
["2010Agosto",2010,"Agosto",5316,7922,94059,92584,null,null,null,null,33074,45631]
["2010Setembro",2010,"Setembro",4993,6532,94108,92508,null,null,null,null,38067,52163]
["2010Outubro",2010,"Outubro",4656,6127,95569,93791,null,null,null,null,42723,58290]
["2010Novembro",2010,"Novembro",4312,6364,95609,93536,null,null,null,null,47035,64654]
["2010Dezembro",2010,"Dezembro",3605,4671,96543,92589,null,null,null,null,50640,69325]
["2009Janeiro",2009,"Janeiro",3616,2349,94001,93360,null,null,null,null,{"$f":"D122","v":3616},{"$f":"E122","v":2349}]
["2009Fevereiro",2009,"Fevereiro",2850,4237,92847,92139,null,null,null,null,{"$f":"L122+D123","v":6466},{"$f":"M122+E123","v":6586}]
["2009Março",2009,"Março",4929,8226,91490,90610,null,null,null,null,11395,14812]
["2009Abril",2009,"Abril",3731,5359,91560,90619,null,null,null,null,15126,20171]
["2009Maio",2009,"Maio",3766,5426,91528,90550,null,null,null,null,18892,25597]
[{"$f":"B127&C127","v":"2009Junho"},2009,"Junho",4367,8137,92029,90986,null,null,null,null,23259,33734]
["2009Julho",2009,"Julho",4742,4809,91865,90703,null,null,null,null,28001,38543]
["2009Agosto",2009,"Agosto",4408,7437,92444,91293,null,null,null,null,32409,45980]
["2009Setembro",2009,"Setembro",5090,7628,93686,92487,null,null,null,null,37499,53608]
["2009Outubro",2009,"Outubro",4529,7447,93378,92171,null,null,null,null,42028,61055]
["2009Novembro",2009,"Novembro",3998,7095,91737,90470,null,null,null,null,46026,68150]
["2009Dezembro",2009,"Dezembro",2698,4850,90849,89584,null,null,null,null,48724,73000]
["2008Janeiro",2008,"Janeiro",3221,3004,100303,100226,null,null,null,null,{"$f":"D134","v":3221},{"$f":"E134","v":3004}]
["2008Fevereiro",2008,"Fevereiro",3579,4260,101150,101053,null,null,null,null,{"$f":"L134+D135","v":6800},{"$f":"M134+E135","v":7264}]
["2008Março",2008,"Março",3649,5347,100935,100826,null,null,null,null,10449,12611]
["2008Abril",2008,"Abril",3472,6157,99458,99320,null,null,null,null,13921,18768]
["2008Maio",2008,"Maio",4332,6822,97363,97166,null,null,null,null,18253,25590]
["2008Junho",2008,"Junho",4315,6700,95492,95272,null,null,null,null,22568,32290]
["2008Julho",2008,"Julho",4093,5700,94943,94685,null,null,null,null,26661,37990]
["2008Agosto",2008,"Agosto",3904,6231,94529,94253,null,null,null,null,30565,44221]
["2008Setembro",2008,"Setembro",4913,5933,93233,92897,null,null,null,null,35478,50154]
["2008Outubro",2008,"Outubro",4986,6315,93475,93009,null,null,null,null,40464,56469]
["2008Novembro",2008,"Novembro",4312,6674,93686,93175,null,null,null,null,44776,63143]
["2008Dezembro",2008,"Dezembro",3130,5262,93504,92985,null,null,null,null,47906,68405]
["2007Janeiro",2007,"Janeiro",3347,2604,105992,105884,null,null,null,null,{"$f":"D146","v":3347},{"$f":"E146","v":2604}]
["2007Fevereiro",2007,"Fevereiro",3302,3870,105620,105511,null,null,null,null,{"$f":"L146+D147","v":6649},{"$f":"M146+E147","v":6474}]
["2007Março",2007,"Março",3711,6378,104738,104655,null,null,null,null,10360,12852]
["2007Abril",2007,"Abril",2890,5511,104264,104187,null,null,null,null,13250,18363]
["2007Maio",2007,"Maio",3919,6911,103043,102969,null,null,null,null,17169,25274]
["2007Junho",2007,"Junho",3560,5447,103002,102933,null,null,null,null,20729,30721]
["2007Julho",2007,"Julho",3641,4990,102195,102140,null,null,null,null,24370,35711]
["2007Agosto",2007,"Agosto",4054,6425,100590,100525,null,null,null,null,28424,42136]
["2007Setembro",2007,"Setembro",3117,5548,100208,100155,null,null,null,null,31541,47684]
["2007Outubro",2007,"Outubro",4186,6037,100458,100401,null,null,null,null,35727,53721]
["2007Novembro",2007,"Novembro",4196,5601,100428,100362,null,null,null,null,39923,59322]
["2007Dezembro",2007,"Dezembro",2471,4490,99861,99790,null,null,null,null,42394,63812]
["2006Janeiro",2006,"Janeiro",2150,2924,116262,116196,null,null,null,null,{"$f":"D158","v":2150},{"$f":"E158","v":2924}]
["2006Fevereiro",2006,"Fevereiro",2426,3512,115569,115503,null,null,null,null,{"$f":"L158+D159","v":4576},{"$f":"M158+E159","v":6436}]
["2006Março",2006,"Março",3599,5206,115185,115123,null,null,null,null,8175,11642]
["2006Abril",2006,"Abril",2464,4315,114234,114171,null,null,null,null,10639,15957]
["2006Maio",2006,"Maio",3374,6783,113317,113259,null,null,null,null,14013,22740]
["2006Junho",2006,"Junho",2535,5359,111952,111898,null,null,null,null,16548,28099]
["2006Julho",2006,"Julho",3457,5384,110971,110922,null,null,null,null,20005,33483]
["2006Agosto",2006,"Agosto",3785,6756,109875,109790,null,null,null,null,23790,40239]
["2006Setembro",2006,"Setembro",3669,5693,107192,107092,null,null,null,null,27459,45932]
["2006Outubro",2006,"Outubro",4080,6046,106396,106282,null,null,null,null,31539,51978,null,null,null,null,null,null,null,null,null,"diferença"]
["2006Novembro",2006,"Novembro",3718,5007,105641,105533,null,null,null,null,35257,56985,null,null,null,null,null,null,null,null,null,{"$f":"F168-G168","v":108}]
["2006Dezembro",2006,"Dezembro",2706,4146,105290,105185,null,null,null,null,37963,61131,null,null,null,null,null,null,null,null,null,{"$f":"F169-G169","v":105}]
["2005Dezembro",2005,"Dezembro",2277,3204,115794,{"$f":"F170-106","v":115688},null,null,null,null,null,null,null,null,null,null,null,null,null,null,null,{"$f":"F170-G170","v":106},"TRAM estava 115.796 até 01/04/2014"]
["2005Total-Dez",2005,"Total-Dez",{"$f":"34979-D170","v":32702},{"$f":"47264-E170","v":44060}]
[]
[]
[]
[]
[]
[]
[]
[]
[]
[]
[]
[]
[]
[]
[null,null,2016,{"$f":"SUM(D38:D$169)","v":415264},{"$f":"SUM(E38:E$169)","v":669823},{"$f":"SUM(F38:F$169)","v":11606375},{"$f":"SUM(G38:G$169)","v":11337325},{"$f":"SUM(H38:H$169)","v":146038},{"$f":"SUM(I38:I$169)","v":123772},{"$f":"SUM(J38:J$169)","v":2004099},{"$f":"SUM(K38:K$169)","v":1932821},{"$f":"SUM(L38:L$169)","v":2645048},{"$f":"SUM(M38:M$169)","v":4242319},{"$f":"SUM(N38:N$169)","v":919186},{"$f":"SUM(O38:O$169)","v":714644},{"$f":"SUM(P38:P$169)","v":7796},{"$f":"SUM(Q38:Q$169)","v":64500},{"$f":"SUM(R38:R$169)","v":5993},{"$f":"SUM(S38:S$169)","v":50790},{"$f":"SUM(T38:T$169)","v":1034476}]
[]
[null,null,2017,{"$f":"SUM(D26:D$169)","v":415264},{"$f":"SUM(E26:E$169)","v":677427},{"$f":"SUM(F26:F$169)","v":11741440},{"$f":"SUM(G26:G$169)","v":11463733},{"$f":"SUM(H26:H$169)","v":188046},{"$f":"SUM(I26:I$169)","v":181638},{"$f":"SUM(J26:J$169)","v":2966038},{"$f":"SUM(K26:K$169)","v":2832957},{"$f":"SUM(L26:L$169)","v":2645048},{"$f":"SUM(M26:M$169)","v":4289091},{"$f":"SUM(N26:N$169)","v":1184752},{"$f":"SUM(O26:O$169)","v":1075151},{"$f":"SUM(P26:P$169)","v":8023},{"$f":"SUM(Q26:Q$169)","v":65579},{"$f":"SUM(R26:R$169)","v":6719},{"$f":"SUM(S26:S$169)","v":53314},{"$f":"SUM(T26:T$169)","v":1303645}]
[]
[null,null,null,"s","ss","hs","hs","a","aa","ha ","ha ","ss","ss","sa","sa","aaa","sa","aaaa","sa","sa"]
[null,null,"."]

{"sheet":"DadosTD","index":17,"n_rows":242,"n_cols":9,"rows_kept":242,"cut":false,"hidden":true,"merged":[]}
["Ano","Mês","Base","A","M","V","Julg","TRAM","TA"]
[2019,"Janeiro","Eproc",1464,0,0,86,5594,5587]
[2019,"Fevereiro","Eproc",2070,0,0,368,7517,7502]
[2019,"Março","Eproc",1711,0,0,327,9051,9035]
[2019,"Abril","Eproc",2261,0,0,540,11181,11162]
[2019,"Maio","Eproc",3218,0,0,601,13949,13919]
[2019,"Junho","Eproc",2876,0,0,822,16463,16417]
[2019,"Julho","Eproc",3792,0,0,1590,19629,19571]
[2019,"Agosto","Eproc",3935,0,0,1757,22759,22681]
[2019,"Setembro","Eproc",4039,0,0,2270,25722,25586]
[2019,"Outubro","Eproc",4139,0,0,2992,28482,28257]
[2019,"Novembro","Eproc",3517,2,0,2839,30663,30373]
[2019,"Dezembro","Eproc",2598,0,0,2907,31489,31131]
[2019,"Janeiro","Apolo",2228,0,7,2215,77634,71367]
[2019,"Fevereiro","Apolo",1905,0,23,6510,75155,68481]
[2019,"Março","Apolo",1203,0,15,3667,72009,64860]
[2019,"Abril","Apolo",1292,0,15,4327,71510,64333]
[2019,"Maio","Apolo",1391,0,15,5074,68646,61176]
[2019,"Junho","Apolo",840,0,9,5255,66611,58992]
[2019,"Julho","Apolo",913,0,11,5012,64133,56028]
[2019,"Agosto","Apolo",732,0,23,4110,61212,52661]
[2019,"Setembro","Apolo",558,0,13,4327,58439,49535]
[2019,"Outubro","Apolo",552,0,14,3543,55479,46503]
[2019,"Novembro","Apolo",357,0,17,3568,53248,43705]
[2019,"Dezembro","Apolo",282,0,10,3346,51732,42129]
[2018,"Abril","Eproc",0,0,null,0,0,0]
[2018,"Maio","Eproc",26,0,null,0,26,26]
[2018,"Junho","Eproc",102,0,null,0,128,128]
[2018,"Julho","Eproc",221,0,null,2,349,349]
[2018,"Agosto","Eproc",441,0,null,12,787,787]
[2018,"Setembro","Eproc",450,0,null,41,1226,1225]
[2018,"Outubro","Eproc",1110,0,null,77,2315,2312]
[2018,"Novembro","Eproc",638,0,null,94,2931,2927]
[2018,"Dezembro","Eproc",1256,0,null,254,4154,4149]
[2018,"Janeiro","Apolo",2629,4,327,2110,81555,77335]
[2018,"Fevereiro","Apolo",2845,35,98,4617,81439,77175]
[2018,"Março","Apolo",2732,7823,38,5330,87839,83086]
[2018,"Abril","Apolo",3126,103,8,5785,86634,81788]
[2018,"Maio","Apolo",3430,12,2,6809,85050,80433]
[2018,"Junho","Apolo",2937,5,3,5708,83934,79461]
[2018,"Julho","Apolo",3696,2,3,5797,82900,78255]
[2018,"Agosto","Apolo",3792,0,1,6060,82869,78167]
[2018,"Setembro","Apolo",2809,0,13,6273,80805,75916]
[2018,"Outubro","Apolo",3041,0,13,6292,79116,73907]
[2018,"Novembro","Apolo",3745,0,20,5394,79405,73934]
[2018,"Dezembro","Apolo",2099,0,14,4177,77849,71773]
[2018,"Janeiro","Siapro",0,null,null,360,8523,8045]
[2018,"Fevereiro","Siapro",0,null,null,755,8115,7646]
[2018,"Março","Siapro",1,null,null,306,160,160]
[2017,"Janeiro","Apolo",2164,9,6,1153,80666,75463]
[2017,"Fevereiro","Apolo",2887,15,67,5075,79927,74573]
[2017,"Março","Apolo",3892,10,24,5110,78756,73274]
[2017,"Abril","Apolo",3022,1,1,4481,79139,73830]
[2017,"Maio","Apolo",4262,16,27,5892,79110,73710]
[2017,"Junho","Apolo",3635,16,21,5491,79461,74030]
[2017,"Julho","Apolo",3913,21,11,5533,79894,74403]
[2017,"Agosto","Apolo",4248,6,50,6063,80079,74548]
[2017,"Setembro","Apolo",3957,44,2,5401,80978,75369]
[2017,"Outubro","Apolo",4194,7,3,5180,81450,77255]
[2017,"Novembro","Apolo",3220,22,256,4700,81954,77604]
[2017,"Dezembro","Apolo",2614,60,258,3787,80525,76077]
[2017,"Janeiro","Siapro",0,null,null,180,16135,14955]
[2017,"Fevereiro","Siapro",0,null,null,475,15152,14005]
[2017,"Março","Siapro",0,null,null,735,12778,11842]
[2017,"Abril","Siapro",0,null,null,700,12105,11260]
[2017,"Maio","Siapro",0,null,null,733,11377,10556]
[2017,"Junho","Siapro",0,null,null,668,10766,10101]
[2017,"Julho","Siapro",0,null,null,663,10262,9643]
[2017,"Agosto","Siapro",0,null,null,890,9752,9251]
[2017,"Setembro","Siapro",0,null,null,632,9373,8868]
[2017,"Outubro","Siapro",0,null,null,803,9497,9018]
[2017,"Novembro","Siapro",0,null,null,707,9144,8663]
[2017,"Dezembro","Siapro",0,null,null,418,8724,8246]
[2016,"Janeiro","Apolo",3413,10,0,2946,76839,73708]
[2016,"Fevereiro","Apolo",3395,18,9,3374,78079,74939]
[2016,"Março","Apolo",4348,39,3,4527,74366,71192]
[2016,"Abril","Apolo",4166,19,11,4552,76202,72981]
[2016,"Maio","Apolo",4050,9,23,3890,78084,74767]
[2016,"Junho","Apolo",4395,17,7,5403,79893,76530]
[2016,"Julho","Apolo",4153,18,1,5445,81557,78182]
[2016,"Agosto","Apolo",2673,1,2,2153,82918,79442]
[2016,"Setembro","Apolo",4338,11,6,3945,83598,79818]
[2016,"Outubro","Apolo",3755,27,9,5822,83662,78932]
[2016,"Novembro","Apolo",3530,25,13,3695,81676,76704]
[2016,"Dezembro","Apolo",2597,14,1,4306,80830,75705]
[2016,"Janeiro","Siapro",0,null,null,825,37599,35000]
[2016,"Fevereiro","Siapro",0,null,null,983,36419,33459]
[2016,"Março","Siapro",2,null,null,1296,35215,32465]
[2016,"Abril","Siapro",0,null,null,1034,32994,30402]
[2016,"Maio","Siapro",0,null,null,909,29689,27149]
[2016,"Junho","Siapro",0,null,null,722,27798,25575]
[2016,"Julho","Siapro",0,null,null,713,26931,24718]
[2016,"Agosto","Siapro",0,null,null,292,25788,23697]
[2016,"Setembro","Siapro",0,null,null,762,22327,20717]
[2016,"Outubro","Siapro",0,null,null,757,20445,18862]
[2016,"Novembro","Siapro",0,null,null,814,18663,17216]
[2016,"Dezembro","Siapro",0,null,null,577,16985,15697]
[2015,"Janeiro","Apolo",2803,null,3409,2774,49003,48967]
[2015,"Fevereiro","Apolo",3432,null,76,2815,50153,50103]
[2015,"Março","Apolo",5951,60,17,3805,54273,54179]
[2015,"Abril","Apolo",4223,4329,88,4150,59703,57683]
[2015,"Maio","Apolo",5246,2270,130,3553,64869,61970]
[2015,"Junho","Apolo",5209,362,247,4550,67107,64128]
[2015,"Julho","Apolo",4921,221,41,4915,68642,65629]
[2015,"Agosto","Apolo",3778,238,50,3967,69072,66041]
[2015,"Setembro","Apolo",4012,57,45,4075,70376,67338]
[2015,"Outubro","Apolo",4745,32,8,4418,72864,69806]
[2015,"Novembro","Apolo",4365,14,5,4360,74381,71292]
[2015,"Dezembro","Apolo",2933,5,29,3775,75365,72256]
[2015,"Janeiro","Siapro",610,null,null,1630,74019,69960]
[2015,"Fevereiro","Siapro",503,null,null,2492,72305,68291]
[2015,"Março","Siapro",12,null,null,2749,69119,67511]
[2015,"Abril","Siapro",13,null,null,2586,62012,61073]
[2015,"Maio","Siapro",13,null,null,2326,56600,55654]
[2015,"Junho","Siapro",0,null,null,2094,53918,52971]
[2015,"Julho","Siapro",1,null,null,1956,51132,50055]
[2015,"Agosto","Siapro",1,null,null,1595,48962,47250]
[2015,"Setembro","Siapro",0,null,null,1374,46557,44498]
[2015,"Outubro","Siapro",1,null,null,1585,43858,41471]
[2015,"Novembro","Siapro",6,null,null,952,41779,39069]
[2015,"Dezembro","Siapro",4,null,null,1154,39179,36665]
[2014,"Janeiro","Apolo",1258,null,1,1,1567,1567]
[2014,"Fevereiro","Apolo",2591,null,null,67,4158,4158]
[2014,"Março","Apolo",2136,null,null,151,6294,6294]
[2014,"Abril","Apolo",4945,null,null,536,11230,11230]
[2014,"Maio","Apolo",4400,null,null,721,15482,15482]
[2014,"Junho","Apolo",3306,null,115,1607,18657,18657]
[2014,"Julho","Apolo",5753,null,271,3359,24466,24466]
[2014,"Agosto","Apolo",6870,null,32,3543,31093,31091]
[2014,"Setembro","Apolo",4579,null,null,5164,34938,34931]
[2014,"Outubro","Apolo",4598,null,3,4729,37676,37665]
[2014,"Novembro","Apolo",4538,null,68,3830,40463,40448]
[2014,"Dezembro","Apolo",4325,null,1273,2849,44255,44232]
[2014,"Janeiro","Siapro",3152,null,null,4628,108747,105267]
[2014,"Fevereiro","Siapro",2562,null,null,7698,107149,103719]
[2014,"Março","Siapro",2508,null,null,5829,105188,101641]
[2014,"Abril","Siapro",1798,null,null,5421,102976,99367]
[2014,"Maio","Siapro",1723,null,null,5522,100335,96533]
[2014,"Junho","Siapro",1570,null,null,4287,97366,93448]
[2014,"Julho","Siapro",1282,null,null,5251,94078,89973]
[2014,"Agosto","Siapro",1312,null,null,4970,91091,87015]
[2014,"Setembro","Siapro",1572,null,null,4552,88449,84401]
[2014,"Outubro","Siapro",1030,null,null,4570,85008,81001]
[2014,"Novembro","Siapro",669,null,null,4117,83096,79111]
[2014,"Dezembro","Siapro",555,null,null,2840,77078,72977]
[2013,"Dezembro","Apolo",308,null,null,null,308,308]
[2013,"Janeiro","Siapro",5046,null,null,4660,97846,94106]
[2013,"Fevereiro","Siapro",3768,null,null,4862,98157,94534]
[2013,"Março","Siapro",4410,null,null,6505,97814,94109]
[2013,"Abril","Siapro",3953,null,null,7103,97193,93581]
[2013,"Maio","Siapro",4538,null,null,7269,97774,94220]
[2013,"Junho","Siapro",3691,null,null,6477,97866,94291]
[2013,"Julho","Siapro",6117,null,null,6848,99401,95774]
[2013,"Agosto","Siapro",6703,null,null,7651,101525,97754]
[2013,"Setembro","Siapro",7245,null,null,7173,104414,100491]
[2013,"Outubro","Siapro",6410,null,null,9079,105963,102278]
[2013,"Novembro","Siapro",5031,null,null,7656,107690,104040]
[2013,"Dezembro","Siapro",4248,null,null,6591,108814,105131]
[2012,"Janeiro","Siapro",3979,null,null,3750,98544,94955]
[2012,"Fevereiro","Siapro",2872,null,null,6007,96739,93286]
[2012,"Março","Siapro",4312,null,null,7586,95266,91840]
[2012,"Abril","Siapro",3408,null,null,6790,94420,91048]
[2012,"Maio","Siapro",4426,null,null,9561,94705,91371]
[2012,"Junho","Siapro",3612,null,null,6695,94066,90731]
[2012,"Julho","Siapro",4888,null,null,6956,93938,90372]
[2012,"Agosto","Siapro",6044,null,null,9410,93922,90416]
[2012,"Setembro","Siapro",4510,null,null,6783,94091,90589]
[2012,"Outubro","Siapro",5539,null,null,7451,93776,90529]
[2012,"Novembro","Siapro",5432,null,null,5774,95294,91739]
[2012,"Dezembro","Siapro",4313,null,null,4532,96397,92676]
[2011,"Janeiro","Siapro",5162,null,null,2700,98919,94563]
[2011,"Fevereiro","Siapro",4193,null,null,6633,98202,93766]
[2011,"Março","Siapro",3156,null,null,7409,97824,93026]
[2011,"Abril","Siapro",3842,null,null,5361,98030,92911]
[2011,"Maio","Siapro",4433,null,null,7466,97951,92529]
[2011,"Junho","Siapro",4239,null,null,7325,96580,93006]
[2011,"Julho","Siapro",4344,null,null,7627,97234,93779]
[2011,"Agosto","Siapro",4751,null,null,7652,96841,93857]
[2011,"Setembro","Siapro",5629,null,null,7096,97744,94437]
[2011,"Outubro","Siapro",4472,null,null,7078,97344,94315]
[2011,"Novembro","Siapro",4790,null,null,7654,96978,93435]
[2011,"Dezembro","Siapro",3232,null,null,5118,97050,93519]
[2010,"Janeiro","Siapro",3432,null,null,2293,91617,90244]
[2010,"Fevereiro","Siapro",3222,null,null,4066,91577,90208]
[2010,"Março","Siapro",4120,null,null,7558,91773,90314]
[2010,"Abril","Siapro",3773,null,null,6013,92131,90667]
[2010,"Maio","Siapro",3902,null,null,7352,92448,90894]
[2010,"Junho","Siapro",4471,null,null,6788,92914,91241]
[2010,"Julho","Siapro",4838,null,null,3639,93093,91562]
[2010,"Agosto","Siapro",5316,null,null,7922,94059,92584]
[2010,"Setembro","Siapro",4993,null,null,6532,94108,92508]
[2010,"Outubro","Siapro",4656,null,null,6127,95569,93791]
[2010,"Novembro","Siapro",4312,null,null,6364,95609,93536]
[2010,"Dezembro","Siapro",3605,null,null,4671,96543,92589]
[2009,"Janeiro","Siapro",3616,null,null,2349,94001,93360]
[2009,"Fevereiro","Siapro",2850,null,null,4237,92847,92139]
[2009,"Março","Siapro",4929,null,null,8226,91490,90610]
[2009,"Abril","Siapro",3731,null,null,5359,91560,90619]
[2009,"Maio","Siapro",3766,null,null,5426,91528,90550]
[2009,"Junho","Siapro",4367,null,null,8137,92029,90986]
[2009,"Julho","Siapro",4742,null,null,4809,91865,90703]
[2009,"Agosto","Siapro",4408,null,null,7437,92444,91293]
[2009,"Setembro","Siapro",5090,null,null,7628,93686,92487]
[2009,"Outubro","Siapro",4529,null,null,7447,93378,92171]
[2009,"Novembro","Siapro",3998,null,null,7095,91737,90470]
[2009,"Dezembro","Siapro",2698,null,null,4850,90849,89584]
[2008,"Janeiro","Siapro",3221,null,null,3004,100303,100226]
[2008,"Fevereiro","Siapro",3579,null,null,4260,101150,101053]
[2008,"Março","Siapro",3649,null,null,5347,100935,100826]
[2008,"Abril","Siapro",3472,null,null,6157,99458,99320]
[2008,"Maio","Siapro",4332,null,null,6822,97363,97166]
[2008,"Junho","Siapro",4315,null,null,6700,95492,95272]
[2008,"Julho","Siapro",4093,null,null,5700,94943,94685]
[2008,"Agosto","Siapro",3904,null,null,6231,94529,94253]
[2008,"Setembro","Siapro",4913,null,null,5933,93233,92897]
[2008,"Outubro","Siapro",4986,null,null,6315,93475,93009]
[2008,"Novembro","Siapro",4312,null,null,6674,93686,93175]
[2008,"Dezembro","Siapro",3130,null,null,5262,93504,92985]
[2007,"Janeiro","Siapro",3347,null,null,2604,105992,105884]
[2007,"Fevereiro","Siapro",3302,null,null,3870,105620,105511]
[2007,"Março","Siapro",3711,null,null,6378,104738,104655]
[2007,"Abril","Siapro",2890,null,null,5511,104264,104187]
[2007,"Maio","Siapro",3919,null,null,6911,103043,102969]
[2007,"Junho","Siapro",3560,null,null,5447,103002,102933]
[2007,"Julho","Siapro",3641,null,null,4990,102195,102140]
[2007,"Agosto","Siapro",4054,null,null,6425,100590,100525]
[2007,"Setembro","Siapro",3117,null,null,5548,100208,100155]
[2007,"Outubro","Siapro",4186,null,null,6037,100458,100401]
[2007,"Novembro","Siapro",4196,null,null,5601,100428,100362]
[2007,"Dezembro","Siapro",2471,null,null,4490,99861,99790]
[2006,"Janeiro","Siapro",2150,null,null,2924,116262,116196]
[2006,"Fevereiro","Siapro",2426,null,null,3512,115569,115503]
[2006,"Março","Siapro",3599,null,null,5206,115185,115123]
[2006,"Abril","Siapro",2464,null,null,4315,114234,114171]
[2006,"Maio","Siapro",3374,null,null,6783,113317,113259]
[2006,"Junho","Siapro",2535,null,null,5359,111952,111898]
[2006,"Julho","Siapro",3457,null,null,5384,110971,110922]
[2006,"Agosto","Siapro",3785,null,null,6756,109875,109790]
[2006,"Setembro","Siapro",3669,null,null,5693,107192,107092]
[2006,"Outubro","Siapro",4080,null,null,6046,106396,106282]
[2006,"Novembro","Siapro",3718,null,null,5007,105641,105533]
[2006,"Dezembro","Siapro",2706,null,null,4146,105290,105185]