{"text_format":"1","workbook":"xlsx","n_sheets":18,"sheets":["Plan1","TD","PaMT","GTDJaMS","GTvM2B","GTvM3B18","GDaM2B","GDaM3B18","GJaM2B","GJaM3B18","PvAT","GP3AT","GTvAT","GDvAT","GJvAT","TA","Dados","DadosTD"],"not_rendered":{"charts":51,"images":21,"macros":1,"external_links":0,"defined_names":35,"comments":1,"pivot_tables":1},"unopened":[],"bounds":{"document_bytes":16777216,"sheet_cells":100000,"rows_first":2000,"rows_last":500,"rows_between":2000,"halvings":0,"cell_chars":16384,"cell_head_chars":4096},"cells_cut":0,"cells_raw":0,"read":"whole","date_system":"1900"}

{"sheet":"Plan1","index":0,"n_rows":8,"n_cols":2,"rows_kept":8,"cut":false,"hidden":false,"merged":[[5,1,5,12],[7,1,7,12]]}
[]
[]
[]
[]
[]
[null,"Se for apresentado um Aviso de Segurança dizendo que  \"As macros foram desabilitadas.\" :\n  Clique em Opções e a seguir clicar na opção Habilitar este conteúdo."]
[]
[null,"Para melhor visualização deste Painel Dashboards, em qualquer Tabela ou Gráfico, pode-se utilizar o recurso de:\nPressionar a tecla Ctrl + Roda de Rolagem do mouse (Botão Scroll), ajustando para cima ou para baixo."]

{"sheet":"TD","index":1,"n_rows":47,"n_cols":13,"rows_kept":47,"cut":false,"hidden":true,"merged":[[3,9,3,14],[4,9,4,14],[6,9,7,14],[23,9,23,14],[25,9,25,11],[8,9,8,14],[45,1,45,9],[46,1,46,9],[40,9,40,14],[41,9,41,14],[42,9,42,14],[42,1,42,8],[44,1,44,9]]}
[null,"Ano",2019]
[]
[null,null,"Valores"]
[null,"Mês","1ª Distribuição no TRF\n(A)","Distribuídos por Migração\n(M)","Distribuídos por Virtualização\n(V)"," Total Distribuídos (A+M+V)","Julgados\n(TJI)","Saldo Atual\n(TRAM)","Tramitação Ajustada\n(TA)","Mapa Geral Judicial do TRF2R"]
[null,"Janeiro",3692,0,7,3699,2301,83228,76954,"Orientações para a utilização da \"Tabela Dinâmica\"."]
[null,"Eproc",1464,0,0,1464,86,5594,5587]
[null,"Apolo",2228,0,7,2235,2215,77634,71367,"No campo de filtro \"Ano\" da tabela ao lado, dentre as opções:"]
[null,"Fevereiro",3975,0,23,3998,6878,82672,75983]
[null,"Eproc",2070,0,0,2070,368,7517,7502,"    Selecione um \"Ano\" :"]
[null,"Apolo",1905,0,23,1928,6510,75155,68481]
[null,"Março",2914,0,15,2929,3994,81060,73895]
[null,"Eproc",1711,0,0,1711,327,9051,9035]
[null,"Apolo",1203,0,15,1218,3667,72009,64860]
[null,"Abril",3553,0,15,3568,4867,82691,75495]
[null,"Eproc",2261,0,0,2261,540,11181,11162]
{"$rows_left_out":33}
{"sheet":"PaMT","index":2,"n_rows":59,"n_cols":42,"rows_kept":59,"cut":false,"hidden":true,"merged":[[7,7,8,7],[7,8,8,8],[7,13,8,13],[7,11,8,11],[7,12,8,12],[7,9,8,9],[57,0,57,16],[58,0,58,16],[6,3,6,4],[7,10,8,10],[18,1,19,1],[12,1,13,1],[15,1,16,1],[6,5,6,8],[5,9,6,10],[7,2,8,2],[7,3,8,3],[7,4,8,4],[7,14,8,14],[7,15,8,15],[7,5,8,5],[53,0,53,16],[56,0,56,16],[0,1,2,5],[0,12,2,14],[48,1,50,1],[36,1,37,1],[21,1,22,1],[24,1,25,1],[27,1,28,1],[30,1,31,1],[33,1,34,1],[39,1,40,1],[42,1,43,1],[45,1,46,1],[4,4,4,5],[54,0,54,16],[7,6,8,6]]}
[]
[]
[]
[]
[null,"Ano",null,null,"Tipo Processo",null,"Judicial"]
[null,null,null,null,null,null,null,null,null,"Total de Distribuídos\nnas Bases de Dados"]
[null,null,null,"(*) 1ª Distribuição no TRF",null,"(*) Distribuídos para o Apolo (Origem: Sistema Siapro)"]
[null,null,"Base de Dados do Processo","(A)","Acum.\nMensal","Por Migração (M)","Acum.\nMensal","Por Virtualização (V)","Acum.\nMensal","(A)+(M)+(V)","Acum.\nMensal","Julgados\n(TJI)","Acum.\nMensal","Saldo Atual\n(TRAM)","% Variação Mensal da\nTramitação","(*) Tram. Ajustada\n(TA)"]
[null,"Mês"]
[null,"Dezembro","Siapro",{"$f":"VLOOKUP(TA!$C$20&$B10,Dados!$A$2:$K$171,4,0)","v":1256},{"$f":"VLOOKUP(TA!$C$20&$B10,Dados!$A$2:$L$171,12,0)","v":4244},null,null,null,null,{"$f":"D10+F10+H10","v":1256},4244,{"$f":"VLOOKUP(TA!$C$20&$B10,Dados!$A$2:$K$171,5,0)","v":254},{"$f":"VLOOKUP(TA!$C$20&$B10,Dados!$A$2:$M$171,13,0)","v":480},{"$f":"VLOOKUP(TA!$C$20&$B10,Dados!$A$2:$K$171,6,0)","v":4154},null,{"$f":"VLOOKUP(TA!$C$20&$B10,Dados!$A$2:$K$171,7,0)","v":4149}]
[null,null,"Apolo",{"$f":"VLOOKUP(TA!$C$20&$B10,Dados!$A$2:$K$171,8,0)","v":2099},{"$f":"VLOOKUP(TA!$C$20&$B10,Dados!$A$2:$N$171,14,0)","v":36881},{"$f":"VLOOKUP(TA!$C$20&$B10,Dados!$A$2:$P$171,16,0)","v":0},{"$f":"VLOOKUP(TA!$C$20&$B10,Dados!$A$2:$Q$171,17,0)","v":7984},{"$f":"VLOOKUP(TA!$C$20&$B10,Dados!$A$2:$R$171,18,0)","v":14},{"$f":"VLOOKUP(TA!$C$20&$B10,Dados!$A$2:$S$171,19,0)","v":540},2113,45405,{"$f":"VLOOKUP(TA!$C$20&$B10,Dados!$A$2:$K$171,9,0)","v":4177},{"$f":"VLOOKUP(TA!$C$20&$B10,Dados!$A$2:$O$171,15,0)","v":64352},{"$f":"VLOOKUP(TA!$C$20&$B10,Dados!$A$2:$K$171,10,0)","v":77849},null,{"$f":"VLOOKUP(TA!$C$20&$B10,Dados!$A$2:$K$171,11,0)","v":71773}]
[null,"Total",null,{"$f":"D10+D11","v":3355},41125,0,7984,14,540,3369,49649,{"$f":"L10+L11","v":4431},{"$f":"M10+M11","v":64832},{"$f":"N10+N11","v":82003},null,{"$f":"P10+P11","v":75922}]
[null,"Janeiro",{"$f":"TA!$D$20","v":"Eproc"},{"$f":"VLOOKUP(TA!$A$20&$B13,Dados!$A$2:$K$171,4,0)","v":1464},{"$f":"VLOOKUP(TA!$A$20&$B13,Dados!$A$2:$L$171,12,0)","v":1464},null,null,null,null,{"$f":"D13+F13+H13","v":1464},{"$f":"E13+G13+I13","v":1464},{"$f":"VLOOKUP(TA!$A$20&$B13,Dados!$A$2:$K$171,5,0)","v":86},{"$f":"VLOOKUP(TA!$A$20&$B13,Dados!$A$2:$M$171,13,0)","v":86},{"$f":"VLOOKUP(TA!$A$20&$B13,Dados!$A$2:$K$171,6,0)","v":5594},{"$f":"IF($N13=0,\"\",($N13/$N10)-1)","v":0.34665382763601338},{"$f":"VLOOKUP(TA!$A$20&$B13,Dados!$A$2:$K$171,7,0)","v":5587},null,null,null,null,null,null,null,null,null,null,null,null,null,null,null,null,null,null,null,"S",null,null,null,null,"e"]
[null,null,"Apolo",{"$f":"VLOOKUP(TA!$A$20&$B13,Dados!$A$2:$K$171,8,0)","v":2228},{"$f":"VLOOKUP(TA!$A$20&$B13,Dados!$A$2:$N$171,14,0)","v":2228},{"$f":"VLOOKUP(TA!$A$20&$B13,Dados!$A$2:$P$171,16,0)","v":0},{"$f":"VLOOKUP(TA!$A$20&$B13,Dados!$A$2:$Q$171,17,0)","v":0},{"$f":"VLOOKUP(TA!$A$20&$B13,Dados!$A$2:$R$171,18,0)","v":7},{"$f":"VLOOKUP(TA!$A$20&$B13,Dados!$A$2:$S$171,19,0)","v":7},{"$f":"D14+F14+H14","v":2235},{"$f":"E14+G14+I14","v":2235},{"$f":"VLOOKUP(TA!$A$20&$B13,Dados!$A$2:$K$171,9,0)","v":2215},{"$f":"VLOOKUP(TA!$A$20&$B13,Dados!$A$2:$O$171,15,0)","v":2215},{"$f":"VLOOKUP(TA!$A$20&$B13,Dados!$A$2:$K$171,10,0)","v":77634},{"$f":"IF($N11=0,\"\",($N14/$N11)-1)","v":-2.7617567341905458E-3},{"$f":"VLOOKUP(TA!$A$20&$B13,Dados!$A$2:$K$171,11,0)","v":71367},null,null,null,null,null,null,null,null,null,null,null,null,null,null,null,null,null,null,null,"0","4jd",null,null,null,"0",1]
[null,"Total",null,{"$f":"D13+D14","v":3692},{"$f":"E13+E14","v":3692},0,0,7,7,{"$f":"D15+F15+H15","v":3699},{"$f":"E15+G15+I15","v":3699},{"$f":"L13+L14","v":2301},{"$f":"M13+M14","v":2301},{"$f":"N13+N14","v":83228},{"$f":"IF($N15=0,\"\",($N15/$N12)-1)","v":1.4938477860566124E-2},{"$f":"P13+P14","v":76954},null,null,null,null,null,null,null,null,null,null,null,null,null,null,null,null,null,null,null,"0",null,null,null,null,"0"]
{"$rows_left_out":45}
{"sheet":"GTDJaMS","index":3,"n_rows":1,"n_cols":11,"rows_kept":1,"cut":false,"hidden":true,"merged":[[1,1,24,15],[26,1,49,7],[26,9,49,15],[0,0,0,9],[0,10,0,11],[0,14,0,15]]}
["TRF2 - Processos Siapro - Série Histórica",null,null,null,null,null,null,null,null,null,"no Ano de:  "]

{"sheet":"GTvM2B","index":4,"n_rows":2,"n_cols":36,"rows_kept":2,"cut":false,"hidden":true,"merged":[[26,1,49,7],[26,9,49,15],[1,1,24,7],[1,9,24,15],[0,10,0,11],[0,14,0,15],[0,0,0,9]]}
[{"$f":"TA!$A$24 & \" (% Variação Mensal)\"","v":"TRF2 - Processos em TRAMITAÇÃO em 2019 (% Variação Mensal)"},null,null,null,null,null,null,null,null,null,"no Ano de:  "]
[null,null,null,null,null,null,null,null,null,null,null,null,null,null,null,null,null,null,null,null,null,null,null,null,null,null,null,null,null,null,null,null,null,null,null,"certo geral"]

{"sheet":"GTvM3B18","index":5,"n_rows":2,"n_cols":36,"rows_kept":2,"cut":false,"hidden":true,"merged":[[26,1,49,7],[26,9,49,15],[0,0,0,9],[0,10,0,11],[0,14,0,15],[1,1,24,7],[1,9,24,15]]}
[{"$f":"TA!$A$24 & \" (% Variação Mensal)\"","v":"TRF2 - Processos em TRAMITAÇÃO em 2019 (% Variação Mensal)"},null,null,null,null,null,null,null,null,null,"no Ano de:  "]
[null,null,null,null,null,null,null,null,null,null,null,null,null,null,null,null,null,null,null,null,null,null,null,null,null,null,null,null,null,null,null,null,null,null,null,"certo geral"]

{"sheet":"GDaM2B","index":6,"n_rows":2,"n_cols":36,"rows_kept":2,"cut":false,"hidden":true,"merged":[[0,0,0,9],[0,10,0,11],[0,14,0,15],[26,1,49,7],[26,9,49,15],[1,1,24,7],[1,9,24,15]]}
[{"$f":"TA!$A$25 & \" (Acumulado Mensal)\"","v":"TRF2 - Processos DISTRIBUÍDOS (1ª Distribuição) em 2019 (Acumulado Mensal)"},null,null,null,null,null,null,null,null,null,"no Ano de:  "]
[null,null,null,null,null,null,null,null,null,null,null,null,null,null,null,null,null,null,null,null,null,null,null,null,null,null,null,null,null,null,null,null,null,null,null,"errado para 2018"]

{"sheet":"GDaM3B18","index":7,"n_rows":2,"n_cols":36,"rows_kept":2,"cut":false,"hidden":true,"merged":[[26,1,49,7],[26,9,49,15],[0,0,0,9],[0,10,0,11],[0,14,0,15],[1,1,24,7],[1,9,24,15]]}
[{"$f":"TA!$A$25 & \" (Acumulado Mensal)\"","v":"TRF2 - Processos DISTRIBUÍDOS (1ª Distribuição) em 2019 (Acumulado Mensal)"},null,null,null,null,null,null,null,null,null,"no Ano de:  "]
[null,null,null,null,null,null,null,null,null,null,null,null,null,null,null,null,null,null,null,null,null,null,null,null,null,null,null,null,null,null,null,null,null,null,null,"certo só para 2018"]

{"sheet":"GJaM2B","index":8,"n_rows":2,"n_cols":36,"rows_kept":2,"cut":false,"hidden":true,"merged":[[26,1,49,7],[26,9,49,15],[1,1,24,7],[1,9,24,15],[0,0,0,9],[0,10,0,11],[0,14,0,15]]}
[{"$f":"TA!$A$26 & \" (Acumulado Mensal)\"","v":"TRF2 - Processos JULGADOS em 2019 (Acumulado Mensal)"},null,null,null,null,null,null,null,null,null,"no Ano de:  "]
[null,null,null,null,null,null,null,null,null,null,null,null,null,null,null,null,null,null,null,null,null,null,null,null,null,null,null,null,null,null,null,null,null,null,null,"errado para 2018"]

{"sheet":"GJaM3B18","index":9,"n_rows":2,"n_cols":36,"rows_kept":2,"cut":false,"hidden":true,"merged":[[26,1,49,7],[26,9,49,15],[0,0,0,9],[0,10,0,11],[0,14,0,15],[1,1,24,7],[1,9,24,15]]}
[{"$f":"TA!$A$26 & \" (Acumulado Mensal)\"","v":"TRF2 - Processos JULGADOS em 2019 (Acumulado Mensal)"},null,null,null,null,null,null,null,null,null,"no Ano de:  "]
[null,null,null,null,null,null,null,null,null,null,null,null,null,null,null,null,null,null,null,null,null,null,null,null,null,null,null,null,null,null,null,null,null,null,null,"certo só para 2018"]

{"sheet":"PvAT","index":10,"n_rows":51,"n_cols":43,"rows_kept":51,"cut":false,"hidden":true,"merged":[[49,0,49,16],[50,0,50,16],[40,1,42,1],[48,0,48,16],[45,0,45,16],[46,0,46,16],[0,1,2,5],[0,12,2,14],[8,2,9,2],[33,1,35,1],[21,1,22,1],[8,11,9,11],[8,12,9,12],[27,1,28,1],[30,1,31,1],[8,10,9,10],[24,1,25,1],[7,5,7,8],[6,9,7,10],[8,9,9,9],[8,13,9,13],[37,1,38,1],[8,14,9,14],[8,15,9,15],[6,3,7,4],[4,4,4,5],[6,5,6,8],[8,3,9,3],[8,4,9,4],[8,5,9,5],[8,6,9,6],[8,7,9,7],[8,8,9,8],[18,1,19,1]]}
[]
[]
[]
[]
[null,null,null,null,"Tipo Processo",null,"Judicial"]
[]
[null,null,null,"(*) 1ª Distribuição no TRF",null,"(*) Distribuídos para o Apolo (Origem: Sistema Siapro)",null,null,null,"Total de Distribuídos\nnas Bases de Dados"]
[null,null,null,null,null,"(*) Migrados para o Eproc (Origem: Sistema Apolo)"]
[null,null,"Base de Dados do Processo","(A)","% Variação Anual","Por Migração (M)","% Variação Anual","Por Virtualização (V)","% Variação Anual","(A)+(M)+(V)","% Variação Anual","Julgados\n(TJI)","% Variação Anual","Saldo Atual\n(TRAM)","% Variação Anual da\nTramitação","(*) Tram. Ajustada\n(TA)",null,null,null,null,null,null,null,null,null,null,null,null,null,null,null,null,null,null,null,"A",null,null,null,null,"E"]
[null,"Ano",null,null,null,null,null,null,null,null,null,null,null,null,null,null,null,null,null,null,null,null,null,null,null,null,null,null,null,null,null,null,null,null,null,"A","J","TR",null,null,"A","J","TR"]
[null,2005,"Siapro",{"$f":"SUMIF(Dados!$A$86:$G$171,$B11,Dados!$C$86:$C$171)","v":34979},null,null,null,null,null,{"$f":"D11","v":34979},null,{"$f":"SUMIF(Dados!$A$86:$G$171,$B11,Dados!$D$86:$D$171)","v":47264},null,{"$f":"VLOOKUP($B11&\"Dezembro\",Dados!$A$86:$G$171,6,0)","v":115794},null,{"$f":"VLOOKUP($B11&\"Dezembro\",Dados!$A$86:$G$171,7,0)","v":115688}]
[null,2006,"Siapro",{"$f":"SUMIF(Dados!$A$86:$G$171,$B12,Dados!$C$86:$C$171)","v":37963},{"$f":"IF($D11=0,\"\",($D12/$D11)-1)","v":8.5308327853855115E-2},null,null,null,null,{"$f":"D12","v":37963},{"$f":"IF($J11=0,\"\",($J12/$J11)-1)","v":8.5308327853855115E-2},{"$f":"SUMIF(Dados!$A$86:$G$171,$B12,Dados!$D$86:$D$171)","v":61131},{"$f":"IF($L11=0,\"\",($L12/$L11)-1)","v":0.29339454976303325},{"$f":"VLOOKUP($B12&\"Dezembro\",Dados!$A$86:$G$171,6,0)","v":105290},{"$f":"IF($N11=0,\"\",($N12/$N11)-1)","v":-9.071281758985783E-2},{"$f":"VLOOKUP($B12&\"Dezembro\",Dados!$A$86:$G$171,7,0)","v":105185},null,null,null,null,null,null,null,null,null,null,null,null,null,null,null,null,null,null,null,"0","0","0",null,null,"0","0","0"]
[null,2007,"Siapro",{"$f":"SUMIF(Dados!$A$86:$G$171,$B13,Dados!$C$86:$C$171)","v":42394},0.1167189105181361,null,null,null,null,{"$f":"D13","v":42394},{"$f":"IF($J12=0,\"\",($J13/$J12)-1)","v":0.1167189105181361},{"$f":"SUMIF(Dados!$A$86:$G$171,$B13,Dados!$D$86:$D$171)","v":63812},4.3856635749456085E-2,{"$f":"VLOOKUP($B13&\"Dezembro\",Dados!$A$86:$G$171,6,0)","v":99861},-5.1562351600341949E-2,{"$f":"VLOOKUP($B13&\"Dezembro\",Dados!$A$86:$G$171,7,0)","v":99790},null,null,null,null,null,null,null,null,null,null,null,null,null,null,null,null,null,null,null,"0","0","0",null,null,"0","0","0"]
[null,2008,"Siapro",{"$f":"SUMIF(Dados!$A$86:$G$171,$B14,Dados!$C$86:$C$171)","v":47906},0.1300183988300232,null,null,null,null,47906,{"$f":"IF($J13=0,\"\",($J14/$J13)-1)","v":0.1300183988300232},{"$f":"SUMIF(Dados!$A$86:$G$171,$B14,Dados!$D$86:$D$171)","v":68405},7.1977057606719796E-2,{"$f":"VLOOKUP($B14&\"Dezembro\",Dados!$A$86:$G$171,6,0)","v":93504},-6.3658485294559419E-2,{"$f":"VLOOKUP($B14&\"Dezembro\",Dados!$A$86:$G$171,7,0)","v":92985},null,null,null,null,null,null,null,null,null,null,null,null,null,null,null,null,null,null,null,"0","0","0",null,null,"0","0","0"]
[null,2009,"Siapro",{"$f":"SUMIF(Dados!$A$86:$G$171,$B15,Dados!$C$86:$C$171)","v":48724},1.7075105414770642E-2,null,null,null,null,48724,1.7075105414770642E-2,{"$f":"SUMIF(Dados!$A$86:$G$171,$B15,Dados!$D$86:$D$171)","v":73000},6.7173452233023845E-2,{"$f":"VLOOKUP($B15&\"Dezembro\",Dados!$A$86:$G$171,6,0)","v":90849},-2.839450718685832E-2,{"$f":"VLOOKUP($B15&\"Dezembro\",Dados!$A$86:$G$171,7,0)","v":89584},null,null,null,null,null,null,null,null,null,null,null,null,null,null,null,null,null,null,null,"0","0","0",null,null,"0","0","0"]
{"$rows_left_out":37}
{"sheet":"GP3AT","index":11,"n_rows":2,"n_cols":7,"rows_kept":2,"cut":false,"hidden":true,"merged":[[18,1,32,5],[18,7,32,11],[18,13,32,17],[34,1,48,5],[34,7,48,11],[34,13,48,17],[2,1,16,5],[2,7,16,11],[2,13,16,17],[1,6,1,12],[0,0,0,18]]}
["TRF2 - Gráficos de Pizza Comparativo Anual entre Processos Siapro, Apolo e Eproc"]
[null,null,null,null,null,null,"Selecione o Triênio"]

{"sheet":"GTvAT","index":12,"n_rows":1,"n_cols":1,"rows_kept":1,"cut":false,"hidden":true,"merged":[[0,0,0,13],[1,1,24,7],[1,9,24,15],[26,1,49,7],[26,9,49,15]]}
[{"$f":"TA!$F$24","v":"TRF2 - Série HISTÓRICA da TRAMITAÇÃO (DEZEMBRO)"}]

{"sheet":"GDvAT","index":13,"n_rows":1,"n_cols":1,"rows_kept":1,"cut":false,"hidden":true,"merged":[[0,0,0,13],[1,1,24,7],[1,9,24,15],[26,1,49,7],[26,9,49,15]]}
[{"$f":"TA!$F$25","v":"TRF2 - Série HISTÓRICA da 1ª DISTRIBUICÃO (TOTAL)"}]

{"sheet":"GJvAT","index":14,"n_rows":1,"n_cols":1,"rows_kept":1,"cut":false,"hidden":true,"merged":[[0,0,0,13],[1,1,24,7],[1,9,24,15],[26,1,49,7],[26,9,49,15]]}
[{"$f":"TA!$F$26","v":"TRF2 - Série HISTÓRICA de JULGADOS (TOTAL)"}]

{"sheet":"TA","index":15,"n_rows":69,"n_cols":13,"rows_kept":69,"cut":false,"hidden":true,"merged":[[0,5,0,6],[17,5,17,6],[17,7,17,8],[17,9,17,10],[8,5,10,5],[11,5,13,5],[14,5,16,5]]}
["Anos","AnosSA","Meses","Meses Abrev","Trienio","IPC",null,null,null,null,"VER CÉLULAS AJ (all)",null,1]
[2006,2013,"JANEIRO","Jan","2013 | 2014 | 2015","Mês Public","Ano Public",null,null,null,null,null,2]
[2007,2014,"FEVEREIRO","Fev","2014 | 2015 | 2016",12,2019,null,null,null,null,null,3]
[2008,2015,"MARÇO","Mar","2015 | 2016 | 2017",{"$f":"INDEX(ListaMeses,F3)","v":"Dezembro"},"F5, G23 a G25 | PvAnualT no AnoAtual ident MêsAtual E pesq TRAM e TA",null,null,null,null,null,4]
[2009,2016,"ABRIL","Abr","2016 | 2017 | 2018",{"$f":"IF($E$7<5,\"Dezembro\",$F$4)","v":"Dezembro"},"J15, J16, K15 e K16 (TRAM e TA último ano abaixo)",null,null,null,null,null,5]
[2010,2017,"MAIO","Mai","2017 | 2018 | 2019",{"$f":"IF($E$7<5,\"Dezembro/\",F5&\"/\")","v":"Dezembro/"},"F7 (Texto TRAM último ano abaixo)",null,null,null,null,null,6]
[2011,2018,"JUNHO","Jun",5,{"$f":"IF($E$7<5,\"em \",\"até \"&F6)","v":"até Dezembro/"},"L16 e L17 (Texto DISTR e JULG último ano abaixo)",null,null,null,null,null,7]
[2012,2019,"JULHO","Jul","only Tram (pcausa2018)",null,null,"D","J","TR","TA",null,8]
[null,null,"AGOSTO","Ago",{"$f":"IF($F$9>2017,\"Eproc\",\"Siapro\")","v":"Siapro"},{"$f":"INDEX(ListaAnosSA,$E$7)","v":2017},{"$f":"IF($F$9>2018,\"Eproc\",IF($F$9=2018,\"Eproc + Siapro\",\"Siapro\"))","v":"Siapro"},{"$f":"SUMIF(Dados!$A$2:$G$171,$F$9,Dados!$C$2:$C$171)","v":0},{"$f":"SUMIF(Dados!$A$2:$G$171,$F$9,Dados!$D$2:$D$171)","v":7604},{"$f":"VLOOKUP($F$9&\"Dezembro\",Dados!$A$2:$G$171,6,0)","v":8724},{"$f":"VLOOKUP($F$9&\"Dezembro\",Dados!$A$2:$G$171,7,0)","v":8246},{"$f":"TEXT(J11,\"#.##0\")&\"  Processos em TRAMITAÇÃO em Dezembro/\"&F9","v":"89.249  Processos em TRAMITAÇÃO em Dezembro/2017"}]
[null,null,"SETEMBRO","Set","Apolo",null,"Apolo",{"$f":"SUMIF(Dados!$A$2:$G$171,$F$9,Dados!$G$2:$G$171)","v":42008},{"$f":"SUMIF(Dados!$A$2:$G$171,$F$9,Dados!$H$2:$H$171)","v":57866},{"$f":"VLOOKUP($F$9&\"Dezembro\",Dados!$A$2:$K$171,10,0)","v":80525},{"$f":"VLOOKUP($F$9&\"Dezembro\",Dados!$A$2:$K$171,11,0)","v":76077},{"$f":"TEXT(H11,\"#.##0\")&\"  Processos 1ª DISTRIBUIÇÃO em \"&F9","v":"42.008  Processos 1ª DISTRIBUIÇÃO em 2017"}]
[null,null,"OUTUBRO","Out","Total",null,"Total",{"$f":"H9+H10","v":42008},{"$f":"I9+I10","v":65470},{"$f":"J9+J10","v":89249},{"$f":"K9+K10","v":84323},{"$f":"TEXT(I11,\"#.##0\")&\"  Processos JULGADOS em \"&F9","v":"65.470  Processos JULGADOS em 2017"}]
[null,null,"NOVEMBRO","Nov",{"$f":"IF($F$12>2017,\"Eproc\",\"Siapro\")","v":"Eproc"},{"$f":"$F$9+1","v":2018},{"$f":"IF($F$12>2018,\"Eproc\",IF($F$12=2018,\"Eproc + Siapro\",\"Siapro\"))","v":"Eproc + Siapro"},{"$f":"SUMIF(Dados!$A$2:$G$171,$F$12,Dados!$C$2:$C$171)","v":4245},{"$f":"SUMIF(Dados!$A$2:$G$171,$F$12,Dados!$D$2:$D$171)","v":1901},{"$f":"VLOOKUP($F$12&\"Dezembro\",Dados!$A$2:$G$171,6,0)","v":4154},{"$f":"VLOOKUP($F$12&\"Dezembro\",Dados!$A$2:$G$171,7,0)","v":4149},{"$f":"TEXT(J14,\"#.##0\")&\"  Processos em TRAMITAÇÃO em Dezembro/\"&F12","v":"82.003  Processos em TRAMITAÇÃO em Dezembro/2018"}]
[null,null,"Dezembro","Dez","Apolo",null,"Apolo",{"$f":"SUMIF(Dados!$A$2:$G$171,$F$12,Dados!$G$2:$G$171)","v":36881},{"$f":"SUMIF(Dados!$A$2:$G$171,$F$12,Dados!$H$2:$H$171)","v":64352},{"$f":"VLOOKUP($F$12&\"Dezembro\",Dados!$A$2:$K$171,10,0)","v":77849},{"$f":"VLOOKUP($F$12&\"Dezembro\",Dados!$A$2:$K$171,11,0)","v":71773},{"$f":"TEXT(H14,\"#.##0\")&\"  Processos 1ª DISTRIBUIÇÃO em \"&F12","v":"41.126  Processos 1ª DISTRIBUIÇÃO em 2018"}]
[null,null,null,null,"Total",null,"Total",{"$f":"H12+H13","v":41126},{"$f":"I12+I13","v":66253},{"$f":"J12+J13","v":82003},{"$f":"K12+K13","v":75922},{"$f":"TEXT(I14,\"#.##0\")&\"  Processos JULGADOS em \"&F12","v":"66.253  Processos JULGADOS em 2018"}]
[null,null,null,null,{"$f":"IF($F$15>2017,\"Eproc\",\"Siapro\")","v":"Eproc"},{"$f":"$F$9+2","v":2019},{"$f":"IF($F$15>2018,\"Eproc\",IF($F$15=2018,\"Eproc + Siapro\",\"Siapro\"))","v":"Eproc"},{"$f":"SUMIF(Dados!$A$2:$G$171,$F$15,Dados!$C$2:$C$171)","v":35620},{"$f":"SUMIF(Dados!$A$2:$G$171,$F$15,Dados!$D$2:$D$171)","v":17099},{"$f":"VLOOKUP($F$15&$F$5,Dados!$A$2:$G$171,6,0)","v":31489},{"$f":"VLOOKUP($F$15&$F$5,Dados!$A$2:$G$171,7,0)","v":31131},{"$f":"TEXT(J17,\"#.##0\")&\"  Processos em TRAMITAÇÃO em Dezembro/\"&F15","v":"83.221  Processos em TRAMITAÇÃO em Dezembro/2019"}]
{"$rows_left_out":55}
{"sheet":"Dados","index":16,"n_rows":191,"n_cols":30,"rows_kept":191,"cut":false,"hidden":true,"merged":[]}
["Coluna Auxiliar1","Ano","Mês","Dist._sE\n","Julg._sE\n","TRAM_sE\n","TA_sE\n","Dist._A\n","Julg._A\n","TRAM_A\n","TA_A\n","Dist._sE\nAcum","Julg._sE\nAcum","Dist._A\nAcum","Julg._A\nAcum","M_A\n","M_A Acum","V_A\n","V_A Acum","D+M+V\nAcum","M_E\n","M_E Acum","Dse","Jse","TRSe","TASe","DA","JA ","TRA","TAA"]
[{"$f":"B2&C2","v":"2019Janeiro"},2019,"Janeiro",1464,86,5594,5587,2228,{"$f":"2216-1","v":2215},77634,71367,{"$f":"D2","v":1464},{"$f":"E2","v":86},{"$f":"H2","v":2228},{"$f":"I2","v":2215},0,{"$f":"P2","v":0},7,{"$f":"R2","v":7},{"$f":"N2+Q2+S2","v":2235},0,{"$f":"U2","v":0}]
["2019Fevereiro",2019,"Fevereiro",2070,368,7517,7502,1905,{"$f":"6509+1","v":6510},75155,68481,{"$f":"L2+D3","v":3534},{"$f":"M2+E3","v":454},{"$f":"N2+H3","v":4133},8725,0,{"$f":"Q2+P3","v":0},23,{"$f":"S2+R3","v":30},4163,0,{"$f":"V2+U3","v":0}]
["2019Março",2019,"Março",1711,327,9051,{"$f":"9033+2","v":9035},1203,{"$f":"3666+1","v":3667},72009,64860,5245,781,5336,12392,0,0,15,45,5381,0,0]
["2019Abril",2019,"Abril",2261,540,{"$f":"11183-2","v":11181},11162,1292,4327,71510,64333,7506,1321,6628,16719,0,0,15,60,6688,0,0]
["2019Maio",2019,"Maio",3218,{"$f":"602-1","v":601},13949,13919,1391,{"$f":"5071+3","v":5074},68646,61176,10724,1922,8019,21793,0,0,15,75,8094,0,0]
["2019Junho",2019,"Junho",2876,822,16463,16417,840,{"$f":"5255-1+1","v":5255},66611,58992,13600,2744,8859,27048,0,0,9,84,8943,0,0]
["2019Julho",2019,"Julho",{"$f":"3793-1","v":3792},{"$f":"1591-1","v":1590},{"$f":"19627+2","v":19629},{"$f":"19569+2","v":19571},913,{"$f":"5011+1+1-1","v":5012},{"$f":"64135-2","v":64133},{"$f":"56030-2","v":56028},17392,4334,9772,32060,0,0,11,95,9867,0,0]
["2019Agosto",2019,"Agosto",3935,{"$f":"1759-2","v":1757},{"$f":"22758+1","v":22759},{"$f":"22680+1","v":22681},732,{"$f":"4115+1-6","v":4110},{"$f":"61220-8","v":61212},{"$f":"52669-8","v":52661},21327,6091,10504,36170,0,0,23,118,10622,0,0]
["2019Setembro",2019,"Setembro",{"$f":"4041-2","v":4039},2270,{"$f":"25723-1","v":25722},{"$f":"25587-1","v":25586},558,4327,{"$f":"58452-13","v":58439},{"$f":"49548-13","v":49535},25366,8361,11062,40497,0,0,13,131,11193,0,0]
["2019Outubro",2019,"Outubro",{"$f":"4141-2","v":4139},{"$f":"2995-3","v":2992},{"$f":"28484-2","v":28482},{"$f":"28259-2","v":28257},552,{"$f":"3549-1-5","v":3543},{"$f":"55492-13","v":55479},{"$f":"46516-13","v":46503},29505,11353,11614,44040,0,0,14,145,11759,0,0]
["2019Novembro",2019,"Novembro",{"$f":"3519-2","v":3517},{"$f":"2840-1","v":2839},{"$f":"30667-4","v":30663},{"$f":"30377-4","v":30373},357,{"$f":"3568+1+1-2","v":3568},{"$f":"53256-8","v":53248},{"$f":"43713-8","v":43705},33022,14192,11971,47608,0,0,17,162,12133,2,2]
["2019Dezembro",2019,"Dezembro",{"$f":"2599-1","v":2598},2907,{"$f":"31494-5","v":31489},{"$f":"31136-5","v":31131},282,3346,{"$f":"51740-8","v":51732},{"$f":"42137-8","v":42129},35620,17099,12253,50954,0,0,10,172,12425,0,2,{"$f":"SUM(D2:D13)","v":35620},{"$f":"SUM(E2:E13)","v":17099},{"$f":"SUM(F2:F13)","v":222499},{"$f":"SUM(G2:G13)","v":221221},{"$f":"SUM(H2:H13)","v":12253},{"$f":"SUM(I2:I13)","v":50954},{"$f":"SUM(J2:J13)","v":775808},{"$f":"SUM(K2:K13)","v":679770}]
[{"$f":"B14&C14","v":"2018Janeiro"},2018,"Janeiro",0,360,8523,8045,2629,2110,81555,77335,{"$f":"D14","v":0},{"$f":"E14","v":360},{"$f":"H14","v":2629},{"$f":"I14","v":2110},4,{"$f":"P14","v":4},327,{"$f":"R14","v":327},{"$f":"N14+Q14+S14","v":2960}]
["2018Fevereiro",2018,"Fevereiro",0,755,8115,7646,2845,4617,81439,77175,{"$f":"L14+D15","v":0},{"$f":"M14+E15","v":1115},{"$f":"N14+H15","v":5474},{"$f":"O14+I15","v":6727},35,{"$f":"Q14+P15","v":39},98,{"$f":"S14+R15","v":425},5938]
{"$rows_left_out":177}
{"sheet":"DadosTD","index":17,"n_rows":242,"n_cols":9,"rows_kept":242,"cut":false,"hidden":true,"merged":[]}
["Ano","Mês","Base","A","M","V","Julg","TRAM","TA"]
[2019,"Janeiro","Eproc",1464,0,0,86,5594,5587]
[2019,"Fevereiro","Eproc",2070,0,0,368,7517,7502]
[2019,"Março","Eproc",1711,0,0,327,9051,9035]
[2019,"Abril","Eproc",2261,0,0,540,11181,11162]
[2019,"Maio","Eproc",3218,0,0,601,13949,13919]
[2019,"Junho","Eproc",2876,0,0,822,16463,16417]
[2019,"Julho","Eproc",3792,0,0,1590,19629,19571]
[2019,"Agosto","Eproc",3935,0,0,1757,22759,22681]
[2019,"Setembro","Eproc",4039,0,0,2270,25722,25586]
[2019,"Outubro","Eproc",4139,0,0,2992,28482,28257]
[2019,"Novembro","Eproc",3517,2,0,2839,30663,30373]
[2019,"Dezembro","Eproc",2598,0,0,2907,31489,31131]
[2019,"Janeiro","Apolo",2228,0,7,2215,77634,71367]
[2019,"Fevereiro","Apolo",1905,0,23,6510,75155,68481]
{"$rows_left_out":227}